{"text_format":"1","workbook":"xlsx","n_sheets":13,"sheets":["Notice","Feuil1","FLOODMETER","LXM","BES","CC Page LXM","CC Page BES","FLOOD","TRAQUE","DATA BES","DATA LXM","DATA COMMON","DATA TRAQUE"],"not_rendered":{"charts":0,"images":0,"macros":1,"external_links":1,"defined_names":7,"comments":1,"pivot_tables":0},"unopened":[],"bounds":{"document_bytes":16777216,"sheet_cells":100000,"rows_first":2000,"rows_last":500,"rows_between":2000,"halvings":0,"cell_chars":16384,"cell_head_chars":4096},"cells_cut":0,"cells_raw":0,"read":"whole","date_system":"1900"}

{"sheet":"Notice","index":0,"n_rows":32,"n_cols":17,"rows_kept":32,"cut":false,"hidden":false,"merged":[[4,3,4,4]]}
[]
[null,"Préambule",null,"Ceci est un Excel. Donc vous pouvez modifier n'importe qu'elle case si ça vous arrange. Mais faut pas s'etonner si on fait au petit bonheur et qu'après ça marche plus"]
[null,null,null,"Il n'y a aucune connectivité internet dans ce fichier, donc aucune donnée ne sera récupérée et stockées quelque part."]
[]
[null,"Objectifs",null,"PETER DU LXM"]
[]
[null,"Outils à disposition",null,"Floodmeter"]
[null,null,null,"Calculateur de Flood multiples, affichant les heures de retours en fonction de l'heure du PC !, à vous de la paramétrer pour qu'elle soit identique à Fourmizzz"]
[null,null,null,null,"Pour ce faire :","Panneau de configuration",null,"==>","Date et Heure","==>","Temps Internet","==>","Modifier les paramètres",null,"==>","Serveur :","http://s3.fourmizzz.fr"]
[null,null,null,"Traqueur, pour voir tous les retours possibles d'une cible, en fonction de son tdp ou d'une heure de RC",null,null,null,null,null,null,null,null,null,null,null,"Ensuite valider"]
[]
[]
[null,"Onglets :",null,"Floodmeter",null,"C/c des RC de flood et calcule le total de tdc pris"]
[]
[null,null,null,"LXM",null,"Regroupe toutes les infos connues sur les LXM, à mettre à jour manuellement"]
[]
[null,null,null,"BES",null,"Regroupe les placements des joueurs BES"]
[]
[null,null,null,"CC Page LXM",null,"Copier coller en B2 la place de description LXM puis cliquer sur le bouton pour procéder à des calculs"]
[]
[null,null,null,"CC Page BES",null,"Copier coller en B2 la place de description BES puis cliquer sur le bouton pour procéder à des calculs"]
[]
[null,null,null,"FLOOD",null,"Simulateur de Flood Multiples, selection des cibles parmi celles à portée (LXM & BES) et affichage des heures d'arrivées"]
[]
[null,null,null,"TRAQUE",null,"Choisir un LXM, voir qui il a a portée, rentrer la date du dernier RC ou l'heure d'une sonde loge, un délai supplémentaire de relance si voulu; vous avez tous ses retours possibles. Enjoy :)"]
[]
[null,"Onglets masqués",null,"Osef",null,"Ne pas toucher, merci :)"]
[]
[null,"Copyright",null,"Formule de la VA",null,"Pompée sur le code source de Toolzzz xD"]
[null,null,null,"Reste",null,"Là c'est Rock !"]
[]
[null,null,null,"(Parce que la compil de données déjà existantes c'est plus rapide et plus efficace souvent ^^)"]

{"sheet":"Feuil1","index":1,"n_rows":0,"n_cols":0,"rows_kept":0,"cut":false,"hidden":true,"merged":[]}

{"sheet":"FLOODMETER","index":2,"n_rows":381,"n_cols":12,"rows_kept":381,"cut":false,"hidden":false,"merged":[[58,5,58,6],[10,1,10,3],[10,0,13,0],[11,1,11,3],[12,1,12,3],[13,1,13,3],[38,5,38,6],[48,5,48,6],[8,5,8,6],[18,5,18,6],[28,5,28,6],[178,5,178,6],[68,5,68,6],[78,5,78,6],[88,5,88,6],[98,5,98,6],[108,5,108,6],[118,5,118,6],[128,5,128,6],[138,5,138,6],[148,5,148,6],[158,5,158,6],[168,5,168,6],[298,5,298,6],[188,5,188,6],[198,5,198,6],[208,5,208,6],[218,5,218,6],[228,5,228,6],[238,5,238,6],[248,5,248,6],[258,5,258,6],[268,5,268,6],[278,5,278,6],[288,5,288,6],[368,5,368,6],[378,5,378,6],[308,5,308,6],[318,5,318,6],[328,5,328,6],[338,5,338,6],[348,5,348,6],[358,5,358,6]]}
["Coller les RC toutes les 10 cases. Exemple : A10, A20, A30 etc…"]
[null,null,null,null,null,"Constantes : ",null,null,null,null,null,"Total floodé :"]
[null,null,null,null,null,"Titre",29,"Initiaux",null,null,null,{"$f":"SUM(J:J)","v":28244511}]
[null,null,null,null,null,"Corps",88,25]
[]
[]
[]
[]
[null,null,null,null,null,"Décryptage"]
["Fourmizzz","13/04/13 19h17","Terrain de chasse de Panda capturé",null,null,{"$f":"LEN(C10)","v":34},{"$f":"F10-$G$3","v":5},null,"Quantité floodée :",{"$f":"IFERROR(VALUE(MID(B12,$H$4,G11)),0)","v":28244511}]
[null,null,null,null,null,{"$f":"LEN(B12)","v":104},{"$f":"F11-$G$4-G10","v":11}]
[null,"Vos fourmis ont conquis 28 244 511 cm2 lors de leur dernière bataille. Ces terres appartenaient à Panda."]
[]
[null,"Supprimer"]
[]
[]
[]
[]
[null,null,null,null,null,"Décryptage"]
[null,null,null,null,null,{"$f":"LEN(C20)","v":0},{"$f":"F20-$G$3","v":-29},null,"Quantité floodée :",{"$f":"IFERROR(VALUE(MID(B22,$H$4,G21)),0)","v":0}]
[null,null,null,null,null,{"$f":"LEN(B22)","v":0},{"$f":"F21-$G$4-G20","v":-59}]
[]
[]
[]
[]
[]
[]
[]
[null,null,null,null,null,"Décryptage"]
[null,null,null,null,null,{"$f":"LEN(C30)","v":0},{"$f":"F30-$G$3","v":-29},null,"Quantité floodée :",{"$f":"IFERROR(VALUE(MID(B32,$H$4,G31)),0)","v":0}]
[null,null,null,null,null,{"$f":"LEN(B32)","v":0},{"$f":"F31-$G$4-G30","v":-59}]
[]
[]
[]
[]
[]
[]
[]
[null,null,null,null,null,"Décryptage"]
[null,null,null,null,null,{"$f":"LEN(C40)","v":0},{"$f":"F40-$G$3","v":-29},null,"Quantité floodée :",{"$f":"IFERROR(VALUE(MID(B42,$H$4,G41)),0)","v":0}]
[null,null,null,null,null,{"$f":"LEN(B42)","v":0},{"$f":"F41-$G$4-G40","v":-59}]
[]
[]
[]
[]
[]
[]
[]
[null,null,null,null,null,"Décryptage"]
[null,null,null,null,null,{"$f":"LEN(C50)","v":0},{"$f":"F50-$G$3","v":-29},null,"Quantité floodée :",{"$f":"IFERROR(VALUE(MID(B52,$H$4,G51)),0)","v":0}]
[null,null,null,null,null,{"$f":"LEN(B52)","v":0},{"$f":"F51-$G$4-G50","v":-59}]
[]
[]
[]
[]
[]
[]
[]
[null,null,null,null,null,"Décryptage"]
[null,null,null,null,null,{"$f":"LEN(C60)","v":0},{"$f":"F60-$G$3","v":-29},null,"Quantité floodée :",{"$f":"IFERROR(VALUE(MID(B62,$H$4,G61)),0)","v":0}]
[null,null,null,null,null,{"$f":"LEN(B62)","v":0},{"$f":"F61-$G$4-G60","v":-59}]
[]
[]
[]
[]
[]
[]
[]
[null,null,null,null,null,"Décryptage"]
[null,null,null,null,null,{"$f":"LEN(C70)","v":0},{"$f":"F70-$G$3","v":-29},null,"Quantité floodée :",{"$f":"IFERROR(VALUE(MID(B72,$H$4,G71)),0)","v":0}]
[null,null,null,null,null,{"$f":"LEN(B72)","v":0},{"$f":"F71-$G$4-G70","v":-59}]
[]
[]
[]
[]
[]
[]
[]
[null,null,null,null,null,"Décryptage"]
[null,null,null,null,null,{"$f":"LEN(C80)","v":0},{"$f":"F80-$G$3","v":-29},null,"Quantité floodée :",{"$f":"IFERROR(VALUE(MID(B82,$H$4,G81)),0)","v":0}]
[null,null,null,null,null,{"$f":"LEN(B82)","v":0},{"$f":"F81-$G$4-G80","v":-59}]
[]
[]
[]
[]
[]
[]
[]
[null,null,null,null,null,"Décryptage"]
[null,null,null,null,null,{"$f":"LEN(C90)","v":0},{"$f":"F90-$G$3","v":-29},null,"Quantité floodée :",{"$f":"IFERROR(VALUE(MID(B92,$H$4,G91)),0)","v":0}]
[null,null,null,null,null,{"$f":"LEN(B92)","v":0},{"$f":"F91-$G$4-G90","v":-59}]
[]
[]
[]
[]
[]
[]
[]
[null,null,null,null,null,"Décryptage"]
[null,null,null,null,null,{"$f":"LEN(C100)","v":0},{"$f":"F100-$G$3","v":-29},null,"Quantité floodée :",{"$f":"IFERROR(VALUE(MID(B102,$H$4,G101)),0)","v":0}]
[null,null,null,null,null,{"$f":"LEN(B102)","v":0},{"$f":"F101-$G$4-G100","v":-59}]
[]
[]
[]
[]
[]
[]
[]
[null,null,null,null,null,"Décryptage"]
[null,null,null,null,null,{"$f":"LEN(C110)","v":0},{"$f":"F110-$G$3","v":-29},null,"Quantité floodée :",{"$f":"IFERROR(VALUE(MID(B112,$H$4,G111)),0)","v":0}]
[null,null,null,null,null,{"$f":"LEN(B112)","v":0},{"$f":"F111-$G$4-G110","v":-59}]
[]
[]
[]
[]
[]
[]
[]
[null,null,null,null,null,"Décryptage"]
[null,null,null,null,null,{"$f":"LEN(C120)","v":0},{"$f":"F120-$G$3","v":-29},null,"Quantité floodée :",{"$f":"IFERROR(VALUE(MID(B122,$H$4,G121)),0)","v":0}]
[null,null,null,null,null,{"$f":"LEN(B122)","v":0},{"$f":"F121-$G$4-G120","v":-59}]
[]
[]
[]
[]
[]
[]
[]
[null,null,null,null,null,"Décryptage"]
[null,null,null,null,null,{"$f":"LEN(C130)","v":0},{"$f":"F130-$G$3","v":-29},null,"Quantité floodée :",{"$f":"IFERROR(VALUE(MID(B132,$H$4,G131)),0)","v":0}]
[null,null,null,null,null,{"$f":"LEN(B132)","v":0},{"$f":"F131-$G$4-G130","v":-59}]
[]
[]
[]
[]
[]
[]
[]
[null,null,null,null,null,"Décryptage"]
[null,null,null,null,null,{"$f":"LEN(C140)","v":0},{"$f":"F140-$G$3","v":-29},null,"Quantité floodée :",{"$f":"IFERROR(VALUE(MID(B142,$H$4,G141)),0)","v":0}]
[null,null,null,null,null,{"$f":"LEN(B142)","v":0},{"$f":"F141-$G$4-G140","v":-59}]
[]
[]
[]
[]
[]
[]
[]
[null,null,null,null,null,"Décryptage"]
[null,null,null,null,null,{"$f":"LEN(C150)","v":0},{"$f":"F150-$G$3","v":-29},null,"Quantité floodée :",{"$f":"IFERROR(VALUE(MID(B152,$H$4,G151)),0)","v":0}]
[null,null,null,null,null,{"$f":"LEN(B152)","v":0},{"$f":"F151-$G$4-G150","v":-59}]
[]
[]
[]
[]
[]
[]
[]
[null,null,null,null,null,"Décryptage"]
[null,null,null,null,null,{"$f":"LEN(C160)","v":0},{"$f":"F160-$G$3","v":-29},null,"Quantité floodée :",{"$f":"IFERROR(VALUE(MID(B162,$H$4,G161)),0)","v":0}]
[null,null,null,null,null,{"$f":"LEN(B162)","v":0},{"$f":"F161-$G$4-G160","v":-59}]
[]
[]
[]
[]
[]
[]
[]
[null,null,null,null,null,"Décryptage"]
[null,null,null,null,null,{"$f":"LEN(C170)","v":0},{"$f":"F170-$G$3","v":-29},null,"Quantité floodée :",{"$f":"IFERROR(VALUE(MID(B172,$H$4,G171)),0)","v":0}]
[null,null,null,null,null,{"$f":"LEN(B172)","v":0},{"$f":"F171-$G$4-G170","v":-59}]
[]
[]
[]
[]
[]
[]
[]
[null,null,null,null,null,"Décryptage"]
[null,null,null,null,null,{"$f":"LEN(C180)","v":0},{"$f":"F180-$G$3","v":-29},null,"Quantité floodée :",{"$f":"IFERROR(VALUE(MID(B182,$H$4,G181)),0)","v":0}]
[null,null,null,null,null,{"$f":"LEN(B182)","v":0},{"$f":"F181-$G$4-G180","v":-59}]
[]
[]
[]
[]
[]
[]
[]
[null,null,null,null,null,"Décryptage"]
[null,null,null,null,null,{"$f":"LEN(C190)","v":0},{"$f":"F190-$G$3","v":-29},null,"Quantité floodée :",{"$f":"IFERROR(VALUE(MID(B192,$H$4,G191)),0)","v":0}]
[null,null,null,null,null,{"$f":"LEN(B192)","v":0},{"$f":"F191-$G$4-G190","v":-59}]
[]
[]
[]
[]
[]
[]
[]
[null,null,null,null,null,"Décryptage"]
[null,null,null,null,null,{"$f":"LEN(C200)","v":0},{"$f":"F200-$G$3","v":-29},null,"Quantité floodée :",{"$f":"IFERROR(VALUE(MID(B202,$H$4,G201)),0)","v":0}]
[null,null,null,null,null,{"$f":"LEN(B202)","v":0},{"$f":"F201-$G$4-G200","v":-59}]
[]
[]
[]
[]
[]
[]
[]
[null,null,null,null,null,"Décryptage"]
[null,null,null,null,null,{"$f":"LEN(C210)","v":0},{"$f":"F210-$G$3","v":-29},null,"Quantité floodée :",{"$f":"IFERROR(VALUE(MID(B212,$H$4,G211)),0)","v":0}]
[null,null,null,null,null,{"$f":"LEN(B212)","v":0},{"$f":"F211-$G$4-G210","v":-59}]
[]
[]
[]
[]
[]
[]
[]
[null,null,null,null,null,"Décryptage"]
[null,null,null,null,null,{"$f":"LEN(C220)","v":0},{"$f":"F220-$G$3","v":-29},null,"Quantité floodée :",{"$f":"IFERROR(VALUE(MID(B222,$H$4,G221)),0)","v":0}]
[null,null,null,null,null,{"$f":"LEN(B222)","v":0},{"$f":"F221-$G$4-G220","v":-59}]
[]
[]
[]
[]
[]
[]
[]
[null,null,null,null,null,"Décryptage"]
[null,null,null,null,null,{"$f":"LEN(C230)","v":0},{"$f":"F230-$G$3","v":-29},null,"Quantité floodée :",{"$f":"IFERROR(VALUE(MID(B232,$H$4,G231)),0)","v":0}]
[null,null,null,null,null,{"$f":"LEN(B232)","v":0},{"$f":"F231-$G$4-G230","v":-59}]
[]
[]
[]
[]
[]
[]
[]
[null,null,null,null,null,"Décryptage"]
[null,null,null,null,null,{"$f":"LEN(C240)","v":0},{"$f":"F240-$G$3","v":-29},null,"Quantité floodée :",{"$f":"IFERROR(VALUE(MID(B242,$H$4,G241)),0)","v":0}]
[null,null,null,null,null,{"$f":"LEN(B242)","v":0},{"$f":"F241-$G$4-G240","v":-59}]
[]
[]
[]
[]
[]
[]
[]
[null,null,null,null,null,"Décryptage"]
[null,null,null,null,null,{"$f":"LEN(C250)","v":0},{"$f":"F250-$G$3","v":-29},null,"Quantité floodée :",{"$f":"IFERROR(VALUE(MID(B252,$H$4,G251)),0)","v":0}]
[null,null,null,null,null,{"$f":"LEN(B252)","v":0},{"$f":"F251-$G$4-G250","v":-59}]
[]
[]
[]
[]
[]
[]
[]
[null,null,null,null,null,"Décryptage"]
[null,null,null,null,null,{"$f":"LEN(C260)","v":0},{"$f":"F260-$G$3","v":-29},null,"Quantité floodée :",{"$f":"IFERROR(VALUE(MID(B262,$H$4,G261)),0)","v":0}]
[null,null,null,null,null,{"$f":"LEN(B262)","v":0},{"$f":"F261-$G$4-G260","v":-59}]
[]
[]
[]
[]
[]
[]
[]
[null,null,null,null,null,"Décryptage"]
[null,null,null,null,null,{"$f":"LEN(C270)","v":0},{"$f":"F270-$G$3","v":-29},null,"Quantité floodée :",{"$f":"IFERROR(VALUE(MID(B272,$H$4,G271)),0)","v":0}]
[null,null,null,null,null,{"$f":"LEN(B272)","v":0},{"$f":"F271-$G$4-G270","v":-59}]
[]
[]
[]
[]
[]
[]
[]
[null,null,null,null,null,"Décryptage"]
[null,null,null,null,null,{"$f":"LEN(C280)","v":0},{"$f":"F280-$G$3","v":-29},null,"Quantité floodée :",{"$f":"IFERROR(VALUE(MID(B282,$H$4,G281)),0)","v":0}]
[null,null,null,null,null,{"$f":"LEN(B282)","v":0},{"$f":"F281-$G$4-G280","v":-59}]
[]
[]
[]
[]
[]
[]
[]
[null,null,null,null,null,"Décryptage"]
[null,null,null,null,null,{"$f":"LEN(C290)","v":0},{"$f":"F290-$G$3","v":-29},null,"Quantité floodée :",{"$f":"IFERROR(VALUE(MID(B292,$H$4,G291)),0)","v":0}]
[null,null,null,null,null,{"$f":"LEN(B292)","v":0},{"$f":"F291-$G$4-G290","v":-59}]
[]
[]
[]
[]
[]
[]
[]
[null,null,null,null,null,"Décryptage"]
[null,null,null,null,null,{"$f":"LEN(C300)","v":0},{"$f":"F300-$G$3","v":-29},null,"Quantité floodée :",{"$f":"IFERROR(VALUE(MID(B302,$H$4,G301)),0)","v":0}]
[null,null,null,null,null,{"$f":"LEN(B302)","v":0},{"$f":"F301-$G$4-G300","v":-59}]
[]
[]
[]
[]
[]
[]
[]
[null,null,null,null,null,"Décryptage"]
[null,null,null,null,null,{"$f":"LEN(C310)","v":0},{"$f":"F310-$G$3","v":-29},null,"Quantité floodée :",{"$f":"IFERROR(VALUE(MID(B312,$H$4,G311)),0)","v":0}]
[null,null,null,null,null,{"$f":"LEN(B312)","v":0},{"$f":"F311-$G$4-G310","v":-59}]
[]
[]
[]
[]
[]
[]
[]
[null,null,null,null,null,"Décryptage"]
[null,null,null,null,null,{"$f":"LEN(C320)","v":0},{"$f":"F320-$G$3","v":-29},null,"Quantité floodée :",{"$f":"IFERROR(VALUE(MID(B322,$H$4,G321)),0)","v":0}]
[null,null,null,null,null,{"$f":"LEN(B322)","v":0},{"$f":"F321-$G$4-G320","v":-59}]
[]
[]
[]
[]
[]
[]
[]
[null,null,null,null,null,"Décryptage"]
[null,null,null,null,null,{"$f":"LEN(C330)","v":0},{"$f":"F330-$G$3","v":-29},null,"Quantité floodée :",{"$f":"IFERROR(VALUE(MID(B332,$H$4,G331)),0)","v":0}]
[null,null,null,null,null,{"$f":"LEN(B332)","v":0},{"$f":"F331-$G$4-G330","v":-59}]
[]
[]
[]
[]
[]
[]
[]
[null,null,null,null,null,"Décryptage"]
[null,null,null,null,null,{"$f":"LEN(C340)","v":0},{"$f":"F340-$G$3","v":-29},null,"Quantité floodée :",{"$f":"IFERROR(VALUE(MID(B342,$H$4,G341)),0)","v":0}]
[null,null,null,null,null,{"$f":"LEN(B342)","v":0},{"$f":"F341-$G$4-G340","v":-59}]
[]
[]
[]
[]
[]
[]
[]
[null,null,null,null,null,"Décryptage"]
[null,null,null,null,null,{"$f":"LEN(C350)","v":0},{"$f":"F350-$G$3","v":-29},null,"Quantité floodée :",{"$f":"IFERROR(VALUE(MID(B352,$H$4,G351)),0)","v":0}]
[null,null,null,null,null,{"$f":"LEN(B352)","v":0},{"$f":"F351-$G$4-G350","v":-59}]
[]
[]
[]
[]
[]
[]
[]
[null,null,null,null,null,"Décryptage"]
[null,null,null,null,null,{"$f":"LEN(C360)","v":0},{"$f":"F360-$G$3","v":-29},null,"Quantité floodée :",{"$f":"IFERROR(VALUE(MID(B362,$H$4,G361)),0)","v":0}]
[null,null,null,null,null,{"$f":"LEN(B362)","v":0},{"$f":"F361-$G$4-G360","v":-59}]
[]
[]
[]
[]
[]
[]
[]
[null,null,null,null,null,"Décryptage"]
[null,null,null,null,null,{"$f":"LEN(C370)","v":0},{"$f":"F370-$G$3","v":-29},null,"Quantité floodée :",{"$f":"IFERROR(VALUE(MID(B372,$H$4,G371)),0)","v":0}]
[null,null,null,null,null,{"$f":"LEN(B372)","v":0},{"$f":"F371-$G$4-G370","v":-59}]
[]
[]
[]
[]
[]
[]
[]
[null,null,null,null,null,"Décryptage"]
[null,null,null,null,null,{"$f":"LEN(C380)","v":0},{"$f":"F380-$G$3","v":-29},null,"Quantité floodée :",{"$f":"IFERROR(VALUE(MID(B382,$H$4,G381)),0)","v":0}]
[null,null,null,null,null,{"$f":"LEN(B382)","v":0},{"$f":"F381-$G$4-G380","v":-59}]

{"sheet":"LXM","index":3,"n_rows":32,"n_cols":23,"rows_kept":32,"cut":false,"hidden":false,"merged":[]}
["Dernière MaJ",{"$f":"TODAY()","v":"2013-04-14"},null,"Mon tdc",431842364,null,"VA",25,null,"Pos perso:","x",16,"y",173]
[]
[" ","MAP","TDC","A portée ?","x","y","Distance","Temps","  ","BONUS","VA","Dôme","Loge","BT","Armes","Evo TDP","   ","RC","Vie Dôme","Vie Loge","Fdf","Def","Capa"]
["_Angel_",null,{"$f":"VLOOKUP(A4,'DATA LXM'!$A$35:$B$64,2)","v":45216292},{"$f":"IF(AND((C4<=(3*$E$1)),(C4>=(0.5*$E$1))),\"A PORTEE\",\" \")","v":" "},40,173,{"$f":"ROUNDUP(SQRT((LXM!$L$1-LXM!E4)^2+(LXM!$N$1-LXM!F4)^2),0)","v":24},{"$f":"CONCATENATE('DATA LXM'!D2,\"h\",'DATA LXM'!E2,\"min\",'DATA LXM'!F2,\"sec\")","v":"0h50min32sec"},null,null,24]
["_diablo_",null,{"$f":"VLOOKUP(A5,'DATA LXM'!$A$35:$B$64,2)","v":134710356}," ",5,173,{"$f":"ROUNDUP(SQRT((LXM!$L$1-LXM!E5)^2+(LXM!$N$1-LXM!F5)^2),0)","v":11},{"$f":"CONCATENATE('DATA LXM'!D3,\"h\",'DATA LXM'!E3,\"min\",'DATA LXM'!F3,\"sec\")","v":"0h23min36sec"},null,null,1,null,22,20,20,null,null,"Troupes en attaque:45 806 563 Jeunes Soldates Naines, 37 315 470 Soldates Naines, 15 335 232 Naines d'Elites, 34 954 414 Jeunes Soldates, 29 395 848 Soldates, 1 Concierge, 1 Concierge d'élite, 1 Artilleuse, 2 500 000 Artilleuses d'élites, 48 963 324 Soldates d'élites, 15 487 644 Tanks, 36 682 800 Tanks d'élites, 1 Tueuse, 1 Tueuse d'élite.\n"]
["_Wolverine_",null,{"$f":"VLOOKUP(A6,'DATA LXM'!$A$35:$B$64,2)","v":573345}," ",36,173,{"$f":"ROUNDUP(SQRT((LXM!$L$1-LXM!E6)^2+(LXM!$N$1-LXM!F6)^2),0)","v":20},{"$f":"CONCATENATE('DATA LXM'!D4,\"h\",'DATA LXM'!E4,\"min\",'DATA LXM'!F4,\"sec\")","v":"0h42min21sec"},null,null,1]
["4midiable",null,{"$f":"VLOOKUP(A7,'DATA LXM'!$A$35:$B$64,2)","v":1940203}," ",40,161,{"$f":"ROUNDUP(SQRT((LXM!$L$1-LXM!E7)^2+(LXM!$N$1-LXM!F7)^2),0)","v":27},{"$f":"CONCATENATE('DATA LXM'!D5,\"h\",'DATA LXM'!E5,\"min\",'DATA LXM'!F5,\"sec\")","v":"0h56min16sec"},null,null,1]
["AB64",null,{"$f":"VLOOKUP(A8,'DATA LXM'!$A$35:$B$64,2)","v":399362427},"A PORTEE",22,14,{"$f":"ROUNDUP(SQRT((LXM!$L$1-LXM!E8)^2+(LXM!$N$1-LXM!F8)^2),0)","v":160},{"$f":"CONCATENATE('DATA LXM'!D6,\"h\",'DATA LXM'!E6,\"min\",'DATA LXM'!F6,\"sec\")","v":"4h38min31sec"},null,null,1]
["Allerdyce",null,{"$f":"VLOOKUP(A9,'DATA LXM'!$A$35:$B$64,2)","v":511366515},"A PORTEE",9,172,{"$f":"ROUNDUP(SQRT((LXM!$L$1-LXM!E9)^2+(LXM!$N$1-LXM!F9)^2),0)","v":8},{"$f":"CONCATENATE('DATA LXM'!D7,\"h\",'DATA LXM'!E7,\"min\",'DATA LXM'!F7,\"sec\")","v":"0h15min15sec"},null,null,24,21,24,20,21,null,null,"Troupes en attaque:94 224 605 Jeunes Soldates Naines, 11 046 489 Soldates Naines, 664 456 Naines d'Elites, 43 575 635 Jeunes Soldates, 17 890 090 Soldates, 849 455 Artilleuses, 2 090 917 Artilleuses d'élites, 38 233 482 Soldates d'élites, 6 908 318 Tanks, 19 531 489 Tanks d'élites, 4 269 710 Tueuses, 11 475 316 Tueuses d'élites.\n"]
["bubulle",null,{"$f":"VLOOKUP(A10,'DATA LXM'!$A$35:$B$64,2)","v":3255300}," ",4,225,{"$f":"ROUNDUP(SQRT((LXM!$L$1-LXM!E10)^2+(LXM!$N$1-LXM!F10)^2),0)","v":54},{"$f":"CONCATENATE('DATA LXM'!D8,\"h\",'DATA LXM'!E8,\"min\",'DATA LXM'!F8,\"sec\")","v":"1h47min50sec"},null,null,1]
["creamy",null,{"$f":"VLOOKUP(A11,'DATA LXM'!$A$35:$B$64,2)","v":4979692}," ",39,176,{"$f":"ROUNDUP(SQRT((LXM!$L$1-LXM!E11)^2+(LXM!$N$1-LXM!F11)^2),0)","v":24},{"$f":"CONCATENATE('DATA LXM'!D9,\"h\",'DATA LXM'!E9,\"min\",'DATA LXM'!F9,\"sec\")","v":"0h48min54sec"},null,null,1]
["crunchy",null,{"$f":"VLOOKUP(A12,'DATA LXM'!$A$35:$B$64,2)","v":637917142},"A PORTEE",34,37,{"$f":"ROUNDUP(SQRT((LXM!$L$1-LXM!E12)^2+(LXM!$N$1-LXM!F12)^2),0)","v":138},{"$f":"CONCATENATE('DATA LXM'!D10,\"h\",'DATA LXM'!E10,\"min\",'DATA LXM'!F10,\"sec\")","v":"4h7min14sec"},null,null,1]
["Cyclope",null,{"$f":"VLOOKUP(A13,'DATA LXM'!$A$35:$B$64,2)","v":111173}," ",11,172,{"$f":"ROUNDUP(SQRT((LXM!$L$1-LXM!E13)^2+(LXM!$N$1-LXM!F13)^2),0)","v":6},{"$f":"CONCATENATE('DATA LXM'!D11,\"h\",'DATA LXM'!E11,\"min\",'DATA LXM'!F11,\"sec\")","v":"0h11min2sec"},null,null,1]
["Domino",null,{"$f":"VLOOKUP(A14,'DATA LXM'!$A$35:$B$64,2)","v":892741}," ",10,173,{"$f":"ROUNDUP(SQRT((LXM!$L$1-LXM!E14)^2+(LXM!$N$1-LXM!F14)^2),0)","v":6},{"$f":"CONCATENATE('DATA LXM'!D12,\"h\",'DATA LXM'!E12,\"min\",'DATA LXM'!F12,\"sec\")","v":"0h12min58sec"},null,null,1]
["Eltornado",null,{"$f":"VLOOKUP(A15,'DATA LXM'!$A$35:$B$64,2)","v":119767}," ",45,20,{"$f":"ROUNDUP(SQRT((LXM!$L$1-LXM!E15)^2+(LXM!$N$1-LXM!F15)^2),0)","v":156},{"$f":"CONCATENATE('DATA LXM'!D13,\"h\",'DATA LXM'!E13,\"min\",'DATA LXM'!F13,\"sec\")","v":"4h33min49sec"},null,null,1]
["Fleau",null,{"$f":"VLOOKUP(A16,'DATA LXM'!$A$35:$B$64,2)","v":1034979412},"A PORTEE",13,173,{"$f":"ROUNDUP(SQRT((LXM!$L$1-LXM!E16)^2+(LXM!$N$1-LXM!F16)^2),0)","v":3},{"$f":"CONCATENATE('DATA LXM'!D14,\"h\",'DATA LXM'!E14,\"min\",'DATA LXM'!F14,\"sec\")","v":"0h6min31sec"},null,null,1]
["Formidabilis",null,{"$f":"VLOOKUP(A17,'DATA LXM'!$A$35:$B$64,2)","v":215020}," ",17,176,{"$f":"ROUNDUP(SQRT((LXM!$L$1-LXM!E17)^2+(LXM!$N$1-LXM!F17)^2),0)","v":4},{"$f":"CONCATENATE('DATA LXM'!D15,\"h\",'DATA LXM'!E15,\"min\",'DATA LXM'!F15,\"sec\")","v":"0h6min52sec"},null,null,1]
["Jericho",null,{"$f":"VLOOKUP(A18,'DATA LXM'!$A$35:$B$64,2)","v":1839285687}," ",13,209,{"$f":"ROUNDUP(SQRT((LXM!$L$1-LXM!E18)^2+(LXM!$N$1-LXM!F18)^2),0)","v":37},{"$f":"CONCATENATE('DATA LXM'!D16,\"h\",'DATA LXM'!E16,\"min\",'DATA LXM'!F16,\"sec\")","v":"1h14min46sec"},null,null,1]
["kandide",null,{"$f":"VLOOKUP(A19,'DATA LXM'!$A$35:$B$64,2)","v":74951}," ",12,55,{"$f":"ROUNDUP(SQRT((LXM!$L$1-LXM!E19)^2+(LXM!$N$1-LXM!F19)^2),0)","v":119},{"$f":"CONCATENATE('DATA LXM'!D17,\"h\",'DATA LXM'!E17,\"min\",'DATA LXM'!F17,\"sec\")","v":"3h38min19sec"},null,null,1]
["laika",null,{"$f":"VLOOKUP(A20,'DATA LXM'!$A$35:$B$64,2)","v":352856}," ",42,183,{"$f":"ROUNDUP(SQRT((LXM!$L$1-LXM!E20)^2+(LXM!$N$1-LXM!F20)^2),0)","v":28},{"$f":"CONCATENATE('DATA LXM'!D18,\"h\",'DATA LXM'!E18,\"min\",'DATA LXM'!F18,\"sec\")","v":"0h58min20sec"},null,null,1]
["Matteo37",null,{"$f":"VLOOKUP(A21,'DATA LXM'!$A$35:$B$64,2)","v":1045506653},"A PORTEE",45,169,{"$f":"ROUNDUP(SQRT((LXM!$L$1-LXM!E21)^2+(LXM!$N$1-LXM!F21)^2),0)","v":30},{"$f":"CONCATENATE('DATA LXM'!D19,\"h\",'DATA LXM'!E19,\"min\",'DATA LXM'!F19,\"sec\")","v":"1h1min11sec"},null,null,1]
["maxbo",null,{"$f":"VLOOKUP(A22,'DATA LXM'!$A$35:$B$64,2)","v":474073}," ",18,179,{"$f":"ROUNDUP(SQRT((LXM!$L$1-LXM!E22)^2+(LXM!$N$1-LXM!F22)^2),0)","v":7},{"$f":"CONCATENATE('DATA LXM'!D20,\"h\",'DATA LXM'!E20,\"min\",'DATA LXM'!F20,\"sec\")","v":"0h13min40sec"},null,null,1]
["moontribe",null,{"$f":"VLOOKUP(A23,'DATA LXM'!$A$35:$B$64,2)","v":577004}," ",37,144,{"$f":"ROUNDUP(SQRT((LXM!$L$1-LXM!E23)^2+(LXM!$N$1-LXM!F23)^2),0)","v":36},{"$f":"CONCATENATE('DATA LXM'!D21,\"h\",'DATA LXM'!E21,\"min\",'DATA LXM'!F21,\"sec\")","v":"1h14min9sec"},null,null,1]
["mouche",null,{"$f":"VLOOKUP(A24,'DATA LXM'!$A$35:$B$64,2)","v":140617522}," ",7,245,{"$f":"ROUNDUP(SQRT((LXM!$L$1-LXM!E24)^2+(LXM!$N$1-LXM!F24)^2),0)","v":73},{"$f":"CONCATENATE('DATA LXM'!D22,\"h\",'DATA LXM'!E22,\"min\",'DATA LXM'!F22,\"sec\")","v":"2h22min46sec"},null,null,1]
["Norrin-Radd",null,{"$f":"VLOOKUP(A25,'DATA LXM'!$A$35:$B$64,2)","v":32853830}," ",33,171,{"$f":"ROUNDUP(SQRT((LXM!$L$1-LXM!E25)^2+(LXM!$N$1-LXM!F25)^2),0)","v":18},{"$f":"CONCATENATE('DATA LXM'!D23,\"h\",'DATA LXM'!E23,\"min\",'DATA LXM'!F23,\"sec\")","v":"0h36min24sec"},null,null,1]
["Prend-Ta-Claque",null,{"$f":"VLOOKUP(A26,'DATA LXM'!$A$35:$B$64,2)","v":2568004}," ",15,20,{"$f":"ROUNDUP(SQRT((LXM!$L$1-LXM!E26)^2+(LXM!$N$1-LXM!F26)^2),0)","v":154},{"$f":"CONCATENATE('DATA LXM'!D24,\"h\",'DATA LXM'!E24,\"min\",'DATA LXM'!F24,\"sec\")","v":"4h29min60sec"},null,null,1]
["sergioo",null,{"$f":"VLOOKUP(A27,'DATA LXM'!$A$35:$B$64,2)","v":29711962}," ",40,21,{"$f":"ROUNDUP(SQRT((LXM!$L$1-LXM!E27)^2+(LXM!$N$1-LXM!F27)^2),0)","v":154},{"$f":"CONCATENATE('DATA LXM'!D25,\"h\",'DATA LXM'!E25,\"min\",'DATA LXM'!F25,\"sec\")","v":"4h31min14sec"},null,null,1]
["shub",null,{"$f":"VLOOKUP(A28,'DATA LXM'!$A$35:$B$64,2)","v":728876}," ",42,35,{"$f":"ROUNDUP(SQRT((LXM!$L$1-LXM!E28)^2+(LXM!$N$1-LXM!F28)^2),0)","v":141},{"$f":"CONCATENATE('DATA LXM'!D26,\"h\",'DATA LXM'!E26,\"min\",'DATA LXM'!F26,\"sec\")","v":"4h11min59sec"},null,null,1]
["Slipstream",null,{"$f":"VLOOKUP(A29,'DATA LXM'!$A$35:$B$64,2)","v":104115}," ",3,173,{"$f":"ROUNDUP(SQRT((LXM!$L$1-LXM!E29)^2+(LXM!$N$1-LXM!F29)^2),0)","v":13},{"$f":"CONCATENATE('DATA LXM'!D27,\"h\",'DATA LXM'!E27,\"min\",'DATA LXM'!F27,\"sec\")","v":"0h27min48sec"},null,null,1]
["waylander",null,{"$f":"VLOOKUP(A30,'DATA LXM'!$A$35:$B$64,2)","v":145222702}," ",16,30,{"$f":"ROUNDUP(SQRT((LXM!$L$1-LXM!E30)^2+(LXM!$N$1-LXM!F30)^2),0)","v":143},{"$f":"CONCATENATE('DATA LXM'!D28,\"h\",'DATA LXM'!E28,\"min\",'DATA LXM'!F28,\"sec\")","v":"4h15min43sec"},null,null,1]
["weed",null,{"$f":"VLOOKUP(A31,'DATA LXM'!$A$35:$B$64,2)","v":1827888}," ",7,128,{"$f":"ROUNDUP(SQRT((LXM!$L$1-LXM!E31)^2+(LXM!$N$1-LXM!F31)^2),0)","v":46},{"$f":"CONCATENATE('DATA LXM'!D29,\"h\",'DATA LXM'!E29,\"min\",'DATA LXM'!F29,\"sec\")","v":"1h33min42sec"},null,null,1]
["Zerek",null,{"$f":"VLOOKUP(A32,'DATA LXM'!$A$35:$B$64,2)","v":305693}," ",9,59,{"$f":"ROUNDUP(SQRT((LXM!$L$1-LXM!E32)^2+(LXM!$N$1-LXM!F32)^2),0)","v":115},{"$f":"CONCATENATE('DATA LXM'!D30,\"h\",'DATA LXM'!E30,\"min\",'DATA LXM'!F30,\"sec\")","v":"3h32min17sec"},null,null,1]

{"sheet":"BES","index":4,"n_rows":60,"n_cols":14,"rows_kept":60,"cut":false,"hidden":false,"merged":[]}
["Dernière MaJ",{"$f":"TODAY()","v":"2013-04-14"},null,"Mon tdc",{"$f":"LXM!E1","v":431842364},null,"VA",{"$f":"LXM!H1","v":25},null,"Pos perso:","x",{"$f":"LXM!L1","v":16},"y",{"$f":"LXM!N1","v":173}]
[]
[null,"MAP","TDC","A portée ?","x","y","Distance","Temps"]
["agecanonix",null,{"$f":"VLOOKUP(A4,'DATA BES'!$A$67:$B$124,2)","v":3461184525},{"$f":"IF(AND((C4<=(3*$E$1)),(C4>=(0.5*$E$1))),\"A PORTEE\",\" \")","v":" "},12,271,{"$f":"ROUNDUP(SQRT(($L$1-E4)^2+($N$1-F4)^2),0)","v":99},{"$f":"CONCATENATE('DATA BES'!D2,\"h\",'DATA BES'!E2,\"min\",'DATA BES'!F2,\"sec\")","v":"3h6min20sec"}]
["aubertignac",null,{"$f":"VLOOKUP(A5,'DATA BES'!$A$67:$B$124,2)","v":87905571},{"$f":"IF(AND((C5<=(3*$E$1)),(C5>=(0.5*$E$1))),\"A PORTEE\",\" \")","v":" "},6,52,{"$f":"ROUNDUP(SQRT(($L$1-E5)^2+($N$1-F5)^2),0)","v":122},{"$f":"CONCATENATE('DATA BES'!D3,\"h\",'DATA BES'!E3,\"min\",'DATA BES'!F3,\"sec\")","v":"3h43min29sec"}]
["Azkanith",null,{"$f":"VLOOKUP(A6,'DATA BES'!$A$67:$B$124,2)","v":3500000000},{"$f":"IF(AND((C6<=(3*$E$1)),(C6>=(0.5*$E$1))),\"A PORTEE\",\" \")","v":" "},28,61,{"$f":"ROUNDUP(SQRT(($L$1-E6)^2+($N$1-F6)^2),0)","v":113},{"$f":"CONCATENATE('DATA BES'!D4,\"h\",'DATA BES'!E4,\"min\",'DATA BES'!F4,\"sec\")","v":"3h29min48sec"}]
["Bactroban",null,{"$f":"VLOOKUP(A7,'DATA BES'!$A$67:$B$124,2)","v":2154874164}," ",20,115,59,{"$f":"CONCATENATE('DATA BES'!D5,\"h\",'DATA BES'!E5,\"min\",'DATA BES'!F5,\"sec\")","v":"1h56min41sec"}]
["ben57",null,{"$f":"VLOOKUP(A8,'DATA BES'!$A$67:$B$124,2)","v":149380852}," ",32,6,168,{"$f":"CONCATENATE('DATA BES'!D6,\"h\",'DATA BES'!E6,\"min\",'DATA BES'!F6,\"sec\")","v":"4h50min20sec"}]
["bib595",null,{"$f":"VLOOKUP(A9,'DATA BES'!$A$67:$B$124,2)","v":2905019}," ",12,237,65,{"$f":"CONCATENATE('DATA BES'!D7,\"h\",'DATA BES'!E7,\"min\",'DATA BES'!F7,\"sec\")","v":"2h7min39sec"}]
["bill",null,{"$f":"VLOOKUP(A10,'DATA BES'!$A$67:$B$124,2)","v":54154338}," ",19,112,62,{"$f":"CONCATENATE('DATA BES'!D8,\"h\",'DATA BES'!E8,\"min\",'DATA BES'!F8,\"sec\")","v":"2h2min5sec"}]
["Bruxelles",null,{"$f":"VLOOKUP(A11,'DATA BES'!$A$67:$B$124,2)","v":3200000000}," ",41,56,120,{"$f":"CONCATENATE('DATA BES'!D9,\"h\",'DATA BES'!E9,\"min\",'DATA BES'!F9,\"sec\")","v":"3h40min45sec"}]
["Chryom",null,{"$f":"VLOOKUP(A12,'DATA BES'!$A$67:$B$124,2)","v":9996200}," ",9,58,116,{"$f":"CONCATENATE('DATA BES'!D10,\"h\",'DATA BES'!E10,\"min\",'DATA BES'!F10,\"sec\")","v":"3h33min51sec"}]
["CroolisVar",null,{"$f":"VLOOKUP(A13,'DATA BES'!$A$67:$B$124,2)","v":786759706},"A PORTEE",43,205,42,{"$f":"CONCATENATE('DATA BES'!D11,\"h\",'DATA BES'!E11,\"min\",'DATA BES'!F11,\"sec\")","v":"1h25min58sec"}]
["Damping",null,{"$f":"VLOOKUP(A14,'DATA BES'!$A$67:$B$124,2)","v":16221345}," ",29,270,98,{"$f":"CONCATENATE('DATA BES'!D12,\"h\",'DATA BES'!E12,\"min\",'DATA BES'!F12,\"sec\")","v":"3h5min59sec"}]
["DrAnts",null,{"$f":"VLOOKUP(A15,'DATA BES'!$A$67:$B$124,2)","v":3848814}," ",20,276,104,{"$f":"CONCATENATE('DATA BES'!D13,\"h\",'DATA BES'!E13,\"min\",'DATA BES'!F13,\"sec\")","v":"3h14min30sec"}]
["Drusilla",null,{"$f":"VLOOKUP(A16,'DATA BES'!$A$67:$B$124,2)","v":1855225863}," ",31,23,151,{"$f":"CONCATENATE('DATA BES'!D14,\"h\",'DATA BES'!E14,\"min\",'DATA BES'!F14,\"sec\")","v":"4h26min49sec"}]
["EllaVonZedanltha",null,{"$f":"VLOOKUP(A17,'DATA BES'!$A$67:$B$124,2)","v":1952804}," ",29,59,115,{"$f":"CONCATENATE('DATA BES'!D15,\"h\",'DATA BES'!E15,\"min\",'DATA BES'!F15,\"sec\")","v":"3h33min7sec"}]
["Flipper1",null,{"$f":"VLOOKUP(A18,'DATA BES'!$A$67:$B$124,2)","v":92127906}," ",22,69,105,{"$f":"CONCATENATE('DATA BES'!D16,\"h\",'DATA BES'!E16,\"min\",'DATA BES'!F16,\"sec\")","v":"3h16min16sec"}]
["Greeny",null,{"$f":"VLOOKUP(A19,'DATA BES'!$A$67:$B$124,2)","v":26570199}," ",23,50,124,{"$f":"CONCATENATE('DATA BES'!D17,\"h\",'DATA BES'!E17,\"min\",'DATA BES'!F17,\"sec\")","v":"3h46min14sec"}]
["Gueust",null,{"$f":"VLOOKUP(A20,'DATA BES'!$A$67:$B$124,2)","v":1480632393}," ",3,385,213,{"$f":"CONCATENATE('DATA BES'!D18,\"h\",'DATA BES'!E18,\"min\",'DATA BES'!F18,\"sec\")","v":"5h46min51sec"}]
["hador",null,{"$f":"VLOOKUP(A21,'DATA BES'!$A$67:$B$124,2)","v":1289178436},"A PORTEE",27,186,18,{"$f":"CONCATENATE('DATA BES'!D19,\"h\",'DATA BES'!E19,\"min\",'DATA BES'!F19,\"sec\")","v":"0h36min13sec"}]
["Ishigo",null,{"$f":"VLOOKUP(A22,'DATA BES'!$A$67:$B$124,2)","v":757282747},"A PORTEE",23,103,71,{"$f":"CONCATENATE('DATA BES'!D20,\"h\",'DATA BES'!E20,\"min\",'DATA BES'!F20,\"sec\")","v":"2h18min50sec"}]
["Lesqual",null,{"$f":"VLOOKUP(A23,'DATA BES'!$A$67:$B$124,2)","v":4423829}," ",23,295,123,{"$f":"CONCATENATE('DATA BES'!D21,\"h\",'DATA BES'!E21,\"min\",'DATA BES'!F21,\"sec\")","v":"3h44min42sec"}]
["lipoussou",null,{"$f":"VLOOKUP(A24,'DATA BES'!$A$67:$B$124,2)","v":11917308}," ",40,147,36,{"$f":"CONCATENATE('DATA BES'!D22,\"h\",'DATA BES'!E22,\"min\",'DATA BES'!F22,\"sec\")","v":"1h13min19sec"}]
["Lockheed",null,{"$f":"VLOOKUP(A25,'DATA BES'!$A$67:$B$124,2)","v":11216156}," ",28,176,13,{"$f":"CONCATENATE('DATA BES'!D23,\"h\",'DATA BES'!E23,\"min\",'DATA BES'!F23,\"sec\")","v":"0h26min29sec"}]
["MagnetO",null,{"$f":"VLOOKUP(A26,'DATA BES'!$A$67:$B$124,2)","v":111707}," ",26,172,11,{"$f":"CONCATENATE('DATA BES'!D24,\"h\",'DATA BES'!E24,\"min\",'DATA BES'!F24,\"sec\")","v":"0h21min35sec"}]
["marchombre",null,{"$f":"VLOOKUP(A27,'DATA BES'!$A$67:$B$124,2)","v":1650134494}," ",16,106,67,{"$f":"CONCATENATE('DATA BES'!D25,\"h\",'DATA BES'!E25,\"min\",'DATA BES'!F25,\"sec\")","v":"2h12min50sec"}]
["Melissa",null,{"$f":"VLOOKUP(A28,'DATA BES'!$A$67:$B$124,2)","v":4325226}," ",33,316,145,{"$f":"CONCATENATE('DATA BES'!D26,\"h\",'DATA BES'!E26,\"min\",'DATA BES'!F26,\"sec\")","v":"4h17min11sec"}]
["MilesGloriosus",null,{"$f":"VLOOKUP(A29,'DATA BES'!$A$67:$B$124,2)","v":1229557}," ",5,94,80,{"$f":"CONCATENATE('DATA BES'!D27,\"h\",'DATA BES'!E27,\"min\",'DATA BES'!F27,\"sec\")","v":"2h35min23sec"}]
["miloveam",null,{"$f":"VLOOKUP(A30,'DATA BES'!$A$67:$B$124,2)","v":10733921}," ",26,40,134,{"$f":"CONCATENATE('DATA BES'!D28,\"h\",'DATA BES'!E28,\"min\",'DATA BES'!F28,\"sec\")","v":"4h1min36sec"}]
["Mime",null,{"$f":"VLOOKUP(A31,'DATA BES'!$A$67:$B$124,2)","v":1741606}," ",14,128,46,{"$f":"CONCATENATE('DATA BES'!D29,\"h\",'DATA BES'!E29,\"min\",'DATA BES'!F29,\"sec\")","v":"1h32min5sec"}]
["Mimic",null,{"$f":"VLOOKUP(A32,'DATA BES'!$A$67:$B$124,2)","v":510734725},"A PORTEE",44,173,28,{"$f":"CONCATENATE('DATA BES'!D30,\"h\",'DATA BES'!E30,\"min\",'DATA BES'!F30,\"sec\")","v":"0h58min38sec"}]
["Morphy",null,{"$f":"VLOOKUP(A33,'DATA BES'!$A$67:$B$124,2)","v":1927950}," ",35,6,169,{"$f":"CONCATENATE('DATA BES'!D31,\"h\",'DATA BES'!E31,\"min\",'DATA BES'!F31,\"sec\")","v":"4h50min45sec"}]
["Myvin",null,{"$f":"VLOOKUP(A34,'DATA BES'!$A$67:$B$124,2)","v":1983940382}," ",29,37,137,{"$f":"CONCATENATE('DATA BES'!D32,\"h\",'DATA BES'!E32,\"min\",'DATA BES'!F32,\"sec\")","v":"4h6min24sec"}]
["osman",null,{"$f":"VLOOKUP(A35,'DATA BES'!$A$67:$B$124,2)","v":953794}," ",19,28,146,{"$f":"CONCATENATE('DATA BES'!D33,\"h\",'DATA BES'!E33,\"min\",'DATA BES'!F33,\"sec\")","v":"4h18min39sec"}]
["pacpac001",null,{"$f":"VLOOKUP(A36,'DATA BES'!$A$67:$B$124,2)","v":2291704}," ",6,51,123,{"$f":"CONCATENATE('DATA BES'!D34,\"h\",'DATA BES'!E34,\"min\",'DATA BES'!F34,\"sec\")","v":"3h45min1sec"}]
["Panda",null,{"$f":"VLOOKUP(A37,'DATA BES'!$A$67:$B$124,2)","v":74522661}," ",4,35,139,{"$f":"CONCATENATE('DATA BES'!D35,\"h\",'DATA BES'!E35,\"min\",'DATA BES'!F35,\"sec\")","v":"4h9min12sec"}]
["pANTSu",null,{"$f":"VLOOKUP(A38,'DATA BES'!$A$67:$B$124,2)","v":1909810001}," ",29,292,120,{"$f":"CONCATENATE('DATA BES'!D36,\"h\",'DATA BES'!E36,\"min\",'DATA BES'!F36,\"sec\")","v":"3h40min51sec"}]
["Phenixx",null,{"$f":"VLOOKUP(A39,'DATA BES'!$A$67:$B$124,2)","v":908308062},"A PORTEE",7,181,13,{"$f":"CONCATENATE('DATA BES'!D37,\"h\",'DATA BES'!E37,\"min\",'DATA BES'!F37,\"sec\")","v":"0h25min48sec"}]
["Pinou",null,{"$f":"VLOOKUP(A40,'DATA BES'!$A$67:$B$124,2)","v":7212325}," ",43,21,155,{"$f":"CONCATENATE('DATA BES'!D38,\"h\",'DATA BES'!E38,\"min\",'DATA BES'!F38,\"sec\")","v":"4h31min56sec"}]
["pluginbaby",null,{"$f":"VLOOKUP(A41,'DATA BES'!$A$67:$B$124,2)","v":12705822}," ",35,23,152,{"$f":"CONCATENATE('DATA BES'!D39,\"h\",'DATA BES'!E39,\"min\",'DATA BES'!F39,\"sec\")","v":"4h27min27sec"}]
["Quivala",null,{"$f":"VLOOKUP(A42,'DATA BES'!$A$67:$B$124,2)","v":9761369}," ",44,143,42,{"$f":"CONCATENATE('DATA BES'!D40,\"h\",'DATA BES'!E40,\"min\",'DATA BES'!F40,\"sec\")","v":"1h24min21sec"}]
["Reex",null,{"$f":"VLOOKUP(A43,'DATA BES'!$A$67:$B$124,2)","v":1332809}," ",36,193,29,{"$f":"CONCATENATE('DATA BES'!D41,\"h\",'DATA BES'!E41,\"min\",'DATA BES'!F41,\"sec\")","v":"0h59min12sec"}]
["riblibli",null,{"$f":"VLOOKUP(A44,'DATA BES'!$A$67:$B$124,2)","v":194929}," ",39,25,150,{"$f":"CONCATENATE('DATA BES'!D42,\"h\",'DATA BES'!E42,\"min\",'DATA BES'!F42,\"sec\")","v":"4h25min26sec"}]
["Rita",null,{"$f":"VLOOKUP(A45,'DATA BES'!$A$67:$B$124,2)","v":616559697},"A PORTEE",33,318,146,{"$f":"CONCATENATE('DATA BES'!D43,\"h\",'DATA BES'!E43,\"min\",'DATA BES'!F43,\"sec\")","v":"4h20min2sec"}]
["Rockslide",null,{"$f":"VLOOKUP(A46,'DATA BES'!$A$67:$B$124,2)","v":192556364}," ",16,173,0,{"$f":"CONCATENATE('DATA BES'!D44,\"h\",'DATA BES'!E44,\"min\",'DATA BES'!F44,\"sec\")","v":"0h0min0sec"}]
["Rofulus",null,{"$f":"VLOOKUP(A47,'DATA BES'!$A$67:$B$124,2)","v":599979}," ",13,107,67,{"$f":"CONCATENATE('DATA BES'!D45,\"h\",'DATA BES'!E45,\"min\",'DATA BES'!F45,\"sec\")","v":"2h11min9sec"}]
["ryuk44",null,{"$f":"VLOOKUP(A48,'DATA BES'!$A$67:$B$124,2)","v":53860510}," ",12,61,113,{"$f":"CONCATENATE('DATA BES'!D46,\"h\",'DATA BES'!E46,\"min\",'DATA BES'!F46,\"sec\")","v":"3h28min54sec"}]
["Seiduna",null,{"$f":"VLOOKUP(A49,'DATA BES'!$A$67:$B$124,2)","v":184276}," ",10,63,111,{"$f":"CONCATENATE('DATA BES'!D47,\"h\",'DATA BES'!E47,\"min\",'DATA BES'!F47,\"sec\")","v":"3h25min53sec"}]
["sentih",null,{"$f":"VLOOKUP(A50,'DATA BES'!$A$67:$B$124,2)","v":12854744}," ",6,55,119,{"$f":"CONCATENATE('DATA BES'!D48,\"h\",'DATA BES'!E48,\"min\",'DATA BES'!F48,\"sec\")","v":"3h38min52sec"}]
["Shikamaru",null,{"$f":"VLOOKUP(A51,'DATA BES'!$A$67:$B$124,2)","v":8133785}," ",35,169,20,{"$f":"CONCATENATE('DATA BES'!D49,\"h\",'DATA BES'!E49,\"min\",'DATA BES'!F49,\"sec\")","v":"0h41min9sec"}]
["spetsnaz",null,{"$f":"VLOOKUP(A52,'DATA BES'!$A$67:$B$124,2)","v":3500000000}," ",40,125,54,{"$f":"CONCATENATE('DATA BES'!D50,\"h\",'DATA BES'!E50,\"min\",'DATA BES'!F50,\"sec\")","v":"1h48min23sec"}]
["svanhilde",null,{"$f":"VLOOKUP(A53,'DATA BES'!$A$67:$B$124,2)","v":2500000000}," ",29,124,51,{"$f":"CONCATENATE('DATA BES'!D51,\"h\",'DATA BES'!E51,\"min\",'DATA BES'!F51,\"sec\")","v":"1h42min49sec"}]
["Taouret",null,{"$f":"VLOOKUP(A54,'DATA BES'!$A$67:$B$124,2)","v":688628575},"A PORTEE",33,237,67,{"$f":"CONCATENATE('DATA BES'!D52,\"h\",'DATA BES'!E52,\"min\",'DATA BES'!F52,\"sec\")","v":"2h11min26sec"}]
["TheDentist",null,{"$f":"VLOOKUP(A55,'DATA BES'!$A$67:$B$124,2)","v":14367717}," ",19,53,121,{"$f":"CONCATENATE('DATA BES'!D53,\"h\",'DATA BES'!E53,\"min\",'DATA BES'!F53,\"sec\")","v":"3h41min22sec"}]
["Thunderbird",null,{"$f":"VLOOKUP(A56,'DATA BES'!$A$67:$B$124,2)","v":2202808830}," ",5,172,12,{"$f":"CONCATENATE('DATA BES'!D54,\"h\",'DATA BES'!E54,\"min\",'DATA BES'!F54,\"sec\")","v":"0h23min42sec"}]
["Tradjette",null,{"$f":"VLOOKUP(A57,'DATA BES'!$A$67:$B$124,2)","v":34256999}," ",7,13,161,{"$f":"CONCATENATE('DATA BES'!D55,\"h\",'DATA BES'!E55,\"min\",'DATA BES'!F55,\"sec\")","v":"4h40min6sec"}]
["vinkou",null,{"$f":"VLOOKUP(A58,'DATA BES'!$A$67:$B$124,2)","v":2046872542}," ",45,107,73,{"$f":"CONCATENATE('DATA BES'!D56,\"h\",'DATA BES'!E56,\"min\",'DATA BES'!F56,\"sec\")","v":"2h21min56sec"}]
["weaver",null,{"$f":"VLOOKUP(A59,'DATA BES'!$A$67:$B$124,2)","v":12457093}," ",16,13,160,{"$f":"CONCATENATE('DATA BES'!D57,\"h\",'DATA BES'!E57,\"min\",'DATA BES'!F57,\"sec\")","v":"4h39min45sec"}]
["Wolverine",null,{"$f":"VLOOKUP(A60,'DATA BES'!$A$67:$B$124,2)","v":2500000000}," ",6,34,140,{"$f":"CONCATENATE('DATA BES'!D58,\"h\",'DATA BES'!E58,\"min\",'DATA BES'!F58,\"sec\")","v":"4h10min25sec"}]

{"sheet":"CC Page LXM","index":5,"n_rows":31,"n_cols":7,"rows_kept":31,"cut":false,"hidden":false,"merged":[]}
[]
[null,1,"Alpha -12-","Jericho",1839285687,162,283]
[null,2,"Alpha -12-","Matteo37",1045506653,154,290]
[null,3,"Alpha -13-","Fleau",1034979412,167,299]
[null,4,"Bravo -11-","crunchy",637917142,174,308]
[null,5,"Alpha -01- Officier chaine","Allerdyce",511366515,174,321]
[null,6,"Bravo -10-","AB64",399362427,184,318]
[null,7,"Bravo -08-","waylander",145222702,181,310]
[null,8,"Alpha -01-","mouche",140617522,171,297]
[null,9,"Alpha -01-","_diablo_",134710356,194,314]
[null,10,"Mutante en récupération - Diplomate","_Angel_",45216292,180,320]
[null,11,"Alpha -11-","Norrin-Radd",32853830,184,332]
[null,12,"Bravo -07-","sergioo",29711962,182,300]
[null,13,"No flood","creamy",4979692,191,323]
[null,14,"Alpha -13-","bubulle",3255300,174,286]
[null,15,"Bravo -01-","Prend-Ta-Claque",2568004,188,323]
[null,16,"Alpha -09-","4midiable",1940203,173,297]
[null,17,"Alpha -05-","weed",1827888,181,302]
[null,18,"Alpha -07-","Domino",892741,206,331]
[null,19,"Bravo -04-","shub",728876,169,306]
[null,20,"Alpha -04-","moontribe",577004,171,303]
[null,21,"Alpha -06-","_Wolverine_",573345,180,312]
[null,22,"Alpha -03-","maxbo",474073,177,283]
[null,23,"Alpha -06-","laika",352856,183,313]
[null,24,"Bravo -03-","Zerek",305693,181,307]
[null,25,"Alpha -03-","Formidabilis",215020,173,299]
[null,26,"Bravo -02-","ElTornado",119767,166,303]
[null,27,"Alpha -03- Chef","Cyclope",111173,187,319]
[null,28,"Alpha -01-","Slipstream",104115,179,318]
[null,29,"Bravo -02-","kandide",74951,176,316]
[null,30,"Recrue","Charles_Francois_Xavier",405,28,51]

{"sheet":"CC Page BES","index":6,"n_rows":58,"n_cols":7,"rows_kept":58,"cut":false,"hidden":false,"merged":[]}
[]
[null,1,"Harvestkiller","Azkanith",3500000000,196,315]
[null,2,"Harvestkiller","spetsnaz",3500000000,177,313]
[null,3,"Harvestkiller","agecanonix",3461184525,143,273]
[null,4,"Harvestkiller","Bruxelles",3200000000,152,287]
[null,5,"Harvestkiller","svanhilde",2500000000,181,318]
[null,6,"Harvestkiller","Wolverine",2500000000,172,280]
[null,7,"Géokiller","Thunderbird",2202808830,183,314]
[null,8,"Harvestkiller","Bactroban",2154874164,133,256]
[null,9,"Relief Fund","vinkou",2046872542,169,304]
[null,10,"Relief Fund","Myvin",1983940382,170,311]
[null,11,"Géokiller","pANTSu",1909810001,174,304]
[null,12,"Géokiller","Drusilla",1855225863,173,313]
[null,13,"Harvestkiller","marchombre",1650134494,180,312]
[null,14,"Économe Noir - Géokiller ₪","Gueust",1480632393,170,306]
[null,15,"Harvestkiller","hador",1289178436,180,322]
[null,16,"Nomade - sous protection Théocrâte","Phenixx",908308062,191,310]
[null,17,"Géokiller","CroolisVar",786759706,173,321]
[null,18,"Économe Noir - Géokiller ₪","Ishigo",757282747,177,324]
[null,19,"Gardien Noir - Harvestkiller 🔑","Taouret",688628575,137,245]
[null,20,"Géostratège Noire - Géokiller","Rita",616559697,180,309]
[null,21,"Géokiller","Mimic",510734725,176,292]
[null,22,"Nomarque Noir - Géokiller ۞","Rockslide",192556364,183,325]
[null,23,"Nomade - sous protection Théocrâte","ben57",149380852,182,312]
[null,24,"Géokiller","Flipper1",92127906,168,313]
[null,25,"Géokiller","aubertignac",87905571,184,319]
[null,26,"Géokiller","Panda",74522661,180,316]
[null,27,"Géokiller","bill",54154338,190,316]
[null,28,"Économe Noir - Géokiller ₪","ryuk44",53860510,187,307]
[null,29,"Shadowkiller","Tradjette",34256999,185,314]
[null,30,"Shadowkiller","Greeny",26570199,171,310]
[null,31,"Shadowkiller","Damping",16221345,174,305]
[null,32,"Shadowkiller","TheDentist",14367717,170,299]
[null,33,"Shadowkiller","sentih",12854744,170,304]
[null,34,"Nomade - sous protection Théocrâte","pluginbaby",12705822,179,310]
[null,35,"Nomarque Noir - Shadowkiller ۞","weaver",12457093,190,322]
[null,36,"Nomarque Noir - Shadowkiller ۞","lipoussou",11917308,178,310]
[null,37,"Antskiller","Lockheed",11216156,182,317]
[null,38,"Harvestkiller","miloveam",10733921,161,287]
[null,39,"Shadowkiller","Chryom",9996200,180,315]
[null,40,"Antskiller","Quivala",9761369,177,311]
[null,41,"Shadowkiller.","Shikamaru",8133785,186,315]
[null,42,"Économe Noir - Shadowkiller ₪","Pinou",7212325,166,296]
[null,43,"Vizir Noir - Shadowkiller ۝","Lesqual",4423829,194,320]
[null,44,"Relief Fund","Melissa",4325226,136,260]
[null,45,"Pharaon Noir - Antskiller 🐜","DrAnts",3848814,192,313]
[null,46,"Économe Noir - Antskiller ₪","bib595",2905019,184,320]
[null,47,"Shadowkiller","pacpac001",2291704,179,317]
[null,48,"Antskiller","EllaVonZedanltha",1952804,190,317]
[null,49,"Shaman Noir - Enfermé dans sa tente","Morphy",1927950,156,265]
[null,50,"Antskiller","Mime",1741606,176,303]
[null,51,"Antskiller","Reex",1332809,190,324]
[null,52,"Harvestkiller","MilesGloriosus",1229557,190,313]
[null,53,"Antskiller","osman",953794,171,316]
[null,54,"Antskiller","Rofulus",599979,177,307]
[null,55,"Nomade - Aube Grise","riblibli",194929,164,283]
[null,56,"Nomarque Noir - Shadowkiller ۞","Seiduna",184276,173,312]
[null,57,"Nomarque Noir - Antskiller ۞","MagnetO",111707,187,315]

{"sheet":"FLOOD","index":7,"n_rows":186,"n_cols":18,"rows_kept":186,"cut":false,"hidden":false,"merged":[[0,2,1,2],[0,3,1,3]]}
[null,null,"HEURE ACTUELLE",{"$f":"NOW()","v":41378.458855671299}]
[]
[null,"Choix 1ere cible :"]
[null,"Allerdyce",null,null,"Rockslide",{"$f":"B4","v":"Allerdyce"},null,"Prise","Limite","Precision",null,null,"Rockslide",{"$f":"B7","v":"_diablo_"},null,"Prise","Limite","Precision"]
[null,null,null,"Initial",{"$f":"LXM!E1","v":431842364},{"$f":"VLOOKUP(B4,'DATA LXM'!A35:B64,2)","v":511366515},null,null,{"$f":"IF(AND((F5<=(3*E5)),(F5>=(0.5*E5))),(((E5+F5)/3)+J5),\"HORS PORTEE\")","v":314403059.66666669},100,null,"Initial",{"$f":"E15","v":691686431.26666665},{"$f":"VLOOKUP(B7,'DATA LXM'!A35:B64,2)","v":134710356},null,null,{"$f":"IF(AND((N5<=(3*M5)),(N5>=(0.5*M5))),(((M5+N5)/3)+R5),\"HORS PORTEE\")","v":"HORS PORTEE"},100]
[null,"Choix 2eme cible",null,null,null,null,"-",{"$f":"IF(($I$5=\"HORS PORTEE\"),0,IF((F5=$I$5),(0.2*F5),IF(((0.8*F5)>$I$5),(0.2*F5),(F5-$I$5))))","v":102273303},{"$f":"H6","v":102273303},null,null,null,null,null,"-",{"$f":"IF(($Q$5=\"HORS PORTEE\"),0,IF((N5=$Q$5),(0.2*N5),IF(((0.8*N5)>$Q$5),(0.2*N5),(N5-$Q$5))))","v":0},{"$f":"P6","v":0}]
[null,"_diablo_",null,null,{"$f":"E5+H6","v":534115667},{"$f":"F5-H6","v":409093212},null,null,null,null,null,null,{"$f":"M5+P6","v":691686431.26666665},{"$f":"N5-P6","v":134710356}]
[null,null,null,null,null,null,"-",{"$f":"IF(($I$5=\"HORS PORTEE\"),0,IF((F7=$I$5),(0.2*F7),IF(((0.8*F7)>$I$5),(0.2*F7),(F7-$I$5))))","v":81818642.400000006},{"$f":"H8","v":81818642.400000006},null,null,null,null,null,"-",{"$f":"IF(($Q$5=\"HORS PORTEE\"),0,IF((N7=$Q$5),(0.2*N7),IF(((0.8*N7)>$Q$5),(0.2*N7),(N7-$Q$5))))","v":0},{"$f":"P8","v":0}]
[null,"Choix 3eme cible",null,null,{"$f":"E7+H8","v":615934309.39999998},{"$f":"F7-H8","v":327274569.60000002},null,null,null,null,null,null,{"$f":"M7+P8","v":691686431.26666665},{"$f":"N7-P8","v":134710356}]
[null,"Fleau",null,null,null,null,"-",{"$f":"IF((H6<>(F5*0.2)),0,(IF((F9=$I$5),(0.2*F9),IF(((0.8*F9)>$I$5),(0.2*F9),IF((H8=0),0,(F9-$I$5))))))","v":12871509.933333337},12871509.933333337,null,null,null,null,null,"-",{"$f":"IF((P6<>(N5*0.2)),0,(IF((N9=$Q$5),(0.2*N9),IF(((0.8*N9)>$Q$5),(0.2*N9),IF((P8=0),0,(N9-$Q$5))))))","v":0},{"$f":"P10","v":0}]
[null,null,null,null,{"$f":"E9+H10","v":628805819.33333325},{"$f":"F9-H10","v":314403059.66666669},null,null,null,null,null,null,{"$f":"M9+P10","v":691686431.26666665},{"$f":"N9-P10","v":134710356}]
[null,"Choix 4eme cible",null,null,null,null,"-",{"$f":"IF((H8<>(F7*0.2)),0,(IF((F11=$I$5),(0.2*F11),IF(((0.8*F11)>$I$5),(0.2*F11),IF((H10=0),0,(F11-$I$5))))))","v":62880611.933333337},62880611.933333337,null,null,null,null,null,"-",{"$f":"IF((P8<>(N7*0.2)),0,(IF((N11=$Q$5),(0.2*N11),IF(((0.8*N11)>$Q$5),(0.2*N11),IF((P10=0),0,(N11-$Q$5))))))","v":0},{"$f":"P12","v":0}]
[null,"AB64",null,null,{"$f":"E11+H12","v":691686431.26666665},{"$f":"F11-H12","v":251522447.73333335},null,null,null,null,null,null,{"$f":"M11+P12","v":691686431.26666665},{"$f":"N11-P12","v":134710356}]
[null,null,null,null,null,null,"-",{"$f":"IF((H10<>(F9*0.2)),0,(IF((F13=$I$5),(0.2*F13),IF(((0.8*F13)>$I$5),(0.2*F13),IF((H12=0),0,(F13-$I$5))))))","v":0},0,null,null,null,null,null,"-",{"$f":"IF((P10<>(N9*0.2)),0,(IF((N13=$Q$5),(0.2*N13),IF(((0.8*N13)>$Q$5),(0.2*N13),IF((P12=0),0,(N13-$Q$5))))))","v":0},{"$f":"P14","v":0}]
[null,"Choix 5eme cible",null,"Final",{"$f":"E13+H14","v":691686431.26666665},{"$f":"F13-H14","v":251522447.73333335},"Durée :",{"$f":"TIME(VLOOKUP(B4,'DATA COMMON'!A2:F87,4),VLOOKUP(B4,'DATA COMMON'!A2:F87,5),VLOOKUP(B4,'DATA COMMON'!A2:F87,6))","v":"00:15:15"},null,null,null,"Final",{"$f":"M13+P14","v":691686431.26666665},{"$f":"N13-P14","v":134710356},"Durée :",{"$f":"TIME(VLOOKUP(B7,'DATA COMMON'!A2:F87,4),VLOOKUP(B7,'DATA COMMON'!A2:F87,5),VLOOKUP(B7,'DATA COMMON'!A2:F87,6))","v":"00:23:36"}]
[null,"Matteo37",null,null,null,"Arrivée :",{"$f":"$D$1+H15","v":41378.469445949078},null,null,null,null,null,null,"Arrivée :",{"$f":"$D$1+P15","v":41378.475244560184}]
[]
[null,"Choix 6eme cible"]
[null,"Allerdyce",null,null,"Rockslide",{"$f":"B10","v":"Fleau"},null,"Prise","Limite","Precision",null,null,"Rockslide",{"$f":"B13","v":"AB64"},null,"Prise","Limite","Precision"]
[null,null,null,"Initial",{"$f":"M15","v":691686431.26666665},{"$f":"VLOOKUP(B10,'DATA LXM'!A35:B64,2)","v":1034979412},null,null,{"$f":"IF(AND((F20<=(3*E20)),(F20>=(0.5*E20))),(((E20+F20)/3)+J20),\"HORS PORTEE\")","v":575555381.08888888},100,null,"Initial",{"$f":"E30","v":1266221538.3955555},{"$f":"VLOOKUP(B13,'DATA LXM'!A35:B64,2)","v":399362427},null,null,{"$f":"IF(AND((N20<=(3*M20)),(N20>=(0.5*M20))),(((M20+N20)/3)+R20),\"HORS PORTEE\")","v":"HORS PORTEE"},100]
[null,null,null,null,null,null,"-",{"$f":"IF(($I$20=\"HORS PORTEE\"),0,IF((F20=$I$20),(0.2*F20),IF(((0.8*F20)>$I$20),(0.2*F20),(F20-$I$20))))","v":206995882.40000001},{"$f":"H21","v":206995882.40000001},null,null,null,null,null,"-",{"$f":"IF(($Q$20=\"HORS PORTEE\"),0,IF((N20=$Q$20),(0.2*N20),IF(((0.8*N20)>$Q$20),(0.2*N20),(N20-$Q$20))))","v":0},{"$f":"P21","v":0}]
[null,null,null,null,{"$f":"E20+H21","v":898682313.66666663},{"$f":"F20-H21","v":827983529.60000002},null,null,null,null,null,null,{"$f":"M20+P21","v":1266221538.3955555},{"$f":"N20-P21","v":399362427}]
[null,null,null,null,null,null,"-",{"$f":"IF(($I$20=\"HORS PORTEE\"),0,IF((F22=$I$20),(0.2*F22),IF(((0.8*F22)>$I$20),(0.2*F22),(F22-$I$20))))","v":165596705.92000002},{"$f":"H23","v":165596705.92000002},null,null,null,null,null,"-",{"$f":"IF(($Q$20=\"HORS PORTEE\"),0,IF((N22=$Q$20),(0.2*N22),IF(((0.8*N22)>$Q$20),(0.2*N22),(N22-$Q$20))))","v":0},{"$f":"P23","v":0}]
[null,null,null,null,{"$f":"E22+H23","v":1064279019.5866666},{"$f":"F22-H23","v":662386823.68000007},null,null,null,null,null,null,{"$f":"M22+P23","v":1266221538.3955555},{"$f":"N22-P23","v":399362427}]
[null,null,null,null,null,null,"-",{"$f":"IF((H21<>(F20*0.2)),0,(IF((F24=$I$20),(0.2*F24),IF(((0.8*F24)>$I$20),(0.2*F24),IF((H23=0),0,(F24-$I$20))))))","v":86831442.591111183},86831442.591111183,null,null,null,null,null,"-",{"$f":"IF((P21<>(N20*0.2)),0,(IF((N24=$Q$20),(0.2*N24),IF(((0.8*N24)>$Q$20),(0.2*N24),IF((P23=0),0,(N24-$Q$20))))))","v":0},{"$f":"P25","v":0}]
[null,null,null,null,{"$f":"E24+H25","v":1151110462.1777778},{"$f":"F24-H25","v":575555381.08888888},null,null,null,null,null,null,{"$f":"M24+P25","v":1266221538.3955555},{"$f":"N24-P25","v":399362427}]
[null,null,null,null,null,null,"-",{"$f":"IF((H23<>(F22*0.2)),0,(IF((F26=$I$20),(0.2*F26),IF(((0.8*F26)>$I$20),(0.2*F26),IF((H25=0),0,(F26-$I$20))))))","v":115111076.21777779},115111076.21777779,null,null,null,null,null,"-",{"$f":"IF((P23<>(N22*0.2)),0,(IF((N26=$Q$20),(0.2*N26),IF(((0.8*N26)>$Q$20),(0.2*N26),IF((P25=0),0,(N26-$Q$20))))))","v":0},{"$f":"P27","v":0}]
[null,null,null,null,{"$f":"E26+H27","v":1266221538.3955555},{"$f":"F26-H27","v":460444304.87111109},null,null,null,null,null,null,{"$f":"M26+P27","v":1266221538.3955555},{"$f":"N26-P27","v":399362427}]
[null,null,null,null,null,null,"-",{"$f":"IF((H25<>(F24*0.2)),0,(IF((F28=$I$20),(0.2*F28),IF(((0.8*F28)>$I$20),(0.2*F28),IF((H27=0),0,(F28-$I$20))))))","v":0},0,null,null,null,null,null,"-",{"$f":"IF((P25<>(N24*0.2)),0,(IF((N28=$Q$20),(0.2*N28),IF(((0.8*N28)>$Q$20),(0.2*N28),IF((P27=0),0,(N28-$Q$20))))))","v":0},{"$f":"P29","v":0}]
[null,null,null,"Final",{"$f":"E28+H29","v":1266221538.3955555},{"$f":"F28-H29","v":460444304.87111109},"Durée :",{"$f":"TIME(VLOOKUP(B10,'DATA COMMON'!A2:F87,4),VLOOKUP(B10,'DATA COMMON'!A2:F87,5),VLOOKUP(B10,'DATA COMMON'!A2:F87,6))","v":"00:06:31"},null,null,null,"Final",{"$f":"E30","v":1266221538.3955555},{"$f":"N28-P29","v":399362427},"Durée :",{"$f":"TIME(VLOOKUP(B13,'DATA COMMON'!A2:F87,4),VLOOKUP(B13,'DATA COMMON'!A2:F87,5),VLOOKUP(B13,'DATA COMMON'!A2:F87,6))","v":"04:38:31"}]
[null,null,null,null,null,"Arrivée :",{"$f":"$D$1+H30","v":41378.463381134265},null,null,null,null,null,null,"Arrivée :",{"$f":"$D$1+P30","v":41378.652270023151}]
[]
[]
[null,null,null,null,"Rockslide",{"$f":"B16","v":"Matteo37"},null,"Prise","Limite","Precision",null,null,"Rockslide",{"$f":"B19","v":"Allerdyce"},null,"Prise","Limite","Precision"]
[null,null,null,"Initial",{"$f":"M30","v":1266221538.3955555},{"$f":"VLOOKUP(B16,'DATA LXM'!A35:B64,2)","v":1045506653},null,null,{"$f":"IF(AND((F35<=(3*E35)),(F35>=(0.5*E35))),(((E35+F35)/3)+J35),\"HORS PORTEE\")","v":770576163.79851854},100,null,"Initial",{"$f":"E45","v":1695267260.3567405},{"$f":"VLOOKUP(B19,'DATA LXM'!A35:B64,2)","v":511366515},null,null,{"$f":"IF(AND((N35<=(3*M35)),(N35>=(0.5*M35))),(((M35+N35)/3)+R35),\"HORS PORTEE\")","v":"HORS PORTEE"},100]
[null,null,null,null,null,null,"-",{"$f":"IF(($I$35=\"HORS PORTEE\"),0,IF((F35=$I$35),(0.2*F35),IF(((0.8*F35)>$I$35),(0.2*F35),(F35-$I$35))))","v":209101330.60000002},{"$f":"H36","v":209101330.60000002},null,null,null,null,null,"-",{"$f":"IF(($Q$35=\"HORS PORTEE\"),0,IF((N35=$Q$35),(0.2*N35),IF(((0.8*N35)>$Q$35),(0.2*N35),(N35-$Q$35))))","v":0},{"$f":"P36","v":0}]
[null,null,null,null,{"$f":"E35+H36","v":1475322868.9955554},{"$f":"F35-H36","v":836405322.39999998},null,null,null,null,null,null,{"$f":"M35+P36","v":1695267260.3567405},{"$f":"N35-P36","v":511366515}]
[null,null,null,null,null,null,"-",{"$f":"IF(($I$35=\"HORS PORTEE\"),0,IF((F37=$I$35),(0.2*F37),IF(((0.8*F37)>$I$35),(0.2*F37),(F37-$I$35))))","v":65829158.601481438},{"$f":"H38","v":65829158.601481438},null,null,null,null,null,"-",{"$f":"IF(($Q$35=\"HORS PORTEE\"),0,IF((N37=$Q$35),(0.2*N37),IF(((0.8*N37)>$Q$35),(0.2*N37),(N37-$Q$35))))","v":0},{"$f":"P38","v":0}]
[null,null,null,null,{"$f":"E37+H38","v":1541152027.5970368},{"$f":"F37-H38","v":770576163.79851854},null,null,null,null,null,null,{"$f":"M37+P38","v":1695267260.3567405},{"$f":"N37-P38","v":511366515}]
[null,null,null,null,null,null,"-",{"$f":"IF((H36<>(F35*0.2)),0,(IF((F39=$I$35),(0.2*F39),IF(((0.8*F39)>$I$35),(0.2*F39),IF((H38=0),0,(F39-$I$35))))))","v":154115232.75970373},154115232.75970373,null,null,null,null,null,"-",{"$f":"IF((P36<>(N35*0.2)),0,(IF((N39=$Q$35),(0.2*N39),IF(((0.8*N39)>$Q$35),(0.2*N39),IF((P38=0),0,(N39-$Q$35))))))","v":0},{"$f":"P40","v":0}]
[null,null,null,null,{"$f":"E39+H40","v":1695267260.3567405},{"$f":"F39-H40","v":616460931.03881478},null,null,null,null,null,null,{"$f":"M39+P40","v":1695267260.3567405},{"$f":"N39-P40","v":511366515}]
[null,null,null,null,null,null,"-",{"$f":"IF((H38<>(F37*0.2)),0,(IF((F41=$I$35),(0.2*F41),IF(((0.8*F41)>$I$35),(0.2*F41),IF((H40=0),0,(F41-$I$35))))))","v":0},0,null,null,null,null,null,"-",{"$f":"IF((P38<>(N37*0.2)),0,(IF((N41=$Q$35),(0.2*N41),IF(((0.8*N41)>$Q$35),(0.2*N41),IF((P40=0),0,(N41-$Q$35))))))","v":0},{"$f":"P42","v":0}]
[null,null,null,null,{"$f":"E41+H42","v":1695267260.3567405},{"$f":"F41-H42","v":616460931.03881478},null,null,null,null,null,null,{"$f":"M41+P42","v":1695267260.3567405},{"$f":"N41-P42","v":511366515}]
[null,null,null,null,null,null,"-",{"$f":"IF((H40<>(F39*0.2)),0,(IF((F43=$I$35),(0.2*F43),IF(((0.8*F43)>$I$35),(0.2*F43),IF((H42=0),0,(F43-$I$35))))))","v":0},0,null,null,null,null,null,"-",{"$f":"IF((P40<>(N39*0.2)),0,(IF((N43=$Q$35),(0.2*N43),IF(((0.8*N43)>$Q$35),(0.2*N43),IF((P42=0),0,(N43-$Q$35))))))","v":0},{"$f":"P44","v":0}]
[null,null,null,"Final",{"$f":"E43+H44","v":1695267260.3567405},{"$f":"F43-H44","v":616460931.03881478},"Durée :",{"$f":"TIME(VLOOKUP(B16,'DATA COMMON'!A2:F87,4),VLOOKUP(B16,'DATA COMMON'!A2:F87,5),VLOOKUP(B16,'DATA COMMON'!A2:F87,6))","v":"01:01:11"},null,null,null,"Final",{"$f":"M43+P44","v":1695267260.3567405},{"$f":"N43-P44","v":511366515},"Durée :",{"$f":"TIME(VLOOKUP(B19,'DATA COMMON'!A2:F87,4),VLOOKUP(B19,'DATA COMMON'!A2:F87,5),VLOOKUP(B19,'DATA COMMON'!A2:F87,6))","v":"00:15:15"}]
[null,null,null,null,null,"Arrivée :",{"$f":"$D$1+H45","v":41378.501344097225},null,null,null,null,null,null,"Arrivée :",{"$f":"$D$1+P45","v":41378.469445949078}]
[]
[]
[]
[]
[]
[]
[]
[]
[]
[]
[]
[]
[]
[]
[]
[]
[]
[]
[]
[]
[]
[]
[]
[]
[]
[]
[]
[]
[]
[]
[]
[]
[]
[]
[]
[]
[]
[]
[]
[]
[]
[]
[]
[]
[]
[]
[]
[]
[]
[]
[]
[null,"Pseudo","Colonne2","TDC"]
[null,{"$f":"IF('DATA LXM'!L31=\"A PORTEE\",'DATA LXM'!M31,\"\")","v":"AB64"},null,{"$f":"IF('DATA LXM'!L31=\"A PORTEE\",'DATA LXM'!N31,\"\")","v":399362427}]
[null,{"$f":"IF('DATA BES'!L55=\"A PORTEE\",'DATA BES'!M55,\"\")","v":"Mimic"},null,{"$f":"IF('DATA BES'!L55=\"A PORTEE\",'DATA BES'!N55,\"\")","v":510734725}]
[null,{"$f":"IF('DATA LXM'!L27=\"A PORTEE\",'DATA LXM'!M27,\"\")","v":"Allerdyce"},null,{"$f":"IF('DATA LXM'!L27=\"A PORTEE\",'DATA LXM'!N27,\"\")","v":511366515}]
[null,{"$f":"IF('DATA BES'!L57=\"A PORTEE\",'DATA BES'!M57,\"\")","v":"Rita"},null,{"$f":"IF('DATA BES'!L57=\"A PORTEE\",'DATA BES'!N57,\"\")","v":616559697}]
[null,{"$f":"IF('DATA LXM'!L30=\"A PORTEE\",'DATA LXM'!M30,\"\")","v":"crunchy"},null,{"$f":"IF('DATA LXM'!L30=\"A PORTEE\",'DATA LXM'!N30,\"\")","v":637917142}]
[null,{"$f":"IF('DATA BES'!L58=\"A PORTEE\",'DATA BES'!M58,\"\")","v":"Taouret"},null,{"$f":"IF('DATA BES'!L58=\"A PORTEE\",'DATA BES'!N58,\"\")","v":688628575}]
[null,{"$f":"IF('DATA BES'!L54=\"A PORTEE\",'DATA BES'!M54,\"\")","v":"Ishigo"},null,{"$f":"IF('DATA BES'!L54=\"A PORTEE\",'DATA BES'!N54,\"\")","v":757282747}]
[null,{"$f":"IF('DATA BES'!L52=\"A PORTEE\",'DATA BES'!M52,\"\")","v":"CroolisVar"},null,{"$f":"IF('DATA BES'!L52=\"A PORTEE\",'DATA BES'!N52,\"\")","v":786759706}]
[null,{"$f":"IF('DATA BES'!L56=\"A PORTEE\",'DATA BES'!M56,\"\")","v":"Phenixx"},null,{"$f":"IF('DATA BES'!L56=\"A PORTEE\",'DATA BES'!N56,\"\")","v":908308062}]
[null,{"$f":"IF('DATA LXM'!L28=\"A PORTEE\",'DATA LXM'!M28,\"\")","v":"Fleau"},null,{"$f":"IF('DATA LXM'!L28=\"A PORTEE\",'DATA LXM'!N28,\"\")","v":1034979412}]
[null,{"$f":"IF('DATA LXM'!L29=\"A PORTEE\",'DATA LXM'!M29,\"\")","v":"Matteo37"},null,{"$f":"IF('DATA LXM'!L29=\"A PORTEE\",'DATA LXM'!N29,\"\")","v":1045506653}]
[null,{"$f":"IF('DATA BES'!L53=\"A PORTEE\",'DATA BES'!M53,\"\")","v":"hador"},null,{"$f":"IF('DATA BES'!L53=\"A PORTEE\",'DATA BES'!N53,\"\")","v":1289178436}]
[null,{"$f":"IF('DATA LXM'!L22=\"A PORTEE\",'DATA LXM'!M22,\"\")","v":""},null,{"$f":"IF('DATA LXM'!L22=\"A PORTEE\",'DATA LXM'!N22,\"\")","v":""}]
[null,{"$f":"IF('DATA LXM'!L23=\"A PORTEE\",'DATA LXM'!M23,\"\")","v":""},null,{"$f":"IF('DATA LXM'!L23=\"A PORTEE\",'DATA LXM'!N23,\"\")","v":""}]
[null,{"$f":"IF('DATA LXM'!L20=\"A PORTEE\",'DATA LXM'!M20,\"\")","v":""},null,{"$f":"IF('DATA LXM'!L20=\"A PORTEE\",'DATA LXM'!N20,\"\")","v":""}]
[null,{"$f":"IF('DATA LXM'!L21=\"A PORTEE\",'DATA LXM'!M21,\"\")","v":""},null,{"$f":"IF('DATA LXM'!L21=\"A PORTEE\",'DATA LXM'!N21,\"\")","v":""}]
[null,{"$f":"IF('DATA LXM'!L26=\"A PORTEE\",'DATA LXM'!M26,\"\")","v":""},null,{"$f":"IF('DATA LXM'!L26=\"A PORTEE\",'DATA LXM'!N26,\"\")","v":""}]
[null,{"$f":"IF('DATA LXM'!L18=\"A PORTEE\",'DATA LXM'!M18,\"\")","v":""},null,{"$f":"IF('DATA LXM'!L18=\"A PORTEE\",'DATA LXM'!N18,\"\")","v":""}]
[null,{"$f":"IF('DATA LXM'!L19=\"A PORTEE\",'DATA LXM'!M19,\"\")","v":""},null,{"$f":"IF('DATA LXM'!L19=\"A PORTEE\",'DATA LXM'!N19,\"\")","v":""}]
[null,{"$f":"IF('DATA LXM'!L24=\"A PORTEE\",'DATA LXM'!M24,\"\")","v":""},null,{"$f":"IF('DATA LXM'!L24=\"A PORTEE\",'DATA LXM'!N24,\"\")","v":""}]
[null,{"$f":"IF('DATA LXM'!L4=\"A PORTEE\",'DATA LXM'!M4,\"\")","v":""},null,{"$f":"IF('DATA LXM'!L4=\"A PORTEE\",'DATA LXM'!N4,\"\")","v":""}]
[null,{"$f":"IF('DATA LXM'!L5=\"A PORTEE\",'DATA LXM'!M5,\"\")","v":""},null,{"$f":"IF('DATA LXM'!L5=\"A PORTEE\",'DATA LXM'!N5,\"\")","v":""}]
[null,{"$f":"IF('DATA LXM'!L6=\"A PORTEE\",'DATA LXM'!M6,\"\")","v":""},null,{"$f":"IF('DATA LXM'!L6=\"A PORTEE\",'DATA LXM'!N6,\"\")","v":""}]
[null,{"$f":"IF('DATA LXM'!L7=\"A PORTEE\",'DATA LXM'!M7,\"\")","v":""},null,{"$f":"IF('DATA LXM'!L7=\"A PORTEE\",'DATA LXM'!N7,\"\")","v":""}]
[null,{"$f":"IF('DATA LXM'!L8=\"A PORTEE\",'DATA LXM'!M8,\"\")","v":""},null,{"$f":"IF('DATA LXM'!L8=\"A PORTEE\",'DATA LXM'!N8,\"\")","v":""}]
[null,{"$f":"IF('DATA LXM'!L9=\"A PORTEE\",'DATA LXM'!M9,\"\")","v":""},null,{"$f":"IF('DATA LXM'!L9=\"A PORTEE\",'DATA LXM'!N9,\"\")","v":""}]
[null,{"$f":"IF('DATA LXM'!L10=\"A PORTEE\",'DATA LXM'!M10,\"\")","v":""},null,{"$f":"IF('DATA LXM'!L10=\"A PORTEE\",'DATA LXM'!N10,\"\")","v":""}]
[null,{"$f":"IF('DATA LXM'!L11=\"A PORTEE\",'DATA LXM'!M11,\"\")","v":""},null,{"$f":"IF('DATA LXM'!L11=\"A PORTEE\",'DATA LXM'!N11,\"\")","v":""}]
[null,{"$f":"IF('DATA LXM'!L12=\"A PORTEE\",'DATA LXM'!M12,\"\")","v":""},null,{"$f":"IF('DATA LXM'!L12=\"A PORTEE\",'DATA LXM'!N12,\"\")","v":""}]
[null,{"$f":"IF('DATA LXM'!L13=\"A PORTEE\",'DATA LXM'!M13,\"\")","v":""},null,{"$f":"IF('DATA LXM'!L13=\"A PORTEE\",'DATA LXM'!N13,\"\")","v":""}]
[null,{"$f":"IF('DATA LXM'!L14=\"A PORTEE\",'DATA LXM'!M14,\"\")","v":""},null,{"$f":"IF('DATA LXM'!L14=\"A PORTEE\",'DATA LXM'!N14,\"\")","v":""}]
[null,{"$f":"IF('DATA LXM'!L15=\"A PORTEE\",'DATA LXM'!M15,\"\")","v":""},null,{"$f":"IF('DATA LXM'!L15=\"A PORTEE\",'DATA LXM'!N15,\"\")","v":""}]
[null,{"$f":"IF('DATA LXM'!L16=\"A PORTEE\",'DATA LXM'!M16,\"\")","v":""},null,{"$f":"IF('DATA LXM'!L16=\"A PORTEE\",'DATA LXM'!N16,\"\")","v":""}]
[null,{"$f":"IF('DATA LXM'!L17=\"A PORTEE\",'DATA LXM'!M17,\"\")","v":""},null,{"$f":"IF('DATA LXM'!L17=\"A PORTEE\",'DATA LXM'!N17,\"\")","v":""}]
[null,{"$f":"IF('DATA BES'!L2=\"A PORTEE\",'DATA BES'!M2,\"\")","v":""},null,{"$f":"IF('DATA BES'!L2=\"A PORTEE\",'DATA BES'!N2,\"\")","v":""}]
[null,{"$f":"IF('DATA BES'!L3=\"A PORTEE\",'DATA BES'!M3,\"\")","v":""},null,{"$f":"IF('DATA BES'!L3=\"A PORTEE\",'DATA BES'!N3,\"\")","v":""}]
[null,{"$f":"IF('DATA BES'!L4=\"A PORTEE\",'DATA BES'!M4,\"\")","v":""},null,{"$f":"IF('DATA BES'!L4=\"A PORTEE\",'DATA BES'!N4,\"\")","v":""}]
[null,{"$f":"IF('DATA BES'!L5=\"A PORTEE\",'DATA BES'!M5,\"\")","v":""},null,{"$f":"IF('DATA BES'!L5=\"A PORTEE\",'DATA BES'!N5,\"\")","v":""}]
[null,{"$f":"IF('DATA BES'!L6=\"A PORTEE\",'DATA BES'!M6,\"\")","v":""},null,{"$f":"IF('DATA BES'!L6=\"A PORTEE\",'DATA BES'!N6,\"\")","v":""}]
[null,{"$f":"IF('DATA BES'!L7=\"A PORTEE\",'DATA BES'!M7,\"\")","v":""},null,{"$f":"IF('DATA BES'!L7=\"A PORTEE\",'DATA BES'!N7,\"\")","v":""}]
[null,{"$f":"IF('DATA BES'!L8=\"A PORTEE\",'DATA BES'!M8,\"\")","v":""},null,{"$f":"IF('DATA BES'!L8=\"A PORTEE\",'DATA BES'!N8,\"\")","v":""}]
[null,{"$f":"IF('DATA BES'!L9=\"A PORTEE\",'DATA BES'!M9,\"\")","v":""},null,{"$f":"IF('DATA BES'!L9=\"A PORTEE\",'DATA BES'!N9,\"\")","v":""}]
[null,{"$f":"IF('DATA BES'!L10=\"A PORTEE\",'DATA BES'!M10,\"\")","v":""},null,{"$f":"IF('DATA BES'!L10=\"A PORTEE\",'DATA BES'!N10,\"\")","v":""}]
[null,{"$f":"IF('DATA BES'!L11=\"A PORTEE\",'DATA BES'!M11,\"\")","v":""},null,{"$f":"IF('DATA BES'!L11=\"A PORTEE\",'DATA BES'!N11,\"\")","v":""}]
[null,{"$f":"IF('DATA BES'!L12=\"A PORTEE\",'DATA BES'!M12,\"\")","v":""},null,{"$f":"IF('DATA BES'!L12=\"A PORTEE\",'DATA BES'!N12,\"\")","v":""}]
[null,{"$f":"IF('DATA BES'!L13=\"A PORTEE\",'DATA BES'!M13,\"\")","v":""},null,{"$f":"IF('DATA BES'!L13=\"A PORTEE\",'DATA BES'!N13,\"\")","v":""}]
[null,{"$f":"IF('DATA BES'!L14=\"A PORTEE\",'DATA BES'!M14,\"\")","v":""},null,{"$f":"IF('DATA BES'!L14=\"A PORTEE\",'DATA BES'!N14,\"\")","v":""}]
[null,{"$f":"IF('DATA BES'!L15=\"A PORTEE\",'DATA BES'!M15,\"\")","v":""},null,{"$f":"IF('DATA BES'!L15=\"A PORTEE\",'DATA BES'!N15,\"\")","v":""}]
[null,{"$f":"IF('DATA BES'!L16=\"A PORTEE\",'DATA BES'!M16,\"\")","v":""},null,{"$f":"IF('DATA BES'!L16=\"A PORTEE\",'DATA BES'!N16,\"\")","v":""}]
[null,{"$f":"IF('DATA BES'!L17=\"A PORTEE\",'DATA BES'!M17,\"\")","v":""},null,{"$f":"IF('DATA BES'!L17=\"A PORTEE\",'DATA BES'!N17,\"\")","v":""}]
[null,{"$f":"IF('DATA BES'!L18=\"A PORTEE\",'DATA BES'!M18,\"\")","v":""},null,{"$f":"IF('DATA BES'!L18=\"A PORTEE\",'DATA BES'!N18,\"\")","v":""}]
[null,{"$f":"IF('DATA BES'!L19=\"A PORTEE\",'DATA BES'!M19,\"\")","v":""},null,{"$f":"IF('DATA BES'!L19=\"A PORTEE\",'DATA BES'!N19,\"\")","v":""}]
[null,{"$f":"IF('DATA BES'!L20=\"A PORTEE\",'DATA BES'!M20,\"\")","v":""},null,{"$f":"IF('DATA BES'!L20=\"A PORTEE\",'DATA BES'!N20,\"\")","v":""}]
[null,{"$f":"IF('DATA BES'!L21=\"A PORTEE\",'DATA BES'!M21,\"\")","v":""},null,{"$f":"IF('DATA BES'!L21=\"A PORTEE\",'DATA BES'!N21,\"\")","v":""}]
[null,{"$f":"IF('DATA BES'!L22=\"A PORTEE\",'DATA BES'!M22,\"\")","v":""},null,{"$f":"IF('DATA BES'!L22=\"A PORTEE\",'DATA BES'!N22,\"\")","v":""}]
[null,{"$f":"IF('DATA BES'!L23=\"A PORTEE\",'DATA BES'!M23,\"\")","v":""},null,{"$f":"IF('DATA BES'!L23=\"A PORTEE\",'DATA BES'!N23,\"\")","v":""}]
[null,{"$f":"IF('DATA BES'!L24=\"A PORTEE\",'DATA BES'!M24,\"\")","v":""},null,{"$f":"IF('DATA BES'!L24=\"A PORTEE\",'DATA BES'!N24,\"\")","v":""}]
[null,{"$f":"IF('DATA BES'!L25=\"A PORTEE\",'DATA BES'!M25,\"\")","v":""},null,{"$f":"IF('DATA BES'!L25=\"A PORTEE\",'DATA BES'!N25,\"\")","v":""}]
[null,{"$f":"IF('DATA BES'!L26=\"A PORTEE\",'DATA BES'!M26,\"\")","v":""},null,{"$f":"IF('DATA BES'!L26=\"A PORTEE\",'DATA BES'!N26,\"\")","v":""}]
[null,{"$f":"IF('DATA BES'!L27=\"A PORTEE\",'DATA BES'!M27,\"\")","v":""},null,{"$f":"IF('DATA BES'!L27=\"A PORTEE\",'DATA BES'!N27,\"\")","v":""}]
[null,{"$f":"IF('DATA BES'!L28=\"A PORTEE\",'DATA BES'!M28,\"\")","v":""},null,{"$f":"IF('DATA BES'!L28=\"A PORTEE\",'DATA BES'!N28,\"\")","v":""}]
[null,{"$f":"IF('DATA BES'!L29=\"A PORTEE\",'DATA BES'!M29,\"\")","v":""},null,{"$f":"IF('DATA BES'!L29=\"A PORTEE\",'DATA BES'!N29,\"\")","v":""}]
[null,{"$f":"IF('DATA BES'!L30=\"A PORTEE\",'DATA BES'!M30,\"\")","v":""},null,{"$f":"IF('DATA BES'!L30=\"A PORTEE\",'DATA BES'!N30,\"\")","v":""}]
[null,{"$f":"IF('DATA BES'!L31=\"A PORTEE\",'DATA BES'!M31,\"\")","v":""},null,{"$f":"IF('DATA BES'!L31=\"A PORTEE\",'DATA BES'!N31,\"\")","v":""}]
[null,{"$f":"IF('DATA BES'!L32=\"A PORTEE\",'DATA BES'!M32,\"\")","v":""},null,{"$f":"IF('DATA BES'!L32=\"A PORTEE\",'DATA BES'!N32,\"\")","v":""}]
[null,{"$f":"IF('DATA BES'!L33=\"A PORTEE\",'DATA BES'!M33,\"\")","v":""},null,{"$f":"IF('DATA BES'!L33=\"A PORTEE\",'DATA BES'!N33,\"\")","v":""}]
[null,{"$f":"IF('DATA BES'!L34=\"A PORTEE\",'DATA BES'!M34,\"\")","v":""},null,{"$f":"IF('DATA BES'!L34=\"A PORTEE\",'DATA BES'!N34,\"\")","v":""}]
[null,{"$f":"IF('DATA BES'!L35=\"A PORTEE\",'DATA BES'!M35,\"\")","v":""},null,{"$f":"IF('DATA BES'!L35=\"A PORTEE\",'DATA BES'!N35,\"\")","v":""}]
[null,{"$f":"IF('DATA BES'!L36=\"A PORTEE\",'DATA BES'!M36,\"\")","v":""},null,{"$f":"IF('DATA BES'!L36=\"A PORTEE\",'DATA BES'!N36,\"\")","v":""}]
[null,{"$f":"IF('DATA BES'!L37=\"A PORTEE\",'DATA BES'!M37,\"\")","v":""},null,{"$f":"IF('DATA BES'!L37=\"A PORTEE\",'DATA BES'!N37,\"\")","v":""}]
[null,{"$f":"IF('DATA BES'!L38=\"A PORTEE\",'DATA BES'!M38,\"\")","v":""},null,{"$f":"IF('DATA BES'!L38=\"A PORTEE\",'DATA BES'!N38,\"\")","v":""}]
[null,{"$f":"IF('DATA BES'!L39=\"A PORTEE\",'DATA BES'!M39,\"\")","v":""},null,{"$f":"IF('DATA BES'!L39=\"A PORTEE\",'DATA BES'!N39,\"\")","v":""}]
[null,{"$f":"IF('DATA BES'!L40=\"A PORTEE\",'DATA BES'!M40,\"\")","v":""},null,{"$f":"IF('DATA BES'!L40=\"A PORTEE\",'DATA BES'!N40,\"\")","v":""}]
[null,{"$f":"IF('DATA BES'!L41=\"A PORTEE\",'DATA BES'!M41,\"\")","v":""},null,{"$f":"IF('DATA BES'!L41=\"A PORTEE\",'DATA BES'!N41,\"\")","v":""}]
[null,{"$f":"IF('DATA BES'!L42=\"A PORTEE\",'DATA BES'!M42,\"\")","v":""},null,{"$f":"IF('DATA BES'!L42=\"A PORTEE\",'DATA BES'!N42,\"\")","v":""}]
[null,{"$f":"IF('DATA BES'!L43=\"A PORTEE\",'DATA BES'!M43,\"\")","v":""},null,{"$f":"IF('DATA BES'!L43=\"A PORTEE\",'DATA BES'!N43,\"\")","v":""}]
[null,{"$f":"IF('DATA BES'!L44=\"A PORTEE\",'DATA BES'!M44,\"\")","v":""},null,{"$f":"IF('DATA BES'!L44=\"A PORTEE\",'DATA BES'!N44,\"\")","v":""}]
[null,{"$f":"IF('DATA BES'!L45=\"A PORTEE\",'DATA BES'!M45,\"\")","v":""},null,{"$f":"IF('DATA BES'!L45=\"A PORTEE\",'DATA BES'!N45,\"\")","v":""}]
[null,{"$f":"IF('DATA BES'!L46=\"A PORTEE\",'DATA BES'!M46,\"\")","v":""},null,{"$f":"IF('DATA BES'!L46=\"A PORTEE\",'DATA BES'!N46,\"\")","v":""}]
[null,{"$f":"IF('DATA BES'!L47=\"A PORTEE\",'DATA BES'!M47,\"\")","v":""},null,{"$f":"IF('DATA BES'!L47=\"A PORTEE\",'DATA BES'!N47,\"\")","v":""}]
[null,{"$f":"IF('DATA BES'!L48=\"A PORTEE\",'DATA BES'!M48,\"\")","v":""},null,{"$f":"IF('DATA BES'!L48=\"A PORTEE\",'DATA BES'!N48,\"\")","v":""}]
[null,{"$f":"IF('DATA BES'!L49=\"A PORTEE\",'DATA BES'!M49,\"\")","v":""},null,{"$f":"IF('DATA BES'!L49=\"A PORTEE\",'DATA BES'!N49,\"\")","v":""}]
[null,{"$f":"IF('DATA BES'!L50=\"A PORTEE\",'DATA BES'!M50,\"\")","v":""},null,{"$f":"IF('DATA BES'!L50=\"A PORTEE\",'DATA BES'!N50,\"\")","v":""}]
[null,{"$f":"IF('DATA BES'!L51=\"A PORTEE\",'DATA BES'!M51,\"\")","v":""},null,{"$f":"IF('DATA BES'!L51=\"A PORTEE\",'DATA BES'!N51,\"\")","v":""}]
[null,{"$f":"IF('DATA BES'!L59=\"A PORTEE\",'DATA BES'!M59,\"\")","v":""},null,{"$f":"IF('DATA BES'!L59=\"A PORTEE\",'DATA BES'!N59,\"\")","v":""}]
[null,{"$f":"IF('DATA BES'!L60=\"A PORTEE\",'DATA BES'!M60,\"\")","v":""},null,{"$f":"IF('DATA BES'!L60=\"A PORTEE\",'DATA BES'!N60,\"\")","v":""}]
[null,{"$f":"IF('DATA BES'!L61=\"A PORTEE\",'DATA BES'!M61,\"\")","v":""},null,{"$f":"IF('DATA BES'!L61=\"A PORTEE\",'DATA BES'!N61,\"\")","v":""}]
[null,{"$f":"IF('DATA BES'!L62=\"A PORTEE\",'DATA BES'!M62,\"\")","v":""},null,{"$f":"IF('DATA BES'!L62=\"A PORTEE\",'DATA BES'!N62,\"\")","v":""}]

{"sheet":"TRAQUE","index":8,"n_rows":214,"n_cols":30,"rows_kept":214,"cut":false,"hidden":false,"merged":[[1,14,2,14],[7,6,7,7],[7,8,7,9],[0,3,0,4],[0,9,0,11],[0,5,0,6]]}
[null,null,null,"Marge de lancement",null,"Temps loge ennemie",null,null,null,"Calcul de l'heure si absence de RC"]
[null,"Choisir un LXM","Heure dernier RC","minutes","secondes","minutes","secondes","VA",null,null,null,null,null,null,"Quantité sur sonde","Jsn","Sn","Ne","Js","S","C","Ce","A","Ae","Se","Tk","Tke","Tu","Tue","Temps Total"]
[null,"Allerdyce","17h30",1,30,1,null,{"$f":"VLOOKUP(B3,'DATA TRAQUE'!B2:D30,3)","v":24},null,"Heure de la sonde","Nombre d'evo de tdp","Soit Tdp Tueuse",null,null,null,15356,0,0,0,0,0,0,0,0,0,4568,25,0,0]
[null,null,null,null,null,null,null,null,null,"17h40",85,{"$f":"'DATA TRAQUE'!Q14*0.9^K4","v":0.35347920141860961},null,null,"Temps correspondant",{"$f":"TIME('DATA TRAQUE'!P19,'DATA TRAQUE'!Q19,'DATA TRAQUE'!R19)","v":"00:09:55"},{"$f":"TIME('DATA TRAQUE'!P20,'DATA TRAQUE'!Q20,'DATA TRAQUE'!R20)","v":"00:00:00"},{"$f":"TIME('DATA TRAQUE'!P21,'DATA TRAQUE'!Q21,'DATA TRAQUE'!R21)","v":"00:00:00"},{"$f":"TIME('DATA TRAQUE'!P22,'DATA TRAQUE'!Q22,'DATA TRAQUE'!R22)","v":"00:00:00"},{"$f":"TIME('DATA TRAQUE'!P23,'DATA TRAQUE'!Q23,'DATA TRAQUE'!R23)","v":"00:00:00"},{"$f":"TIME('DATA TRAQUE'!P24,'DATA TRAQUE'!Q24,'DATA TRAQUE'!R24)","v":"00:00:00"},{"$f":"TIME('DATA TRAQUE'!P25,'DATA TRAQUE'!Q25,'DATA TRAQUE'!R25)","v":"00:00:00"},{"$f":"TIME('DATA TRAQUE'!P26,'DATA TRAQUE'!Q26,'DATA TRAQUE'!R26)","v":"00:00:00"},{"$f":"TIME('DATA TRAQUE'!P27,'DATA TRAQUE'!Q27,'DATA TRAQUE'!R27)","v":"00:00:00"},{"$f":"TIME('DATA TRAQUE'!P28,'DATA TRAQUE'!Q28,'DATA TRAQUE'!R28)","v":"00:00:00"},{"$f":"TIME('DATA TRAQUE'!P29,'DATA TRAQUE'!Q29,'DATA TRAQUE'!R29)","v":"00:18:17"},{"$f":"TIME('DATA TRAQUE'!P30,'DATA TRAQUE'!Q30,'DATA TRAQUE'!R30)","v":"00:00:06"},{"$f":"TIME('DATA TRAQUE'!P31,'DATA TRAQUE'!Q31,'DATA TRAQUE'!R31)","v":"00:00:00"},{"$f":"TIME('DATA TRAQUE'!P32,'DATA TRAQUE'!Q32,'DATA TRAQUE'!R32)","v":"00:00:00"},{"$f":"'DATA TRAQUE'!P34","v":"00:28:18"}]
[null,"TDC","x","y",null,null,null,null,null,"Heure de départ"]
[null,{"$f":"VLOOKUP(B3,'DATA TRAQUE'!B2:D30,2)","v":511366515},{"$f":"VLOOKUP(B3,'DATA TRAQUE'!B2:F30,4)","v":9},{"$f":"VLOOKUP(B3,'DATA TRAQUE'!B2:F30,5)","v":172},null,null,null,null,null,{"$f":"'DATA TRAQUE'!M6-'DATA TRAQUE'!P34","v":"17:11:42"}]
[]
[null,null,null,null,null,null,"DOME",null,"LOGE"]
[null,"Joueur","TDC","Distance","Temps","A portée ?","Heure d'arrivée","Lancer à partir de ","Heure d'arrivée2","Lancer à partir de 2"]
[null,{"$f":"'DATA TRAQUE'!B41","v":"_Angel_"},{"$f":"'DATA TRAQUE'!C41","v":45216292},{"$f":"SQRT(($C$6-'DATA TRAQUE'!D41)^2+(TRAQUE!$D$6-'DATA TRAQUE'!E41)^2)","v":31.016124838541646},{"$f":"CONCATENATE('DATA TRAQUE'!G41,\"h\",'DATA TRAQUE'!H41,\"min\",'DATA TRAQUE'!I41,\"s\")","v":"1h11min51s"},{"$f":"IF(AND((C10<=(3*$B$6)),(C10>=(0.5*$B$6))),\"A PORTEE\",\" \")","v":" "},{"$f":"IF(F10=\"A PORTEE\",'DATA TRAQUE'!$M$2+TIME(0,$D$3,$E$3)+TIME('DATA TRAQUE'!G41,'DATA TRAQUE'!H41,'DATA TRAQUE'!I41),\" \")","v":" "},{"$f":"IF(F10=\"A PORTEE\",G10-VLOOKUP($B$3,'DATA TRAQUE'!$B$41:$L$126,11),\"\")","v":""},{"$f":"IF(F10=\"A PORTEE\",'DATA TRAQUE'!$M$2+TIME(0,$D$3,$E$3)+2*TIME('DATA TRAQUE'!G41,'DATA TRAQUE'!H41,'DATA TRAQUE'!I41)+TIME(0,$F$3,$G$3),\" \")","v":" "},{"$f":"IF(F10=\"A PORTEE\",I10-VLOOKUP($B$3,'DATA TRAQUE'!$B$41:$L$126,11),\"\")","v":""}]
[null,{"$f":"'DATA TRAQUE'!B42","v":"_diablo_"},{"$f":"'DATA TRAQUE'!C42","v":134710356},{"$f":"SQRT(($C$6-'DATA TRAQUE'!D42)^2+(TRAQUE!$D$6-'DATA TRAQUE'!E42)^2)","v":4.1231056256176606},{"$f":"CONCATENATE('DATA TRAQUE'!G42,\"h\",'DATA TRAQUE'!H42,\"min\",'DATA TRAQUE'!I42,\"s\")","v":"0h9min56s"}," ",{"$f":"IF(F11=\"A PORTEE\",'DATA TRAQUE'!$M$2+TIME(0,$D$3,$E$3)+TIME('DATA TRAQUE'!G42,'DATA TRAQUE'!H42,'DATA TRAQUE'!I42),\" \")","v":" "},{"$f":"IF(F11=\"A PORTEE\",G11-VLOOKUP($B$3,'DATA TRAQUE'!$B$41:$L$126,11),\"\")","v":""},{"$f":"IF(F11=\"A PORTEE\",'DATA TRAQUE'!$M$2+TIME(0,$D$3,$E$3)+2*TIME('DATA TRAQUE'!G42,'DATA TRAQUE'!H42,'DATA TRAQUE'!I42)+TIME(0,$F$3,$G$3),\" \")","v":" "},{"$f":"IF(F11=\"A PORTEE\",I11-VLOOKUP($B$3,'DATA TRAQUE'!$B$41:$L$126,11),\"\")","v":""}]
[null,{"$f":"'DATA TRAQUE'!B43","v":"_Wolverine_"},{"$f":"'DATA TRAQUE'!C43","v":573345},{"$f":"SQRT(($C$6-'DATA TRAQUE'!D43)^2+(TRAQUE!$D$6-'DATA TRAQUE'!E43)^2)","v":27.018512172212592},{"$f":"CONCATENATE('DATA TRAQUE'!G43,\"h\",'DATA TRAQUE'!H43,\"min\",'DATA TRAQUE'!I43,\"s\")","v":"1h2min57s"}," ",{"$f":"IF(F12=\"A PORTEE\",'DATA TRAQUE'!$M$2+TIME(0,$D$3,$E$3)+TIME('DATA TRAQUE'!G43,'DATA TRAQUE'!H43,'DATA TRAQUE'!I43),\" \")","v":" "},{"$f":"IF(F12=\"A PORTEE\",G12-VLOOKUP($B$3,'DATA TRAQUE'!$B$41:$L$126,11),\"\")","v":""},{"$f":"IF(F12=\"A PORTEE\",'DATA TRAQUE'!$M$2+TIME(0,$D$3,$E$3)+2*TIME('DATA TRAQUE'!G43,'DATA TRAQUE'!H43,'DATA TRAQUE'!I43)+TIME(0,$F$3,$G$3),\" \")","v":" "},{"$f":"IF(F12=\"A PORTEE\",I12-VLOOKUP($B$3,'DATA TRAQUE'!$B$41:$L$126,11),\"\")","v":""}]
[null,{"$f":"'DATA TRAQUE'!B44","v":"4midiable"},{"$f":"'DATA TRAQUE'!C44","v":1940203},{"$f":"SQRT(($C$6-'DATA TRAQUE'!D44)^2+(TRAQUE!$D$6-'DATA TRAQUE'!E44)^2)","v":32.893768406797051},{"$f":"CONCATENATE('DATA TRAQUE'!G44,\"h\",'DATA TRAQUE'!H44,\"min\",'DATA TRAQUE'!I44,\"s\")","v":"1h15min60s"}," ",{"$f":"IF(F13=\"A PORTEE\",'DATA TRAQUE'!$M$2+TIME(0,$D$3,$E$3)+TIME('DATA TRAQUE'!G44,'DATA TRAQUE'!H44,'DATA TRAQUE'!I44),\" \")","v":" "},{"$f":"IF(F13=\"A PORTEE\",G13-VLOOKUP($B$3,'DATA TRAQUE'!$B$41:$L$126,11),\"\")","v":""},{"$f":"IF(F13=\"A PORTEE\",'DATA TRAQUE'!$M$2+TIME(0,$D$3,$E$3)+2*TIME('DATA TRAQUE'!G44,'DATA TRAQUE'!H44,'DATA TRAQUE'!I44)+TIME(0,$F$3,$G$3),\" \")","v":" "},{"$f":"IF(F13=\"A PORTEE\",I13-VLOOKUP($B$3,'DATA TRAQUE'!$B$41:$L$126,11),\"\")","v":""}]
[null,{"$f":"'DATA TRAQUE'!B45","v":"AB64"},{"$f":"'DATA TRAQUE'!C45","v":399362427},{"$f":"SQRT(($C$6-'DATA TRAQUE'!D45)^2+(TRAQUE!$D$6-'DATA TRAQUE'!E45)^2)","v":158.53390804493529},{"$f":"CONCATENATE('DATA TRAQUE'!G45,\"h\",'DATA TRAQUE'!H45,\"min\",'DATA TRAQUE'!I45,\"s\")","v":"5h8min34s"},"A PORTEE",{"$f":"IF(F14=\"A PORTEE\",'DATA TRAQUE'!$M$2+TIME(0,$D$3,$E$3)+TIME('DATA TRAQUE'!G45,'DATA TRAQUE'!H45,'DATA TRAQUE'!I45),\" \")","v":"22:40:04"},{"$f":"IF(F14=\"A PORTEE\",G14-VLOOKUP($B$3,'DATA TRAQUE'!$B$41:$L$126,11),\"\")","v":"22:24:49"},{"$f":"IF(F14=\"A PORTEE\",'DATA TRAQUE'!$M$2+TIME(0,$D$3,$E$3)+2*TIME('DATA TRAQUE'!G45,'DATA TRAQUE'!H45,'DATA TRAQUE'!I45)+TIME(0,$F$3,$G$3),\" \")","v":1.1594675925925928},{"$f":"IF(F14=\"A PORTEE\",I14-VLOOKUP($B$3,'DATA TRAQUE'!$B$41:$L$126,11),\"\")","v":1.148877314814815}]
[null,{"$f":"'DATA TRAQUE'!B70","v":"agecanonix"},{"$f":"'DATA TRAQUE'!C70","v":3461184525},{"$f":"SQRT(($C$6-'DATA TRAQUE'!D70)^2+(TRAQUE!$D$6-'DATA TRAQUE'!E70)^2)","v":99.045444115315064},{"$f":"CONCATENATE('DATA TRAQUE'!G70,\"h\",'DATA TRAQUE'!H70,\"min\",'DATA TRAQUE'!I70,\"s\")","v":"3h28min48s"}," ",{"$f":"IF(F15=\"A PORTEE\",'DATA TRAQUE'!$M$2+TIME(0,$D$3,$E$3)+TIME('DATA TRAQUE'!G70,'DATA TRAQUE'!H70,'DATA TRAQUE'!I70),\" \")","v":" "},{"$f":"IF(F15=\"A PORTEE\",G15-VLOOKUP($B$3,'DATA TRAQUE'!$B$41:$L$126,11),\"\")","v":""},{"$f":"IF(F15=\"A PORTEE\",'DATA TRAQUE'!$M$2+TIME(0,$D$3,$E$3)+2*TIME('DATA TRAQUE'!G46,'DATA TRAQUE'!H46,'DATA TRAQUE'!I46)+TIME(0,$F$3,$G$3),\" \")","v":" "},{"$f":"IF(F15=\"A PORTEE\",I15-VLOOKUP($B$3,'DATA TRAQUE'!$B$41:$L$126,11),\"\")","v":""}]
[null,{"$f":"'DATA TRAQUE'!B46","v":"Allerdyce"},{"$f":"'DATA TRAQUE'!C46","v":511366515},{"$f":"SQRT(($C$6-'DATA TRAQUE'!D46)^2+(TRAQUE!$D$6-'DATA TRAQUE'!E46)^2)","v":0},{"$f":"CONCATENATE('DATA TRAQUE'!G46,\"h\",'DATA TRAQUE'!H46,\"min\",'DATA TRAQUE'!I46,\"s\")","v":"0h0min0s"},"A PORTEE",{"$f":"IF(F16=\"A PORTEE\",'DATA TRAQUE'!$M$2+TIME(0,$D$3,$E$3)+TIME('DATA TRAQUE'!G46,'DATA TRAQUE'!H46,'DATA TRAQUE'!I46),\" \")","v":"17:31:30"},{"$f":"IF(F16=\"A PORTEE\",G16-VLOOKUP($B$3,'DATA TRAQUE'!$B$41:$L$126,11),\"\")","v":"17:16:15"},{"$f":"IF(F16=\"A PORTEE\",'DATA TRAQUE'!$M$2+TIME(0,$D$3,$E$3)+2*TIME('DATA TRAQUE'!G47,'DATA TRAQUE'!H47,'DATA TRAQUE'!I47)+TIME(0,$F$3,$G$3),\" \")","v":"21:31:34"},{"$f":"IF(F16=\"A PORTEE\",I16-VLOOKUP($B$3,'DATA TRAQUE'!$B$41:$L$126,11),\"\")","v":"21:16:19"}]
[null,{"$f":"'DATA TRAQUE'!B71","v":"aubertignac"},{"$f":"'DATA TRAQUE'!C71","v":87905571},{"$f":"SQRT(($C$6-'DATA TRAQUE'!D71)^2+(TRAQUE!$D$6-'DATA TRAQUE'!E71)^2)","v":120.03749414245534},{"$f":"CONCATENATE('DATA TRAQUE'!G71,\"h\",'DATA TRAQUE'!H71,\"min\",'DATA TRAQUE'!I71,\"s\")","v":"4h5min57s"}," ",{"$f":"IF(F17=\"A PORTEE\",'DATA TRAQUE'!$M$2+TIME(0,$D$3,$E$3)+TIME('DATA TRAQUE'!G71,'DATA TRAQUE'!H71,'DATA TRAQUE'!I71),\" \")","v":" "},{"$f":"IF(F17=\"A PORTEE\",G17-VLOOKUP($B$3,'DATA TRAQUE'!$B$41:$L$126,11),\"\")","v":""},{"$f":"IF(F17=\"A PORTEE\",'DATA TRAQUE'!$M$2+TIME(0,$D$3,$E$3)+2*TIME('DATA TRAQUE'!G48,'DATA TRAQUE'!H48,'DATA TRAQUE'!I48)+TIME(0,$F$3,$G$3),\" \")","v":" "},{"$f":"IF(F17=\"A PORTEE\",I17-VLOOKUP($B$3,'DATA TRAQUE'!$B$41:$L$126,11),\"\")","v":""}]
[null,{"$f":"'DATA TRAQUE'!B72","v":"Azkanith"},{"$f":"'DATA TRAQUE'!C72","v":3500000000},{"$f":"SQRT(($C$6-'DATA TRAQUE'!D72)^2+(TRAQUE!$D$6-'DATA TRAQUE'!E72)^2)","v":112.61438629233834},{"$f":"CONCATENATE('DATA TRAQUE'!G72,\"h\",'DATA TRAQUE'!H72,\"min\",'DATA TRAQUE'!I72,\"s\")","v":"3h53min4s"}," ",{"$f":"IF(F18=\"A PORTEE\",'DATA TRAQUE'!$M$2+TIME(0,$D$3,$E$3)+TIME('DATA TRAQUE'!G72,'DATA TRAQUE'!H72,'DATA TRAQUE'!I72),\" \")","v":" "},{"$f":"IF(F18=\"A PORTEE\",G18-VLOOKUP($B$3,'DATA TRAQUE'!$B$41:$L$126,11),\"\")","v":""},{"$f":"IF(F18=\"A PORTEE\",'DATA TRAQUE'!$M$2+TIME(0,$D$3,$E$3)+2*TIME('DATA TRAQUE'!G49,'DATA TRAQUE'!H49,'DATA TRAQUE'!I49)+TIME(0,$F$3,$G$3),\" \")","v":" "},{"$f":"IF(F18=\"A PORTEE\",I18-VLOOKUP($B$3,'DATA TRAQUE'!$B$41:$L$126,11),\"\")","v":""}]
[null,{"$f":"'DATA TRAQUE'!B73","v":"Bactroban"},{"$f":"'DATA TRAQUE'!C73","v":2154874164},{"$f":"SQRT(($C$6-'DATA TRAQUE'!D73)^2+(TRAQUE!$D$6-'DATA TRAQUE'!E73)^2)","v":58.051701094799967},{"$f":"CONCATENATE('DATA TRAQUE'!G73,\"h\",'DATA TRAQUE'!H73,\"min\",'DATA TRAQUE'!I73,\"s\")","v":"2h9min29s"}," ",{"$f":"IF(F19=\"A PORTEE\",'DATA TRAQUE'!$M$2+TIME(0,$D$3,$E$3)+TIME('DATA TRAQUE'!G73,'DATA TRAQUE'!H73,'DATA TRAQUE'!I73),\" \")","v":" "},{"$f":"IF(F19=\"A PORTEE\",G19-VLOOKUP($B$3,'DATA TRAQUE'!$B$41:$L$126,11),\"\")","v":""},{"$f":"IF(F19=\"A PORTEE\",'DATA TRAQUE'!$M$2+TIME(0,$D$3,$E$3)+2*TIME('DATA TRAQUE'!G50,'DATA TRAQUE'!H50,'DATA TRAQUE'!I50)+TIME(0,$F$3,$G$3),\" \")","v":" "},{"$f":"IF(F19=\"A PORTEE\",I19-VLOOKUP($B$3,'DATA TRAQUE'!$B$41:$L$126,11),\"\")","v":""}]
[null,{"$f":"'DATA TRAQUE'!B74","v":"ben57"},{"$f":"'DATA TRAQUE'!C74","v":149380852},{"$f":"SQRT(($C$6-'DATA TRAQUE'!D74)^2+(TRAQUE!$D$6-'DATA TRAQUE'!E74)^2)","v":167.58579892103029},{"$f":"CONCATENATE('DATA TRAQUE'!G74,\"h\",'DATA TRAQUE'!H74,\"min\",'DATA TRAQUE'!I74,\"s\")","v":"5h22min19s"}," ",{"$f":"IF(F20=\"A PORTEE\",'DATA TRAQUE'!$M$2+TIME(0,$D$3,$E$3)+TIME('DATA TRAQUE'!G74,'DATA TRAQUE'!H74,'DATA TRAQUE'!I74),\" \")","v":" "},{"$f":"IF(F20=\"A PORTEE\",G20-VLOOKUP($B$3,'DATA TRAQUE'!$B$41:$L$126,11),\"\")","v":""},{"$f":"IF(F20=\"A PORTEE\",'DATA TRAQUE'!$M$2+TIME(0,$D$3,$E$3)+2*TIME('DATA TRAQUE'!G51,'DATA TRAQUE'!H51,'DATA TRAQUE'!I51)+TIME(0,$F$3,$G$3),\" \")","v":" "},{"$f":"IF(F20=\"A PORTEE\",I20-VLOOKUP($B$3,'DATA TRAQUE'!$B$41:$L$126,11),\"\")","v":""}]
[null,{"$f":"'DATA TRAQUE'!B75","v":"bib595"},{"$f":"'DATA TRAQUE'!C75","v":2905019},{"$f":"SQRT(($C$6-'DATA TRAQUE'!D75)^2+(TRAQUE!$D$6-'DATA TRAQUE'!E75)^2)","v":65.069193939989759},{"$f":"CONCATENATE('DATA TRAQUE'!G75,\"h\",'DATA TRAQUE'!H75,\"min\",'DATA TRAQUE'!I75,\"s\")","v":"2h23min43s"}," ",{"$f":"IF(F21=\"A PORTEE\",'DATA TRAQUE'!$M$2+TIME(0,$D$3,$E$3)+TIME('DATA TRAQUE'!G75,'DATA TRAQUE'!H75,'DATA TRAQUE'!I75),\" \")","v":" "},{"$f":"IF(F21=\"A PORTEE\",G21-VLOOKUP($B$3,'DATA TRAQUE'!$B$41:$L$126,11),\"\")","v":""},{"$f":"IF(F21=\"A PORTEE\",'DATA TRAQUE'!$M$2+TIME(0,$D$3,$E$3)+2*TIME('DATA TRAQUE'!G52,'DATA TRAQUE'!H52,'DATA TRAQUE'!I52)+TIME(0,$F$3,$G$3),\" \")","v":" "},{"$f":"IF(F21=\"A PORTEE\",I21-VLOOKUP($B$3,'DATA TRAQUE'!$B$41:$L$126,11),\"\")","v":""}]
[null,{"$f":"'DATA TRAQUE'!B76","v":"bill"},{"$f":"'DATA TRAQUE'!C76","v":54154338},{"$f":"SQRT(($C$6-'DATA TRAQUE'!D76)^2+(TRAQUE!$D$6-'DATA TRAQUE'!E76)^2)","v":60.827625302982199},{"$f":"CONCATENATE('DATA TRAQUE'!G76,\"h\",'DATA TRAQUE'!H76,\"min\",'DATA TRAQUE'!I76,\"s\")","v":"2h15min9s"}," ",{"$f":"IF(F22=\"A PORTEE\",'DATA TRAQUE'!$M$2+TIME(0,$D$3,$E$3)+TIME('DATA TRAQUE'!G76,'DATA TRAQUE'!H76,'DATA TRAQUE'!I76),\" \")","v":" "},{"$f":"IF(F22=\"A PORTEE\",G22-VLOOKUP($B$3,'DATA TRAQUE'!$B$41:$L$126,11),\"\")","v":""},{"$f":"IF(F22=\"A PORTEE\",'DATA TRAQUE'!$M$2+TIME(0,$D$3,$E$3)+2*TIME('DATA TRAQUE'!G53,'DATA TRAQUE'!H53,'DATA TRAQUE'!I53)+TIME(0,$F$3,$G$3),\" \")","v":" "},{"$f":"IF(F22=\"A PORTEE\",I22-VLOOKUP($B$3,'DATA TRAQUE'!$B$41:$L$126,11),\"\")","v":""}]
[null,{"$f":"'DATA TRAQUE'!B77","v":"Bruxelles"},{"$f":"'DATA TRAQUE'!C77","v":3200000000},{"$f":"SQRT(($C$6-'DATA TRAQUE'!D77)^2+(TRAQUE!$D$6-'DATA TRAQUE'!E77)^2)","v":120.33287165193059},{"$f":"CONCATENATE('DATA TRAQUE'!G77,\"h\",'DATA TRAQUE'!H77,\"min\",'DATA TRAQUE'!I77,\"s\")","v":"4h6min28s"}," ",{"$f":"IF(F23=\"A PORTEE\",'DATA TRAQUE'!$M$2+TIME(0,$D$3,$E$3)+TIME('DATA TRAQUE'!G77,'DATA TRAQUE'!H77,'DATA TRAQUE'!I77),\" \")","v":" "},{"$f":"IF(F23=\"A PORTEE\",G23-VLOOKUP($B$3,'DATA TRAQUE'!$B$41:$L$126,11),\"\")","v":""},{"$f":"IF(F23=\"A PORTEE\",'DATA TRAQUE'!$M$2+TIME(0,$D$3,$E$3)+2*TIME('DATA TRAQUE'!G54,'DATA TRAQUE'!H54,'DATA TRAQUE'!I54)+TIME(0,$F$3,$G$3),\" \")","v":" "},{"$f":"IF(F23=\"A PORTEE\",I23-VLOOKUP($B$3,'DATA TRAQUE'!$B$41:$L$126,11),\"\")","v":""}]
[null,{"$f":"'DATA TRAQUE'!B47","v":"bubulle"},{"$f":"'DATA TRAQUE'!C47","v":3255300},{"$f":"SQRT(($C$6-'DATA TRAQUE'!D47)^2+(TRAQUE!$D$6-'DATA TRAQUE'!E47)^2)","v":53.235326616824658},{"$f":"CONCATENATE('DATA TRAQUE'!G47,\"h\",'DATA TRAQUE'!H47,\"min\",'DATA TRAQUE'!I47,\"s\")","v":"1h59min32s"}," ",{"$f":"IF(F24=\"A PORTEE\",'DATA TRAQUE'!$M$2+TIME(0,$D$3,$E$3)+TIME('DATA TRAQUE'!G47,'DATA TRAQUE'!H47,'DATA TRAQUE'!I47),\" \")","v":" "},{"$f":"IF(F24=\"A PORTEE\",G24-VLOOKUP($B$3,'DATA TRAQUE'!$B$41:$L$126,11),\"\")","v":""},{"$f":"IF(F24=\"A PORTEE\",'DATA TRAQUE'!$M$2+TIME(0,$D$3,$E$3)+2*TIME('DATA TRAQUE'!G55,'DATA TRAQUE'!H55,'DATA TRAQUE'!I55)+TIME(0,$F$3,$G$3),\" \")","v":" "},{"$f":"IF(F24=\"A PORTEE\",I24-VLOOKUP($B$3,'DATA TRAQUE'!$B$41:$L$126,11),\"\")","v":""}]
[null,{"$f":"'DATA TRAQUE'!B78","v":"Chryom"},{"$f":"'DATA TRAQUE'!C78","v":9996200},{"$f":"SQRT(($C$6-'DATA TRAQUE'!D78)^2+(TRAQUE!$D$6-'DATA TRAQUE'!E78)^2)","v":114},{"$f":"CONCATENATE('DATA TRAQUE'!G78,\"h\",'DATA TRAQUE'!H78,\"min\",'DATA TRAQUE'!I78,\"s\")","v":"3h55min30s"}," ",{"$f":"IF(F25=\"A PORTEE\",'DATA TRAQUE'!$M$2+TIME(0,$D$3,$E$3)+TIME('DATA TRAQUE'!G78,'DATA TRAQUE'!H78,'DATA TRAQUE'!I78),\" \")","v":" "},{"$f":"IF(F25=\"A PORTEE\",G25-VLOOKUP($B$3,'DATA TRAQUE'!$B$41:$L$126,11),\"\")","v":""},{"$f":"IF(F25=\"A PORTEE\",'DATA TRAQUE'!$M$2+TIME(0,$D$3,$E$3)+2*TIME('DATA TRAQUE'!G56,'DATA TRAQUE'!H56,'DATA TRAQUE'!I56)+TIME(0,$F$3,$G$3),\" \")","v":" "},{"$f":"IF(F25=\"A PORTEE\",I25-VLOOKUP($B$3,'DATA TRAQUE'!$B$41:$L$126,11),\"\")","v":""}]
[null,{"$f":"'DATA TRAQUE'!B48","v":"creamy"},{"$f":"'DATA TRAQUE'!C48","v":4979692},{"$f":"SQRT(($C$6-'DATA TRAQUE'!D48)^2+(TRAQUE!$D$6-'DATA TRAQUE'!E48)^2)","v":30.265491900843113},{"$f":"CONCATENATE('DATA TRAQUE'!G48,\"h\",'DATA TRAQUE'!H48,\"min\",'DATA TRAQUE'!I48,\"s\")","v":"1h10min11s"}," ",{"$f":"IF(F26=\"A PORTEE\",'DATA TRAQUE'!$M$2+TIME(0,$D$3,$E$3)+TIME('DATA TRAQUE'!G48,'DATA TRAQUE'!H48,'DATA TRAQUE'!I48),\" \")","v":" "},{"$f":"IF(F26=\"A PORTEE\",G26-VLOOKUP($B$3,'DATA TRAQUE'!$B$41:$L$126,11),\"\")","v":""},{"$f":"IF(F26=\"A PORTEE\",'DATA TRAQUE'!$M$2+TIME(0,$D$3,$E$3)+2*TIME('DATA TRAQUE'!G57,'DATA TRAQUE'!H57,'DATA TRAQUE'!I57)+TIME(0,$F$3,$G$3),\" \")","v":" "},{"$f":"IF(F26=\"A PORTEE\",I26-VLOOKUP($B$3,'DATA TRAQUE'!$B$41:$L$126,11),\"\")","v":""}]
[null,{"$f":"'DATA TRAQUE'!B79","v":"CroolisVar"},{"$f":"'DATA TRAQUE'!C79","v":786759706},{"$f":"SQRT(($C$6-'DATA TRAQUE'!D79)^2+(TRAQUE!$D$6-'DATA TRAQUE'!E79)^2)","v":47.381430961928537},{"$f":"CONCATENATE('DATA TRAQUE'!G79,\"h\",'DATA TRAQUE'!H79,\"min\",'DATA TRAQUE'!I79,\"s\")","v":"1h47min16s"},"A PORTEE",{"$f":"IF(F27=\"A PORTEE\",'DATA TRAQUE'!$M$2+TIME(0,$D$3,$E$3)+TIME('DATA TRAQUE'!G79,'DATA TRAQUE'!H79,'DATA TRAQUE'!I79),\" \")","v":"19:18:46"},{"$f":"IF(F27=\"A PORTEE\",G27-VLOOKUP($B$3,'DATA TRAQUE'!$B$41:$L$126,11),\"\")","v":"19:03:31"},{"$f":"IF(F27=\"A PORTEE\",'DATA TRAQUE'!$M$2+TIME(0,$D$3,$E$3)+2*TIME('DATA TRAQUE'!G58,'DATA TRAQUE'!H58,'DATA TRAQUE'!I58)+TIME(0,$F$3,$G$3),\" \")","v":"20:18:40"},{"$f":"IF(F27=\"A PORTEE\",I27-VLOOKUP($B$3,'DATA TRAQUE'!$B$41:$L$126,11),\"\")","v":"20:03:25"}]
[null,{"$f":"'DATA TRAQUE'!B49","v":"crunchy"},{"$f":"'DATA TRAQUE'!C49","v":637917142},{"$f":"SQRT(($C$6-'DATA TRAQUE'!D49)^2+(TRAQUE!$D$6-'DATA TRAQUE'!E49)^2)","v":137.2953021774598},{"$f":"CONCATENATE('DATA TRAQUE'!G49,\"h\",'DATA TRAQUE'!H49,\"min\",'DATA TRAQUE'!I49,\"s\")","v":"4h34min53s"},"A PORTEE",{"$f":"IF(F28=\"A PORTEE\",'DATA TRAQUE'!$M$2+TIME(0,$D$3,$E$3)+TIME('DATA TRAQUE'!G49,'DATA TRAQUE'!H49,'DATA TRAQUE'!I49),\" \")","v":"22:06:23"},{"$f":"IF(F28=\"A PORTEE\",G28-VLOOKUP($B$3,'DATA TRAQUE'!$B$41:$L$126,11),\"\")","v":"21:51:08"},{"$f":"IF(F28=\"A PORTEE\",'DATA TRAQUE'!$M$2+TIME(0,$D$3,$E$3)+2*TIME('DATA TRAQUE'!G59,'DATA TRAQUE'!H59,'DATA TRAQUE'!I59)+TIME(0,$F$3,$G$3),\" \")","v":"18:26:50"},{"$f":"IF(F28=\"A PORTEE\",I28-VLOOKUP($B$3,'DATA TRAQUE'!$B$41:$L$126,11),\"\")","v":"18:11:35"}]
[null,{"$f":"'DATA TRAQUE'!B50","v":"Cyclope"},{"$f":"'DATA TRAQUE'!C50","v":111173},{"$f":"SQRT(($C$6-'DATA TRAQUE'!D50)^2+(TRAQUE!$D$6-'DATA TRAQUE'!E50)^2)","v":2},{"$f":"CONCATENATE('DATA TRAQUE'!G50,\"h\",'DATA TRAQUE'!H50,\"min\",'DATA TRAQUE'!I50,\"s\")","v":"0h4min50s"}," ",{"$f":"IF(F29=\"A PORTEE\",'DATA TRAQUE'!$M$2+TIME(0,$D$3,$E$3)+TIME('DATA TRAQUE'!G50,'DATA TRAQUE'!H50,'DATA TRAQUE'!I50),\" \")","v":" "},{"$f":"IF(F29=\"A PORTEE\",G29-VLOOKUP($B$3,'DATA TRAQUE'!$B$41:$L$126,11),\"\")","v":""},{"$f":"IF(F29=\"A PORTEE\",'DATA TRAQUE'!$M$2+TIME(0,$D$3,$E$3)+2*TIME('DATA TRAQUE'!G60,'DATA TRAQUE'!H60,'DATA TRAQUE'!I60)+TIME(0,$F$3,$G$3),\" \")","v":" "},{"$f":"IF(F29=\"A PORTEE\",I29-VLOOKUP($B$3,'DATA TRAQUE'!$B$41:$L$126,11),\"\")","v":""}]
[null,{"$f":"'DATA TRAQUE'!B80","v":"Damping"},{"$f":"'DATA TRAQUE'!C80","v":16221345},{"$f":"SQRT(($C$6-'DATA TRAQUE'!D80)^2+(TRAQUE!$D$6-'DATA TRAQUE'!E80)^2)","v":100.01999800039989},{"$f":"CONCATENATE('DATA TRAQUE'!G80,\"h\",'DATA TRAQUE'!H80,\"min\",'DATA TRAQUE'!I80,\"s\")","v":"3h30min34s"}," ",{"$f":"IF(F30=\"A PORTEE\",'DATA TRAQUE'!$M$2+TIME(0,$D$3,$E$3)+TIME('DATA TRAQUE'!G80,'DATA TRAQUE'!H80,'DATA TRAQUE'!I80),\" \")","v":" "},{"$f":"IF(F30=\"A PORTEE\",G30-VLOOKUP($B$3,'DATA TRAQUE'!$B$41:$L$126,11),\"\")","v":""},{"$f":"IF(F30=\"A PORTEE\",'DATA TRAQUE'!$M$2+TIME(0,$D$3,$E$3)+2*TIME('DATA TRAQUE'!G61,'DATA TRAQUE'!H61,'DATA TRAQUE'!I61)+TIME(0,$F$3,$G$3),\" \")","v":" "},{"$f":"IF(F30=\"A PORTEE\",I30-VLOOKUP($B$3,'DATA TRAQUE'!$B$41:$L$126,11),\"\")","v":""}]
[null,{"$f":"'DATA TRAQUE'!B51","v":"Domino"},{"$f":"'DATA TRAQUE'!C51","v":892741},{"$f":"SQRT(($C$6-'DATA TRAQUE'!D51)^2+(TRAQUE!$D$6-'DATA TRAQUE'!E51)^2)","v":1.4142135623730951},{"$f":"CONCATENATE('DATA TRAQUE'!G51,\"h\",'DATA TRAQUE'!H51,\"min\",'DATA TRAQUE'!I51,\"s\")","v":"0h3min25s"}," ",{"$f":"IF(F31=\"A PORTEE\",'DATA TRAQUE'!$M$2+TIME(0,$D$3,$E$3)+TIME('DATA TRAQUE'!G51,'DATA TRAQUE'!H51,'DATA TRAQUE'!I51),\" \")","v":" "},{"$f":"IF(F31=\"A PORTEE\",G31-VLOOKUP($B$3,'DATA TRAQUE'!$B$41:$L$126,11),\"\")","v":""},{"$f":"IF(F31=\"A PORTEE\",'DATA TRAQUE'!$M$2+TIME(0,$D$3,$E$3)+2*TIME('DATA TRAQUE'!G62,'DATA TRAQUE'!H62,'DATA TRAQUE'!I62)+TIME(0,$F$3,$G$3),\" \")","v":" "},{"$f":"IF(F31=\"A PORTEE\",I31-VLOOKUP($B$3,'DATA TRAQUE'!$B$41:$L$126,11),\"\")","v":""}]
[null,{"$f":"'DATA TRAQUE'!B81","v":"DrAnts"},{"$f":"'DATA TRAQUE'!C81","v":3848814},{"$f":"SQRT(($C$6-'DATA TRAQUE'!D81)^2+(TRAQUE!$D$6-'DATA TRAQUE'!E81)^2)","v":104.58011283222064},{"$f":"CONCATENATE('DATA TRAQUE'!G81,\"h\",'DATA TRAQUE'!H81,\"min\",'DATA TRAQUE'!I81,\"s\")","v":"3h38min49s"}," ",{"$f":"IF(F32=\"A PORTEE\",'DATA TRAQUE'!$M$2+TIME(0,$D$3,$E$3)+TIME('DATA TRAQUE'!G81,'DATA TRAQUE'!H81,'DATA TRAQUE'!I81),\" \")","v":" "},{"$f":"IF(F32=\"A PORTEE\",G32-VLOOKUP($B$3,'DATA TRAQUE'!$B$41:$L$126,11),\"\")","v":""},{"$f":"IF(F32=\"A PORTEE\",'DATA TRAQUE'!$M$2+TIME(0,$D$3,$E$3)+2*TIME('DATA TRAQUE'!G63,'DATA TRAQUE'!H63,'DATA TRAQUE'!I63)+TIME(0,$F$3,$G$3),\" \")","v":" "},{"$f":"IF(F32=\"A PORTEE\",I32-VLOOKUP($B$3,'DATA TRAQUE'!$B$41:$L$126,11),\"\")","v":""}]
[null,{"$f":"'DATA TRAQUE'!B82","v":"Drusilla"},{"$f":"'DATA TRAQUE'!C82","v":1855225863},{"$f":"SQRT(($C$6-'DATA TRAQUE'!D82)^2+(TRAQUE!$D$6-'DATA TRAQUE'!E82)^2)","v":150.61540425866141},{"$f":"CONCATENATE('DATA TRAQUE'!G82,\"h\",'DATA TRAQUE'!H82,\"min\",'DATA TRAQUE'!I82,\"s\")","v":"4h56min15s"}," ",{"$f":"IF(F33=\"A PORTEE\",'DATA TRAQUE'!$M$2+TIME(0,$D$3,$E$3)+TIME('DATA TRAQUE'!G82,'DATA TRAQUE'!H82,'DATA TRAQUE'!I82),\" \")","v":" "},{"$f":"IF(F33=\"A PORTEE\",G33-VLOOKUP($B$3,'DATA TRAQUE'!$B$41:$L$126,11),\"\")","v":""},{"$f":"IF(F33=\"A PORTEE\",'DATA TRAQUE'!$M$2+TIME(0,$D$3,$E$3)+2*TIME('DATA TRAQUE'!G64,'DATA TRAQUE'!H64,'DATA TRAQUE'!I64)+TIME(0,$F$3,$G$3),\" \")","v":" "},{"$f":"IF(F33=\"A PORTEE\",I33-VLOOKUP($B$3,'DATA TRAQUE'!$B$41:$L$126,11),\"\")","v":""}]
[null,{"$f":"'DATA TRAQUE'!B83","v":"EllaVonZedanltha"},{"$f":"'DATA TRAQUE'!C83","v":1952804},{"$f":"SQRT(($C$6-'DATA TRAQUE'!D83)^2+(TRAQUE!$D$6-'DATA TRAQUE'!E83)^2)","v":114.75626344561765},{"$f":"CONCATENATE('DATA TRAQUE'!G83,\"h\",'DATA TRAQUE'!H83,\"min\",'DATA TRAQUE'!I83,\"s\")","v":"3h56min49s"}," ",{"$f":"IF(F34=\"A PORTEE\",'DATA TRAQUE'!$M$2+TIME(0,$D$3,$E$3)+TIME('DATA TRAQUE'!G83,'DATA TRAQUE'!H83,'DATA TRAQUE'!I83),\" \")","v":" "},{"$f":"IF(F34=\"A PORTEE\",G34-VLOOKUP($B$3,'DATA TRAQUE'!$B$41:$L$126,11),\"\")","v":""},{"$f":"IF(F34=\"A PORTEE\",'DATA TRAQUE'!$M$2+TIME(0,$D$3,$E$3)+2*TIME('DATA TRAQUE'!G65,'DATA TRAQUE'!H65,'DATA TRAQUE'!I65)+TIME(0,$F$3,$G$3),\" \")","v":" "},{"$f":"IF(F34=\"A PORTEE\",I34-VLOOKUP($B$3,'DATA TRAQUE'!$B$41:$L$126,11),\"\")","v":""}]
[null,{"$f":"'DATA TRAQUE'!B52","v":"Eltornado"},{"$f":"'DATA TRAQUE'!C52","v":119767},{"$f":"SQRT(($C$6-'DATA TRAQUE'!D52)^2+(TRAQUE!$D$6-'DATA TRAQUE'!E52)^2)","v":156.20499351813308},{"$f":"CONCATENATE('DATA TRAQUE'!G52,\"h\",'DATA TRAQUE'!H52,\"min\",'DATA TRAQUE'!I52,\"s\")","v":"5h4min59s"}," ",{"$f":"IF(F35=\"A PORTEE\",'DATA TRAQUE'!$M$2+TIME(0,$D$3,$E$3)+TIME('DATA TRAQUE'!G52,'DATA TRAQUE'!H52,'DATA TRAQUE'!I52),\" \")","v":" "},{"$f":"IF(F35=\"A PORTEE\",G35-VLOOKUP($B$3,'DATA TRAQUE'!$B$41:$L$126,11),\"\")","v":""},{"$f":"IF(F35=\"A PORTEE\",'DATA TRAQUE'!$M$2+TIME(0,$D$3,$E$3)+2*TIME('DATA TRAQUE'!G66,'DATA TRAQUE'!H66,'DATA TRAQUE'!I66)+TIME(0,$F$3,$G$3),\" \")","v":" "},{"$f":"IF(F35=\"A PORTEE\",I35-VLOOKUP($B$3,'DATA TRAQUE'!$B$41:$L$126,11),\"\")","v":""}]
[null,{"$f":"'DATA TRAQUE'!B53","v":"Fleau"},{"$f":"'DATA TRAQUE'!C53","v":1034979412},{"$f":"SQRT(($C$6-'DATA TRAQUE'!D53)^2+(TRAQUE!$D$6-'DATA TRAQUE'!E53)^2)","v":4.1231056256176606},{"$f":"CONCATENATE('DATA TRAQUE'!G53,\"h\",'DATA TRAQUE'!H53,\"min\",'DATA TRAQUE'!I53,\"s\")","v":"0h9min56s"},"A PORTEE",{"$f":"IF(F36=\"A PORTEE\",'DATA TRAQUE'!$M$2+TIME(0,$D$3,$E$3)+TIME('DATA TRAQUE'!G53,'DATA TRAQUE'!H53,'DATA TRAQUE'!I53),\" \")","v":"17:41:26"},{"$f":"IF(F36=\"A PORTEE\",G36-VLOOKUP($B$3,'DATA TRAQUE'!$B$41:$L$126,11),\"\")","v":"17:26:11"},{"$f":"IF(F36=\"A PORTEE\",'DATA TRAQUE'!$M$2+TIME(0,$D$3,$E$3)+2*TIME('DATA TRAQUE'!G67,'DATA TRAQUE'!H67,'DATA TRAQUE'!I67)+TIME(0,$F$3,$G$3),\" \")","v":1.1236805555555556},{"$f":"IF(F36=\"A PORTEE\",I36-VLOOKUP($B$3,'DATA TRAQUE'!$B$41:$L$126,11),\"\")","v":1.1130902777777778}]
[null,{"$f":"'DATA TRAQUE'!B84","v":"Flipper1"},{"$f":"'DATA TRAQUE'!C84","v":92127906},{"$f":"SQRT(($C$6-'DATA TRAQUE'!D84)^2+(TRAQUE!$D$6-'DATA TRAQUE'!E84)^2)","v":103.81714694596457},{"$f":"CONCATENATE('DATA TRAQUE'!G84,\"h\",'DATA TRAQUE'!H84,\"min\",'DATA TRAQUE'!I84,\"s\")","v":"3h37min27s"}," ",{"$f":"IF(F37=\"A PORTEE\",'DATA TRAQUE'!$M$2+TIME(0,$D$3,$E$3)+TIME('DATA TRAQUE'!G84,'DATA TRAQUE'!H84,'DATA TRAQUE'!I84),\" \")","v":" "},{"$f":"IF(F37=\"A PORTEE\",G37-VLOOKUP($B$3,'DATA TRAQUE'!$B$41:$L$126,11),\"\")","v":""},{"$f":"IF(F37=\"A PORTEE\",'DATA TRAQUE'!$M$2+TIME(0,$D$3,$E$3)+2*TIME('DATA TRAQUE'!G68,'DATA TRAQUE'!H68,'DATA TRAQUE'!I68)+TIME(0,$F$3,$G$3),\" \")","v":" "},{"$f":"IF(F37=\"A PORTEE\",I37-VLOOKUP($B$3,'DATA TRAQUE'!$B$41:$L$126,11),\"\")","v":""}]
[null,{"$f":"'DATA TRAQUE'!B54","v":"Formidabilis"},{"$f":"'DATA TRAQUE'!C54","v":215020},{"$f":"SQRT(($C$6-'DATA TRAQUE'!D54)^2+(TRAQUE!$D$6-'DATA TRAQUE'!E54)^2)","v":8.9442719099991592},{"$f":"CONCATENATE('DATA TRAQUE'!G54,\"h\",'DATA TRAQUE'!H54,\"min\",'DATA TRAQUE'!I54,\"s\")","v":"0h21min23s"}," ",{"$f":"IF(F38=\"A PORTEE\",'DATA TRAQUE'!$M$2+TIME(0,$D$3,$E$3)+TIME('DATA TRAQUE'!G54,'DATA TRAQUE'!H54,'DATA TRAQUE'!I54),\" \")","v":" "},{"$f":"IF(F38=\"A PORTEE\",G38-VLOOKUP($B$3,'DATA TRAQUE'!$B$41:$L$126,11),\"\")","v":""},{"$f":"IF(F38=\"A PORTEE\",'DATA TRAQUE'!$M$2+TIME(0,$D$3,$E$3)+2*TIME('DATA TRAQUE'!G69,'DATA TRAQUE'!H69,'DATA TRAQUE'!I69)+TIME(0,$F$3,$G$3),\" \")","v":" "},{"$f":"IF(F38=\"A PORTEE\",I38-VLOOKUP($B$3,'DATA TRAQUE'!$B$41:$L$126,11),\"\")","v":""}]
[null,{"$f":"'DATA TRAQUE'!B85","v":"Greeny"},{"$f":"'DATA TRAQUE'!C85","v":26570199},{"$f":"SQRT(($C$6-'DATA TRAQUE'!D85)^2+(TRAQUE!$D$6-'DATA TRAQUE'!E85)^2)","v":122.80065146407001},{"$f":"CONCATENATE('DATA TRAQUE'!G85,\"h\",'DATA TRAQUE'!H85,\"min\",'DATA TRAQUE'!I85,\"s\")","v":"4h10min41s"}," ",{"$f":"IF(F39=\"A PORTEE\",'DATA TRAQUE'!$M$2+TIME(0,$D$3,$E$3)+TIME('DATA TRAQUE'!G85,'DATA TRAQUE'!H85,'DATA TRAQUE'!I85),\" \")","v":" "},{"$f":"IF(F39=\"A PORTEE\",G39-VLOOKUP($B$3,'DATA TRAQUE'!$B$41:$L$126,11),\"\")","v":""},{"$f":"IF(F39=\"A PORTEE\",'DATA TRAQUE'!$M$2+TIME(0,$D$3,$E$3)+2*TIME('DATA TRAQUE'!G70,'DATA TRAQUE'!H70,'DATA TRAQUE'!I70)+TIME(0,$F$3,$G$3),\" \")","v":" "},{"$f":"IF(F39=\"A PORTEE\",I39-VLOOKUP($B$3,'DATA TRAQUE'!$B$41:$L$126,11),\"\")","v":""}]
[null,{"$f":"'DATA TRAQUE'!B86","v":"Gueust"},{"$f":"'DATA TRAQUE'!C86","v":1480632393},{"$f":"SQRT(($C$6-'DATA TRAQUE'!D86)^2+(TRAQUE!$D$6-'DATA TRAQUE'!E86)^2)","v":213.08449028495716},{"$f":"CONCATENATE('DATA TRAQUE'!G86,\"h\",'DATA TRAQUE'!H86,\"min\",'DATA TRAQUE'!I86,\"s\")","v":"6h26min18s"},"A PORTEE",{"$f":"IF(F40=\"A PORTEE\",'DATA TRAQUE'!$M$2+TIME(0,$D$3,$E$3)+TIME('DATA TRAQUE'!G86,'DATA TRAQUE'!H86,'DATA TRAQUE'!I86),\" \")","v":"23:57:48"},{"$f":"IF(F40=\"A PORTEE\",G40-VLOOKUP($B$3,'DATA TRAQUE'!$B$41:$L$126,11),\"\")","v":"23:42:33"},{"$f":"IF(F40=\"A PORTEE\",'DATA TRAQUE'!$M$2+TIME(0,$D$3,$E$3)+2*TIME('DATA TRAQUE'!G71,'DATA TRAQUE'!H71,'DATA TRAQUE'!I71)+TIME(0,$F$3,$G$3),\" \")","v":1.0725000000000002},{"$f":"IF(F40=\"A PORTEE\",I40-VLOOKUP($B$3,'DATA TRAQUE'!$B$41:$L$126,11),\"\")","v":1.0619097222222225}]
[null,{"$f":"'DATA TRAQUE'!B87","v":"hador"},{"$f":"'DATA TRAQUE'!C87","v":1289178436},{"$f":"SQRT(($C$6-'DATA TRAQUE'!D87)^2+(TRAQUE!$D$6-'DATA TRAQUE'!E87)^2)","v":22.803508501982758},{"$f":"CONCATENATE('DATA TRAQUE'!G87,\"h\",'DATA TRAQUE'!H87,\"min\",'DATA TRAQUE'!I87,\"s\")","v":"0h53min26s"},"A PORTEE",{"$f":"IF(F41=\"A PORTEE\",'DATA TRAQUE'!$M$2+TIME(0,$D$3,$E$3)+TIME('DATA TRAQUE'!G87,'DATA TRAQUE'!H87,'DATA TRAQUE'!I87),\" \")","v":"18:24:56"},{"$f":"IF(F41=\"A PORTEE\",G41-VLOOKUP($B$3,'DATA TRAQUE'!$B$41:$L$126,11),\"\")","v":"18:09:41"},{"$f":"IF(F41=\"A PORTEE\",'DATA TRAQUE'!$M$2+TIME(0,$D$3,$E$3)+2*TIME('DATA TRAQUE'!G72,'DATA TRAQUE'!H72,'DATA TRAQUE'!I72)+TIME(0,$F$3,$G$3),\" \")","v":1.0546064814814815},{"$f":"IF(F41=\"A PORTEE\",I41-VLOOKUP($B$3,'DATA TRAQUE'!$B$41:$L$126,11),\"\")","v":1.0440162037037037}]
[null,{"$f":"'DATA TRAQUE'!B88","v":"Ishigo"},{"$f":"'DATA TRAQUE'!C88","v":757282747},{"$f":"SQRT(($C$6-'DATA TRAQUE'!D88)^2+(TRAQUE!$D$6-'DATA TRAQUE'!E88)^2)","v":70.405965656327737},{"$f":"CONCATENATE('DATA TRAQUE'!G88,\"h\",'DATA TRAQUE'!H88,\"min\",'DATA TRAQUE'!I88,\"s\")","v":"2h34min22s"},{"$f":"IF(AND((C42<=(3*$B$6)),(C42>=(0.5*$B$6))),\"A PORTEE\",\" \")","v":"A PORTEE"},{"$f":"IF(F42=\"A PORTEE\",'DATA TRAQUE'!$M$2+TIME(0,$D$3,$E$3)+TIME('DATA TRAQUE'!G88,'DATA TRAQUE'!H88,'DATA TRAQUE'!I88),\" \")","v":"20:05:52"},{"$f":"IF(F42=\"A PORTEE\",G42-VLOOKUP($B$3,'DATA TRAQUE'!$B$41:$L$126,11),\"\")","v":"19:50:37"},{"$f":"IF(F42=\"A PORTEE\",'DATA TRAQUE'!$M$2+TIME(0,$D$3,$E$3)+2*TIME('DATA TRAQUE'!G73,'DATA TRAQUE'!H73,'DATA TRAQUE'!I73)+TIME(0,$F$3,$G$3),\" \")","v":"21:51:28"},{"$f":"IF(F42=\"A PORTEE\",I42-VLOOKUP($B$3,'DATA TRAQUE'!$B$41:$L$126,11),\"\")","v":"21:36:13"}]
[null,{"$f":"'DATA TRAQUE'!B55","v":"Jericho"},{"$f":"'DATA TRAQUE'!C55","v":1839285687},{"$f":"SQRT(($C$6-'DATA TRAQUE'!D55)^2+(TRAQUE!$D$6-'DATA TRAQUE'!E55)^2)","v":37.215588131856791},{"$f":"CONCATENATE('DATA TRAQUE'!G55,\"h\",'DATA TRAQUE'!H55,\"min\",'DATA TRAQUE'!I55,\"s\")","v":"1h25min28s"}," ",{"$f":"IF(F43=\"A PORTEE\",'DATA TRAQUE'!$M$2+TIME(0,$D$3,$E$3)+TIME('DATA TRAQUE'!G55,'DATA TRAQUE'!H55,'DATA TRAQUE'!I55),\" \")","v":" "},{"$f":"IF(F43=\"A PORTEE\",G43-VLOOKUP($B$3,'DATA TRAQUE'!$B$41:$L$126,11),\"\")","v":""},{"$f":"IF(F43=\"A PORTEE\",'DATA TRAQUE'!$M$2+TIME(0,$D$3,$E$3)+2*TIME('DATA TRAQUE'!G74,'DATA TRAQUE'!H74,'DATA TRAQUE'!I74)+TIME(0,$F$3,$G$3),\" \")","v":" "},{"$f":"IF(F43=\"A PORTEE\",I43-VLOOKUP($B$3,'DATA TRAQUE'!$B$41:$L$126,11),\"\")","v":""}]
[null,{"$f":"'DATA TRAQUE'!B56","v":"kandide"},{"$f":"'DATA TRAQUE'!C56","v":74951},{"$f":"SQRT(($C$6-'DATA TRAQUE'!D56)^2+(TRAQUE!$D$6-'DATA TRAQUE'!E56)^2)","v":117.03845521878696},{"$f":"CONCATENATE('DATA TRAQUE'!G56,\"h\",'DATA TRAQUE'!H56,\"min\",'DATA TRAQUE'!I56,\"s\")","v":"4h0min47s"}," ",{"$f":"IF(F44=\"A PORTEE\",'DATA TRAQUE'!$M$2+TIME(0,$D$3,$E$3)+TIME('DATA TRAQUE'!G56,'DATA TRAQUE'!H56,'DATA TRAQUE'!I56),\" \")","v":" "},{"$f":"IF(F44=\"A PORTEE\",G44-VLOOKUP($B$3,'DATA TRAQUE'!$B$41:$L$126,11),\"\")","v":""},{"$f":"IF(F44=\"A PORTEE\",'DATA TRAQUE'!$M$2+TIME(0,$D$3,$E$3)+2*TIME('DATA TRAQUE'!G75,'DATA TRAQUE'!H75,'DATA TRAQUE'!I75)+TIME(0,$F$3,$G$3),\" \")","v":" "},{"$f":"IF(F44=\"A PORTEE\",I44-VLOOKUP($B$3,'DATA TRAQUE'!$B$41:$L$126,11),\"\")","v":""}]
[null,{"$f":"'DATA TRAQUE'!B57","v":"laika"},{"$f":"'DATA TRAQUE'!C57","v":352856},{"$f":"SQRT(($C$6-'DATA TRAQUE'!D57)^2+(TRAQUE!$D$6-'DATA TRAQUE'!E57)^2)","v":34.785054261852174},{"$f":"CONCATENATE('DATA TRAQUE'!G57,\"h\",'DATA TRAQUE'!H57,\"min\",'DATA TRAQUE'!I57,\"s\")","v":"1h20min9s"}," ",{"$f":"IF(F45=\"A PORTEE\",'DATA TRAQUE'!$M$2+TIME(0,$D$3,$E$3)+TIME('DATA TRAQUE'!G57,'DATA TRAQUE'!H57,'DATA TRAQUE'!I57),\" \")","v":" "},{"$f":"IF(F45=\"A PORTEE\",G45-VLOOKUP($B$3,'DATA TRAQUE'!$B$41:$L$126,11),\"\")","v":""},{"$f":"IF(F45=\"A PORTEE\",'DATA TRAQUE'!$M$2+TIME(0,$D$3,$E$3)+2*TIME('DATA TRAQUE'!G76,'DATA TRAQUE'!H76,'DATA TRAQUE'!I76)+TIME(0,$F$3,$G$3),\" \")","v":" "},{"$f":"IF(F45=\"A PORTEE\",I45-VLOOKUP($B$3,'DATA TRAQUE'!$B$41:$L$126,11),\"\")","v":""}]
[null,{"$f":"'DATA TRAQUE'!B89","v":"Lesqual"},{"$f":"'DATA TRAQUE'!C89","v":4423829},{"$f":"SQRT(($C$6-'DATA TRAQUE'!D89)^2+(TRAQUE!$D$6-'DATA TRAQUE'!E89)^2)","v":123.79418403139947},{"$f":"CONCATENATE('DATA TRAQUE'!G89,\"h\",'DATA TRAQUE'!H89,\"min\",'DATA TRAQUE'!I89,\"s\")","v":"4h12min23s"}," ",{"$f":"IF(F46=\"A PORTEE\",'DATA TRAQUE'!$M$2+TIME(0,$D$3,$E$3)+TIME('DATA TRAQUE'!G89,'DATA TRAQUE'!H89,'DATA TRAQUE'!I89),\" \")","v":" "},{"$f":"IF(F46=\"A PORTEE\",G46-VLOOKUP($B$3,'DATA TRAQUE'!$B$41:$L$126,11),\"\")","v":""},{"$f":"IF(F46=\"A PORTEE\",'DATA TRAQUE'!$M$2+TIME(0,$D$3,$E$3)+2*TIME('DATA TRAQUE'!G77,'DATA TRAQUE'!H77,'DATA TRAQUE'!I77)+TIME(0,$F$3,$G$3),\" \")","v":" "},{"$f":"IF(F46=\"A PORTEE\",I46-VLOOKUP($B$3,'DATA TRAQUE'!$B$41:$L$126,11),\"\")","v":""}]
[null,{"$f":"'DATA TRAQUE'!B90","v":"lipoussou"},{"$f":"'DATA TRAQUE'!C90","v":11917308},{"$f":"SQRT(($C$6-'DATA TRAQUE'!D90)^2+(TRAQUE!$D$6-'DATA TRAQUE'!E90)^2)","v":39.824615503479755},{"$f":"CONCATENATE('DATA TRAQUE'!G90,\"h\",'DATA TRAQUE'!H90,\"min\",'DATA TRAQUE'!I90,\"s\")","v":"1h31min7s"}," ",{"$f":"IF(F47=\"A PORTEE\",'DATA TRAQUE'!$M$2+TIME(0,$D$3,$E$3)+TIME('DATA TRAQUE'!G90,'DATA TRAQUE'!H90,'DATA TRAQUE'!I90),\" \")","v":" "},{"$f":"IF(F47=\"A PORTEE\",G47-VLOOKUP($B$3,'DATA TRAQUE'!$B$41:$L$126,11),\"\")","v":""},{"$f":"IF(F47=\"A PORTEE\",'DATA TRAQUE'!$M$2+TIME(0,$D$3,$E$3)+2*TIME('DATA TRAQUE'!G78,'DATA TRAQUE'!H78,'DATA TRAQUE'!I78)+TIME(0,$F$3,$G$3),\" \")","v":" "},{"$f":"IF(F47=\"A PORTEE\",I47-VLOOKUP($B$3,'DATA TRAQUE'!$B$41:$L$126,11),\"\")","v":""}]
[null,{"$f":"'DATA TRAQUE'!B91","v":"Lockheed"},{"$f":"'DATA TRAQUE'!C91","v":11216156},{"$f":"SQRT(($C$6-'DATA TRAQUE'!D91)^2+(TRAQUE!$D$6-'DATA TRAQUE'!E91)^2)","v":19.416487838947599},{"$f":"CONCATENATE('DATA TRAQUE'!G91,\"h\",'DATA TRAQUE'!H91,\"min\",'DATA TRAQUE'!I91,\"s\")","v":"0h45min43s"}," ",{"$f":"IF(F48=\"A PORTEE\",'DATA TRAQUE'!$M$2+TIME(0,$D$3,$E$3)+TIME('DATA TRAQUE'!G91,'DATA TRAQUE'!H91,'DATA TRAQUE'!I91),\" \")","v":" "},{"$f":"IF(F48=\"A PORTEE\",G48-VLOOKUP($B$3,'DATA TRAQUE'!$B$41:$L$126,11),\"\")","v":""},{"$f":"IF(F48=\"A PORTEE\",'DATA TRAQUE'!$M$2+TIME(0,$D$3,$E$3)+2*TIME('DATA TRAQUE'!G79,'DATA TRAQUE'!H79,'DATA TRAQUE'!I79)+TIME(0,$F$3,$G$3),\" \")","v":" "},{"$f":"IF(F48=\"A PORTEE\",I48-VLOOKUP($B$3,'DATA TRAQUE'!$B$41:$L$126,11),\"\")","v":""}]
[null,{"$f":"'DATA TRAQUE'!B92","v":"MagnetO"},{"$f":"'DATA TRAQUE'!C92","v":111707},{"$f":"SQRT(($C$6-'DATA TRAQUE'!D92)^2+(TRAQUE!$D$6-'DATA TRAQUE'!E92)^2)","v":17},{"$f":"CONCATENATE('DATA TRAQUE'!G92,\"h\",'DATA TRAQUE'!H92,\"min\",'DATA TRAQUE'!I92,\"s\")","v":"0h40min10s"}," ",{"$f":"IF(F49=\"A PORTEE\",'DATA TRAQUE'!$M$2+TIME(0,$D$3,$E$3)+TIME('DATA TRAQUE'!G92,'DATA TRAQUE'!H92,'DATA TRAQUE'!I92),\" \")","v":" "},{"$f":"IF(F49=\"A PORTEE\",G49-VLOOKUP($B$3,'DATA TRAQUE'!$B$41:$L$126,11),\"\")","v":""},{"$f":"IF(F49=\"A PORTEE\",'DATA TRAQUE'!$M$2+TIME(0,$D$3,$E$3)+2*TIME('DATA TRAQUE'!G80,'DATA TRAQUE'!H80,'DATA TRAQUE'!I80)+TIME(0,$F$3,$G$3),\" \")","v":" "},{"$f":"IF(F49=\"A PORTEE\",I49-VLOOKUP($B$3,'DATA TRAQUE'!$B$41:$L$126,11),\"\")","v":""}]
[null,{"$f":"'DATA TRAQUE'!B93","v":"marchombre"},{"$f":"'DATA TRAQUE'!C93","v":1650134494},{"$f":"SQRT(($C$6-'DATA TRAQUE'!D93)^2+(TRAQUE!$D$6-'DATA TRAQUE'!E93)^2)","v":66.370174024180471},{"$f":"CONCATENATE('DATA TRAQUE'!G93,\"h\",'DATA TRAQUE'!H93,\"min\",'DATA TRAQUE'!I93,\"s\")","v":"2h26min20s"}," ",{"$f":"IF(F50=\"A PORTEE\",'DATA TRAQUE'!$M$2+TIME(0,$D$3,$E$3)+TIME('DATA TRAQUE'!G93,'DATA TRAQUE'!H93,'DATA TRAQUE'!I93),\" \")","v":" "},{"$f":"IF(F50=\"A PORTEE\",G50-VLOOKUP($B$3,'DATA TRAQUE'!$B$41:$L$126,11),\"\")","v":""},{"$f":"IF(F50=\"A PORTEE\",'DATA TRAQUE'!$M$2+TIME(0,$D$3,$E$3)+2*TIME('DATA TRAQUE'!G81,'DATA TRAQUE'!H81,'DATA TRAQUE'!I81)+TIME(0,$F$3,$G$3),\" \")","v":" "},{"$f":"IF(F50=\"A PORTEE\",I50-VLOOKUP($B$3,'DATA TRAQUE'!$B$41:$L$126,11),\"\")","v":""}]
[null,{"$f":"'DATA TRAQUE'!B58","v":"Matteo37"},{"$f":"'DATA TRAQUE'!C58","v":1045506653},{"$f":"SQRT(($C$6-'DATA TRAQUE'!D58)^2+(TRAQUE!$D$6-'DATA TRAQUE'!E58)^2)","v":36.124783736376884},{"$f":"CONCATENATE('DATA TRAQUE'!G58,\"h\",'DATA TRAQUE'!H58,\"min\",'DATA TRAQUE'!I58,\"s\")","v":"1h23min5s"},"A PORTEE",{"$f":"IF(F51=\"A PORTEE\",'DATA TRAQUE'!$M$2+TIME(0,$D$3,$E$3)+TIME('DATA TRAQUE'!G58,'DATA TRAQUE'!H58,'DATA TRAQUE'!I58),\" \")","v":"18:54:35"},{"$f":"IF(F51=\"A PORTEE\",G51-VLOOKUP($B$3,'DATA TRAQUE'!$B$41:$L$126,11),\"\")","v":"18:39:20"},{"$f":"IF(F51=\"A PORTEE\",'DATA TRAQUE'!$M$2+TIME(0,$D$3,$E$3)+2*TIME('DATA TRAQUE'!G82,'DATA TRAQUE'!H82,'DATA TRAQUE'!I82)+TIME(0,$F$3,$G$3),\" \")","v":1.1423611111111112},{"$f":"IF(F51=\"A PORTEE\",I51-VLOOKUP($B$3,'DATA TRAQUE'!$B$41:$L$126,11),\"\")","v":1.1317708333333334}]
[null,{"$f":"'DATA TRAQUE'!B59","v":"maxbo"},{"$f":"'DATA TRAQUE'!C59","v":474073},{"$f":"SQRT(($C$6-'DATA TRAQUE'!D59)^2+(TRAQUE!$D$6-'DATA TRAQUE'!E59)^2)","v":11.401754250991379},{"$f":"CONCATENATE('DATA TRAQUE'!G59,\"h\",'DATA TRAQUE'!H59,\"min\",'DATA TRAQUE'!I59,\"s\")","v":"0h27min10s"}," ",{"$f":"IF(F52=\"A PORTEE\",'DATA TRAQUE'!$M$2+TIME(0,$D$3,$E$3)+TIME('DATA TRAQUE'!G59,'DATA TRAQUE'!H59,'DATA TRAQUE'!I59),\" \")","v":" "},{"$f":"IF(F52=\"A PORTEE\",G52-VLOOKUP($B$3,'DATA TRAQUE'!$B$41:$L$126,11),\"\")","v":""},{"$f":"IF(F52=\"A PORTEE\",'DATA TRAQUE'!$M$2+TIME(0,$D$3,$E$3)+2*TIME('DATA TRAQUE'!G83,'DATA TRAQUE'!H83,'DATA TRAQUE'!I83)+TIME(0,$F$3,$G$3),\" \")","v":" "},{"$f":"IF(F52=\"A PORTEE\",I52-VLOOKUP($B$3,'DATA TRAQUE'!$B$41:$L$126,11),\"\")","v":""}]
[null,{"$f":"'DATA TRAQUE'!B94","v":"Melissa"},{"$f":"'DATA TRAQUE'!C94","v":4325226},{"$f":"SQRT(($C$6-'DATA TRAQUE'!D94)^2+(TRAQUE!$D$6-'DATA TRAQUE'!E94)^2)","v":145.98630072715727},{"$f":"CONCATENATE('DATA TRAQUE'!G94,\"h\",'DATA TRAQUE'!H94,\"min\",'DATA TRAQUE'!I94,\"s\")","v":"4h48min55s"}," ",{"$f":"IF(F53=\"A PORTEE\",'DATA TRAQUE'!$M$2+TIME(0,$D$3,$E$3)+TIME('DATA TRAQUE'!G94,'DATA TRAQUE'!H94,'DATA TRAQUE'!I94),\" \")","v":" "},{"$f":"IF(F53=\"A PORTEE\",G53-VLOOKUP($B$3,'DATA TRAQUE'!$B$41:$L$126,11),\"\")","v":""},{"$f":"IF(F53=\"A PORTEE\",'DATA TRAQUE'!$M$2+TIME(0,$D$3,$E$3)+2*TIME('DATA TRAQUE'!G84,'DATA TRAQUE'!H84,'DATA TRAQUE'!I84)+TIME(0,$F$3,$G$3),\" \")","v":" "},{"$f":"IF(F53=\"A PORTEE\",I53-VLOOKUP($B$3,'DATA TRAQUE'!$B$41:$L$126,11),\"\")","v":""}]
[null,{"$f":"'DATA TRAQUE'!B95","v":"MilesGloriosus"},{"$f":"'DATA TRAQUE'!C95","v":1229557},{"$f":"SQRT(($C$6-'DATA TRAQUE'!D95)^2+(TRAQUE!$D$6-'DATA TRAQUE'!E95)^2)","v":78.10249675906654},{"$f":"CONCATENATE('DATA TRAQUE'!G95,\"h\",'DATA TRAQUE'!H95,\"min\",'DATA TRAQUE'!I95,\"s\")","v":"2h49min26s"}," ",{"$f":"IF(F54=\"A PORTEE\",'DATA TRAQUE'!$M$2+TIME(0,$D$3,$E$3)+TIME('DATA TRAQUE'!G95,'DATA TRAQUE'!H95,'DATA TRAQUE'!I95),\" \")","v":" "},{"$f":"IF(F54=\"A PORTEE\",G54-VLOOKUP($B$3,'DATA TRAQUE'!$B$41:$L$126,11),\"\")","v":""},{"$f":"IF(F54=\"A PORTEE\",'DATA TRAQUE'!$M$2+TIME(0,$D$3,$E$3)+2*TIME('DATA TRAQUE'!G85,'DATA TRAQUE'!H85,'DATA TRAQUE'!I85)+TIME(0,$F$3,$G$3),\" \")","v":" "},{"$f":"IF(F54=\"A PORTEE\",I54-VLOOKUP($B$3,'DATA TRAQUE'!$B$41:$L$126,11),\"\")","v":""}]
[null,{"$f":"'DATA TRAQUE'!B96","v":"miloveam"},{"$f":"'DATA TRAQUE'!C96","v":10733921},{"$f":"SQRT(($C$6-'DATA TRAQUE'!D96)^2+(TRAQUE!$D$6-'DATA TRAQUE'!E96)^2)","v":133.09019498069722},{"$f":"CONCATENATE('DATA TRAQUE'!G96,\"h\",'DATA TRAQUE'!H96,\"min\",'DATA TRAQUE'!I96,\"s\")","v":"4h27min58s"}," ",{"$f":"IF(F55=\"A PORTEE\",'DATA TRAQUE'!$M$2+TIME(0,$D$3,$E$3)+TIME('DATA TRAQUE'!G96,'DATA TRAQUE'!H96,'DATA TRAQUE'!I96),\" \")","v":" "},{"$f":"IF(F55=\"A PORTEE\",G55-VLOOKUP($B$3,'DATA TRAQUE'!$B$41:$L$126,11),\"\")","v":""},{"$f":"IF(F55=\"A PORTEE\",'DATA TRAQUE'!$M$2+TIME(0,$D$3,$E$3)+2*TIME('DATA TRAQUE'!G86,'DATA TRAQUE'!H86,'DATA TRAQUE'!I86)+TIME(0,$F$3,$G$3),\" \")","v":" "},{"$f":"IF(F55=\"A PORTEE\",I55-VLOOKUP($B$3,'DATA TRAQUE'!$B$41:$L$126,11),\"\")","v":""}]
[null,{"$f":"'DATA TRAQUE'!B97","v":"Mime"},{"$f":"'DATA TRAQUE'!C97","v":1741606},{"$f":"SQRT(($C$6-'DATA TRAQUE'!D97)^2+(TRAQUE!$D$6-'DATA TRAQUE'!E97)^2)","v":44.283179650969061},{"$f":"CONCATENATE('DATA TRAQUE'!G97,\"h\",'DATA TRAQUE'!H97,\"min\",'DATA TRAQUE'!I97,\"s\")","v":"1h40min41s"}," ",{"$f":"IF(F56=\"A PORTEE\",'DATA TRAQUE'!$M$2+TIME(0,$D$3,$E$3)+TIME('DATA TRAQUE'!G97,'DATA TRAQUE'!H97,'DATA TRAQUE'!I97),\" \")","v":" "},{"$f":"IF(F56=\"A PORTEE\",G56-VLOOKUP($B$3,'DATA TRAQUE'!$B$41:$L$126,11),\"\")","v":""},{"$f":"IF(F56=\"A PORTEE\",'DATA TRAQUE'!$M$2+TIME(0,$D$3,$E$3)+2*TIME('DATA TRAQUE'!G87,'DATA TRAQUE'!H87,'DATA TRAQUE'!I87)+TIME(0,$F$3,$G$3),\" \")","v":" "},{"$f":"IF(F56=\"A PORTEE\",I56-VLOOKUP($B$3,'DATA TRAQUE'!$B$41:$L$126,11),\"\")","v":""}]
[null,{"$f":"'DATA TRAQUE'!B98","v":"Mimic"},{"$f":"'DATA TRAQUE'!C98","v":510734725},{"$f":"SQRT(($C$6-'DATA TRAQUE'!D98)^2+(TRAQUE!$D$6-'DATA TRAQUE'!E98)^2)","v":35.014282800023196},{"$f":"CONCATENATE('DATA TRAQUE'!G98,\"h\",'DATA TRAQUE'!H98,\"min\",'DATA TRAQUE'!I98,\"s\")","v":"1h20min39s"},"A PORTEE",{"$f":"IF(F57=\"A PORTEE\",'DATA TRAQUE'!$M$2+TIME(0,$D$3,$E$3)+TIME('DATA TRAQUE'!G98,'DATA TRAQUE'!H98,'DATA TRAQUE'!I98),\" \")","v":"18:52:09"},{"$f":"IF(F57=\"A PORTEE\",G57-VLOOKUP($B$3,'DATA TRAQUE'!$B$41:$L$126,11),\"\")","v":"18:36:54"},{"$f":"IF(F57=\"A PORTEE\",'DATA TRAQUE'!$M$2+TIME(0,$D$3,$E$3)+2*TIME('DATA TRAQUE'!G88,'DATA TRAQUE'!H88,'DATA TRAQUE'!I88)+TIME(0,$F$3,$G$3),\" \")","v":"22:41:14"},{"$f":"IF(F57=\"A PORTEE\",I57-VLOOKUP($B$3,'DATA TRAQUE'!$B$41:$L$126,11),\"\")","v":"22:25:59"}]
[null,{"$f":"'DATA TRAQUE'!B60","v":"moontribe"},{"$f":"'DATA TRAQUE'!C60","v":577004},{"$f":"SQRT(($C$6-'DATA TRAQUE'!D60)^2+(TRAQUE!$D$6-'DATA TRAQUE'!E60)^2)","v":39.597979746446661},{"$f":"CONCATENATE('DATA TRAQUE'!G60,\"h\",'DATA TRAQUE'!H60,\"min\",'DATA TRAQUE'!I60,\"s\")","v":"1h30min38s"}," ",{"$f":"IF(F58=\"A PORTEE\",'DATA TRAQUE'!$M$2+TIME(0,$D$3,$E$3)+TIME('DATA TRAQUE'!G60,'DATA TRAQUE'!H60,'DATA TRAQUE'!I60),\" \")","v":" "},{"$f":"IF(F58=\"A PORTEE\",G58-VLOOKUP($B$3,'DATA TRAQUE'!$B$41:$L$126,11),\"\")","v":""},{"$f":"IF(F58=\"A PORTEE\",'DATA TRAQUE'!$M$2+TIME(0,$D$3,$E$3)+2*TIME('DATA TRAQUE'!G89,'DATA TRAQUE'!H89,'DATA TRAQUE'!I89)+TIME(0,$F$3,$G$3),\" \")","v":" "},{"$f":"IF(F58=\"A PORTEE\",I58-VLOOKUP($B$3,'DATA TRAQUE'!$B$41:$L$126,11),\"\")","v":""}]
[null,{"$f":"'DATA TRAQUE'!B99","v":"Morphy"},{"$f":"'DATA TRAQUE'!C99","v":1927950},{"$f":"SQRT(($C$6-'DATA TRAQUE'!D99)^2+(TRAQUE!$D$6-'DATA TRAQUE'!E99)^2)","v":168.02380783686579},{"$f":"CONCATENATE('DATA TRAQUE'!G99,\"h\",'DATA TRAQUE'!H99,\"min\",'DATA TRAQUE'!I99,\"s\")","v":"5h22min59s"}," ",{"$f":"IF(F59=\"A PORTEE\",'DATA TRAQUE'!$M$2+TIME(0,$D$3,$E$3)+TIME('DATA TRAQUE'!G99,'DATA TRAQUE'!H99,'DATA TRAQUE'!I99),\" \")","v":" "},{"$f":"IF(F59=\"A PORTEE\",G59-VLOOKUP($B$3,'DATA TRAQUE'!$B$41:$L$126,11),\"\")","v":""},{"$f":"IF(F59=\"A PORTEE\",'DATA TRAQUE'!$M$2+TIME(0,$D$3,$E$3)+2*TIME('DATA TRAQUE'!G90,'DATA TRAQUE'!H90,'DATA TRAQUE'!I90)+TIME(0,$F$3,$G$3),\" \")","v":" "},{"$f":"IF(F59=\"A PORTEE\",I59-VLOOKUP($B$3,'DATA TRAQUE'!$B$41:$L$126,11),\"\")","v":""}]
[null,{"$f":"'DATA TRAQUE'!B61","v":"mouche"},{"$f":"'DATA TRAQUE'!C61","v":140617522},{"$f":"SQRT(($C$6-'DATA TRAQUE'!D61)^2+(TRAQUE!$D$6-'DATA TRAQUE'!E61)^2)","v":73.027392121039071},{"$f":"CONCATENATE('DATA TRAQUE'!G61,\"h\",'DATA TRAQUE'!H61,\"min\",'DATA TRAQUE'!I61,\"s\")","v":"2h39min32s"}," ",{"$f":"IF(F60=\"A PORTEE\",'DATA TRAQUE'!$M$2+TIME(0,$D$3,$E$3)+TIME('DATA TRAQUE'!G61,'DATA TRAQUE'!H61,'DATA TRAQUE'!I61),\" \")","v":" "},{"$f":"IF(F60=\"A PORTEE\",G60-VLOOKUP($B$3,'DATA TRAQUE'!$B$41:$L$126,11),\"\")","v":""},{"$f":"IF(F60=\"A PORTEE\",'DATA TRAQUE'!$M$2+TIME(0,$D$3,$E$3)+2*TIME('DATA TRAQUE'!G91,'DATA TRAQUE'!H91,'DATA TRAQUE'!I91)+TIME(0,$F$3,$G$3),\" \")","v":" "},{"$f":"IF(F60=\"A PORTEE\",I60-VLOOKUP($B$3,'DATA TRAQUE'!$B$41:$L$126,11),\"\")","v":""}]
[null,{"$f":"'DATA TRAQUE'!B100","v":"Myvin"},{"$f":"'DATA TRAQUE'!C100","v":1983940382},{"$f":"SQRT(($C$6-'DATA TRAQUE'!D100)^2+(TRAQUE!$D$6-'DATA TRAQUE'!E100)^2)","v":136.4734406395618},{"$f":"CONCATENATE('DATA TRAQUE'!G100,\"h\",'DATA TRAQUE'!H100,\"min\",'DATA TRAQUE'!I100,\"s\")","v":"4h33min32s"}," ",{"$f":"IF(F61=\"A PORTEE\",'DATA TRAQUE'!$M$2+TIME(0,$D$3,$E$3)+TIME('DATA TRAQUE'!G100,'DATA TRAQUE'!H100,'DATA TRAQUE'!I100),\" \")","v":" "},{"$f":"IF(F61=\"A PORTEE\",G61-VLOOKUP($B$3,'DATA TRAQUE'!$B$41:$L$126,11),\"\")","v":""},{"$f":"IF(F61=\"A PORTEE\",'DATA TRAQUE'!$M$2+TIME(0,$D$3,$E$3)+2*TIME('DATA TRAQUE'!G92,'DATA TRAQUE'!H92,'DATA TRAQUE'!I92)+TIME(0,$F$3,$G$3),\" \")","v":" "},{"$f":"IF(F61=\"A PORTEE\",I61-VLOOKUP($B$3,'DATA TRAQUE'!$B$41:$L$126,11),\"\")","v":""}]
[null,{"$f":"'DATA TRAQUE'!B62","v":"Norrin-Radd"},{"$f":"'DATA TRAQUE'!C62","v":32853830},{"$f":"SQRT(($C$6-'DATA TRAQUE'!D62)^2+(TRAQUE!$D$6-'DATA TRAQUE'!E62)^2)","v":24.020824298928627},{"$f":"CONCATENATE('DATA TRAQUE'!G62,\"h\",'DATA TRAQUE'!H62,\"min\",'DATA TRAQUE'!I62,\"s\")","v":"0h56min12s"}," ",{"$f":"IF(F62=\"A PORTEE\",'DATA TRAQUE'!$M$2+TIME(0,$D$3,$E$3)+TIME('DATA TRAQUE'!G62,'DATA TRAQUE'!H62,'DATA TRAQUE'!I62),\" \")","v":" "},{"$f":"IF(F62=\"A PORTEE\",G62-VLOOKUP($B$3,'DATA TRAQUE'!$B$41:$L$126,11),\"\")","v":""},{"$f":"IF(F62=\"A PORTEE\",'DATA TRAQUE'!$M$2+TIME(0,$D$3,$E$3)+2*TIME('DATA TRAQUE'!G93,'DATA TRAQUE'!H93,'DATA TRAQUE'!I93)+TIME(0,$F$3,$G$3),\" \")","v":" "},{"$f":"IF(F62=\"A PORTEE\",I62-VLOOKUP($B$3,'DATA TRAQUE'!$B$41:$L$126,11),\"\")","v":""}]
[null,{"$f":"'DATA TRAQUE'!B101","v":"osman"},{"$f":"'DATA TRAQUE'!C101","v":953794},{"$f":"SQRT(($C$6-'DATA TRAQUE'!D101)^2+(TRAQUE!$D$6-'DATA TRAQUE'!E101)^2)","v":144.34680460612904},{"$f":"CONCATENATE('DATA TRAQUE'!G101,\"h\",'DATA TRAQUE'!H101,\"min\",'DATA TRAQUE'!I101,\"s\")","v":"4h46min18s"}," ",{"$f":"IF(F63=\"A PORTEE\",'DATA TRAQUE'!$M$2+TIME(0,$D$3,$E$3)+TIME('DATA TRAQUE'!G101,'DATA TRAQUE'!H101,'DATA TRAQUE'!I101),\" \")","v":" "},{"$f":"IF(F63=\"A PORTEE\",G63-VLOOKUP($B$3,'DATA TRAQUE'!$B$41:$L$126,11),\"\")","v":""},{"$f":"IF(F63=\"A PORTEE\",'DATA TRAQUE'!$M$2+TIME(0,$D$3,$E$3)+2*TIME('DATA TRAQUE'!G94,'DATA TRAQUE'!H94,'DATA TRAQUE'!I94)+TIME(0,$F$3,$G$3),\" \")","v":" "},{"$f":"IF(F63=\"A PORTEE\",I63-VLOOKUP($B$3,'DATA TRAQUE'!$B$41:$L$126,11),\"\")","v":""}]
[null,{"$f":"'DATA TRAQUE'!B102","v":"pacpac001"},{"$f":"'DATA TRAQUE'!C102","v":2291704},{"$f":"SQRT(($C$6-'DATA TRAQUE'!D102)^2+(TRAQUE!$D$6-'DATA TRAQUE'!E102)^2)","v":121.03718436910205},{"$f":"CONCATENATE('DATA TRAQUE'!G102,\"h\",'DATA TRAQUE'!H102,\"min\",'DATA TRAQUE'!I102,\"s\")","v":"4h7min40s"}," ",{"$f":"IF(F64=\"A PORTEE\",'DATA TRAQUE'!$M$2+TIME(0,$D$3,$E$3)+TIME('DATA TRAQUE'!G102,'DATA TRAQUE'!H102,'DATA TRAQUE'!I102),\" \")","v":" "},{"$f":"IF(F64=\"A PORTEE\",G64-VLOOKUP($B$3,'DATA TRAQUE'!$B$41:$L$126,11),\"\")","v":""},{"$f":"IF(F64=\"A PORTEE\",'DATA TRAQUE'!$M$2+TIME(0,$D$3,$E$3)+2*TIME('DATA TRAQUE'!G95,'DATA TRAQUE'!H95,'DATA TRAQUE'!I95)+TIME(0,$F$3,$G$3),\" \")","v":" "},{"$f":"IF(F64=\"A PORTEE\",I64-VLOOKUP($B$3,'DATA TRAQUE'!$B$41:$L$126,11),\"\")","v":""}]
[null,{"$f":"'DATA TRAQUE'!B103","v":"Panda"},{"$f":"'DATA TRAQUE'!C103","v":74522661},{"$f":"SQRT(($C$6-'DATA TRAQUE'!D103)^2+(TRAQUE!$D$6-'DATA TRAQUE'!E103)^2)","v":137.09121051329294},{"$f":"CONCATENATE('DATA TRAQUE'!G103,\"h\",'DATA TRAQUE'!H103,\"min\",'DATA TRAQUE'!I103,\"s\")","v":"4h34min33s"}," ",{"$f":"IF(F65=\"A PORTEE\",'DATA TRAQUE'!$M$2+TIME(0,$D$3,$E$3)+TIME('DATA TRAQUE'!G103,'DATA TRAQUE'!H103,'DATA TRAQUE'!I103),\" \")","v":" "},{"$f":"IF(F65=\"A PORTEE\",G65-VLOOKUP($B$3,'DATA TRAQUE'!$B$41:$L$126,11),\"\")","v":""},{"$f":"IF(F65=\"A PORTEE\",'DATA TRAQUE'!$M$2+TIME(0,$D$3,$E$3)+2*TIME('DATA TRAQUE'!G96,'DATA TRAQUE'!H96,'DATA TRAQUE'!I96)+TIME(0,$F$3,$G$3),\" \")","v":" "},{"$f":"IF(F65=\"A PORTEE\",I65-VLOOKUP($B$3,'DATA TRAQUE'!$B$41:$L$126,11),\"\")","v":""}]
[null,{"$f":"'DATA TRAQUE'!B104","v":"pANTSu"},{"$f":"'DATA TRAQUE'!C104","v":1909810001},{"$f":"SQRT(($C$6-'DATA TRAQUE'!D104)^2+(TRAQUE!$D$6-'DATA TRAQUE'!E104)^2)","v":121.6552506059644},{"$f":"CONCATENATE('DATA TRAQUE'!G104,\"h\",'DATA TRAQUE'!H104,\"min\",'DATA TRAQUE'!I104,\"s\")","v":"4h8min44s"}," ",{"$f":"IF(F66=\"A PORTEE\",'DATA TRAQUE'!$M$2+TIME(0,$D$3,$E$3)+TIME('DATA TRAQUE'!G104,'DATA TRAQUE'!H104,'DATA TRAQUE'!I104),\" \")","v":" "},{"$f":"IF(F66=\"A PORTEE\",G66-VLOOKUP($B$3,'DATA TRAQUE'!$B$41:$L$126,11),\"\")","v":""},{"$f":"IF(F66=\"A PORTEE\",'DATA TRAQUE'!$M$2+TIME(0,$D$3,$E$3)+2*TIME('DATA TRAQUE'!G97,'DATA TRAQUE'!H97,'DATA TRAQUE'!I97)+TIME(0,$F$3,$G$3),\" \")","v":" "},{"$f":"IF(F66=\"A PORTEE\",I66-VLOOKUP($B$3,'DATA TRAQUE'!$B$41:$L$126,11),\"\")","v":""}]
[null,{"$f":"'DATA TRAQUE'!B105","v":"Phenixx"},{"$f":"'DATA TRAQUE'!C105","v":908308062},{"$f":"SQRT(($C$6-'DATA TRAQUE'!D105)^2+(TRAQUE!$D$6-'DATA TRAQUE'!E105)^2)","v":9.2195444572928871},{"$f":"CONCATENATE('DATA TRAQUE'!G105,\"h\",'DATA TRAQUE'!H105,\"min\",'DATA TRAQUE'!I105,\"s\")","v":"0h22min2s"},"A PORTEE",{"$f":"IF(F67=\"A PORTEE\",'DATA TRAQUE'!$M$2+TIME(0,$D$3,$E$3)+TIME('DATA TRAQUE'!G105,'DATA TRAQUE'!H105,'DATA TRAQUE'!I105),\" \")","v":"17:53:32"},{"$f":"IF(F67=\"A PORTEE\",G67-VLOOKUP($B$3,'DATA TRAQUE'!$B$41:$L$126,11),\"\")","v":"17:38:17"},{"$f":"IF(F67=\"A PORTEE\",'DATA TRAQUE'!$M$2+TIME(0,$D$3,$E$3)+2*TIME('DATA TRAQUE'!G98,'DATA TRAQUE'!H98,'DATA TRAQUE'!I98)+TIME(0,$F$3,$G$3),\" \")","v":"20:13:48"},{"$f":"IF(F67=\"A PORTEE\",I67-VLOOKUP($B$3,'DATA TRAQUE'!$B$41:$L$126,11),\"\")","v":"19:58:33"}]
[null,{"$f":"'DATA TRAQUE'!B106","v":"Pinou"},{"$f":"'DATA TRAQUE'!C106","v":7212325},{"$f":"SQRT(($C$6-'DATA TRAQUE'!D106)^2+(TRAQUE!$D$6-'DATA TRAQUE'!E106)^2)","v":154.78048972658021},{"$f":"CONCATENATE('DATA TRAQUE'!G106,\"h\",'DATA TRAQUE'!H106,\"min\",'DATA TRAQUE'!I106,\"s\")","v":"5h2min46s"}," ",{"$f":"IF(F68=\"A PORTEE\",'DATA TRAQUE'!$M$2+TIME(0,$D$3,$E$3)+TIME('DATA TRAQUE'!G106,'DATA TRAQUE'!H106,'DATA TRAQUE'!I106),\" \")","v":" "},{"$f":"IF(F68=\"A PORTEE\",G68-VLOOKUP($B$3,'DATA TRAQUE'!$B$41:$L$126,11),\"\")","v":""},{"$f":"IF(F68=\"A PORTEE\",'DATA TRAQUE'!$M$2+TIME(0,$D$3,$E$3)+2*TIME('DATA TRAQUE'!G99,'DATA TRAQUE'!H99,'DATA TRAQUE'!I99)+TIME(0,$F$3,$G$3),\" \")","v":" "},{"$f":"IF(F68=\"A PORTEE\",I68-VLOOKUP($B$3,'DATA TRAQUE'!$B$41:$L$126,11),\"\")","v":""}]
[null,{"$f":"'DATA TRAQUE'!B107","v":"pluginbaby"},{"$f":"'DATA TRAQUE'!C107","v":12705822},{"$f":"SQRT(($C$6-'DATA TRAQUE'!D107)^2+(TRAQUE!$D$6-'DATA TRAQUE'!E107)^2)","v":151.25144627407698},{"$f":"CONCATENATE('DATA TRAQUE'!G107,\"h\",'DATA TRAQUE'!H107,\"min\",'DATA TRAQUE'!I107,\"s\")","v":"4h57min15s"}," ",{"$f":"IF(F69=\"A PORTEE\",'DATA TRAQUE'!$M$2+TIME(0,$D$3,$E$3)+TIME('DATA TRAQUE'!G107,'DATA TRAQUE'!H107,'DATA TRAQUE'!I107),\" \")","v":" "},{"$f":"IF(F69=\"A PORTEE\",G69-VLOOKUP($B$3,'DATA TRAQUE'!$B$41:$L$126,11),\"\")","v":""},{"$f":"IF(F69=\"A PORTEE\",'DATA TRAQUE'!$M$2+TIME(0,$D$3,$E$3)+2*TIME('DATA TRAQUE'!G100,'DATA TRAQUE'!H100,'DATA TRAQUE'!I100)+TIME(0,$F$3,$G$3),\" \")","v":" "},{"$f":"IF(F69=\"A PORTEE\",I69-VLOOKUP($B$3,'DATA TRAQUE'!$B$41:$L$126,11),\"\")","v":""}]
[null,{"$f":"'DATA TRAQUE'!B63","v":"Prend-Ta-Claque"},{"$f":"'DATA TRAQUE'!C63","v":2568004},{"$f":"SQRT(($C$6-'DATA TRAQUE'!D63)^2+(TRAQUE!$D$6-'DATA TRAQUE'!E63)^2)","v":152.11837495845134},{"$f":"CONCATENATE('DATA TRAQUE'!G63,\"h\",'DATA TRAQUE'!H63,\"min\",'DATA TRAQUE'!I63,\"s\")","v":"4h58min37s"}," ",{"$f":"IF(F70=\"A PORTEE\",'DATA TRAQUE'!$M$2+TIME(0,$D$3,$E$3)+TIME('DATA TRAQUE'!G63,'DATA TRAQUE'!H63,'DATA TRAQUE'!I63),\" \")","v":" "},{"$f":"IF(F70=\"A PORTEE\",G70-VLOOKUP($B$3,'DATA TRAQUE'!$B$41:$L$126,11),\"\")","v":""},{"$f":"IF(F70=\"A PORTEE\",'DATA TRAQUE'!$M$2+TIME(0,$D$3,$E$3)+2*TIME('DATA TRAQUE'!G101,'DATA TRAQUE'!H101,'DATA TRAQUE'!I101)+TIME(0,$F$3,$G$3),\" \")","v":" "},{"$f":"IF(F70=\"A PORTEE\",I70-VLOOKUP($B$3,'DATA TRAQUE'!$B$41:$L$126,11),\"\")","v":""}]
[null,{"$f":"'DATA TRAQUE'!B108","v":"Quivala"},{"$f":"'DATA TRAQUE'!C108","v":9761369},{"$f":"SQRT(($C$6-'DATA TRAQUE'!D108)^2+(TRAQUE!$D$6-'DATA TRAQUE'!E108)^2)","v":45.453272709454048},{"$f":"CONCATENATE('DATA TRAQUE'!G108,\"h\",'DATA TRAQUE'!H108,\"min\",'DATA TRAQUE'!I108,\"s\")","v":"1h43min11s"}," ",{"$f":"IF(F71=\"A PORTEE\",'DATA TRAQUE'!$M$2+TIME(0,$D$3,$E$3)+TIME('DATA TRAQUE'!G108,'DATA TRAQUE'!H108,'DATA TRAQUE'!I108),\" \")","v":" "},{"$f":"IF(F71=\"A PORTEE\",G71-VLOOKUP($B$3,'DATA TRAQUE'!$B$41:$L$126,11),\"\")","v":""},{"$f":"IF(F71=\"A PORTEE\",'DATA TRAQUE'!$M$2+TIME(0,$D$3,$E$3)+2*TIME('DATA TRAQUE'!G102,'DATA TRAQUE'!H102,'DATA TRAQUE'!I102)+TIME(0,$F$3,$G$3),\" \")","v":" "},{"$f":"IF(F71=\"A PORTEE\",I71-VLOOKUP($B$3,'DATA TRAQUE'!$B$41:$L$126,11),\"\")","v":""}]
[null,{"$f":"'DATA TRAQUE'!B109","v":"Reex"},{"$f":"'DATA TRAQUE'!C109","v":1332809},{"$f":"SQRT(($C$6-'DATA TRAQUE'!D109)^2+(TRAQUE!$D$6-'DATA TRAQUE'!E109)^2)","v":34.205262752974143},{"$f":"CONCATENATE('DATA TRAQUE'!G109,\"h\",'DATA TRAQUE'!H109,\"min\",'DATA TRAQUE'!I109,\"s\")","v":"1h18min53s"}," ",{"$f":"IF(F72=\"A PORTEE\",'DATA TRAQUE'!$M$2+TIME(0,$D$3,$E$3)+TIME('DATA TRAQUE'!G109,'DATA TRAQUE'!H109,'DATA TRAQUE'!I109),\" \")","v":" "},{"$f":"IF(F72=\"A PORTEE\",G72-VLOOKUP($B$3,'DATA TRAQUE'!$B$41:$L$126,11),\"\")","v":""},{"$f":"IF(F72=\"A PORTEE\",'DATA TRAQUE'!$M$2+TIME(0,$D$3,$E$3)+2*TIME('DATA TRAQUE'!G103,'DATA TRAQUE'!H103,'DATA TRAQUE'!I103)+TIME(0,$F$3,$G$3),\" \")","v":" "},{"$f":"IF(F72=\"A PORTEE\",I72-VLOOKUP($B$3,'DATA TRAQUE'!$B$41:$L$126,11),\"\")","v":""}]
[null,{"$f":"'DATA TRAQUE'!B110","v":"riblibli"},{"$f":"'DATA TRAQUE'!C110","v":194929},{"$f":"SQRT(($C$6-'DATA TRAQUE'!D110)^2+(TRAQUE!$D$6-'DATA TRAQUE'!E110)^2)","v":150.02999700059985},{"$f":"CONCATENATE('DATA TRAQUE'!G110,\"h\",'DATA TRAQUE'!H110,\"min\",'DATA TRAQUE'!I110,\"s\")","v":"4h55min20s"}," ",{"$f":"IF(F73=\"A PORTEE\",'DATA TRAQUE'!$M$2+TIME(0,$D$3,$E$3)+TIME('DATA TRAQUE'!G110,'DATA TRAQUE'!H110,'DATA TRAQUE'!I110),\" \")","v":" "},{"$f":"IF(F73=\"A PORTEE\",G73-VLOOKUP($B$3,'DATA TRAQUE'!$B$41:$L$126,11),\"\")","v":""},{"$f":"IF(F73=\"A PORTEE\",'DATA TRAQUE'!$M$2+TIME(0,$D$3,$E$3)+2*TIME('DATA TRAQUE'!G104,'DATA TRAQUE'!H104,'DATA TRAQUE'!I104)+TIME(0,$F$3,$G$3),\" \")","v":" "},{"$f":"IF(F73=\"A PORTEE\",I73-VLOOKUP($B$3,'DATA TRAQUE'!$B$41:$L$126,11),\"\")","v":""}]
[null,{"$f":"'DATA TRAQUE'!B111","v":"Rita"},{"$f":"'DATA TRAQUE'!C111","v":616559697},{"$f":"SQRT(($C$6-'DATA TRAQUE'!D111)^2+(TRAQUE!$D$6-'DATA TRAQUE'!E111)^2)","v":147.95945390545344},{"$f":"CONCATENATE('DATA TRAQUE'!G111,\"h\",'DATA TRAQUE'!H111,\"min\",'DATA TRAQUE'!I111,\"s\")","v":"4h52min3s"},{"$f":"IF(AND((C74<=(3*$B$6)),(C74>=(0.5*$B$6))),\"A PORTEE\",\" \")","v":"A PORTEE"},{"$f":"IF(F74=\"A PORTEE\",'DATA TRAQUE'!$M$2+TIME(0,$D$3,$E$3)+TIME('DATA TRAQUE'!G111,'DATA TRAQUE'!H111,'DATA TRAQUE'!I111),\" \")","v":"22:23:33"},{"$f":"IF(F74=\"A PORTEE\",G74-VLOOKUP($B$3,'DATA TRAQUE'!$B$41:$L$126,11),\"\")","v":"22:08:18"},{"$f":"IF(F74=\"A PORTEE\",'DATA TRAQUE'!$M$2+TIME(0,$D$3,$E$3)+2*TIME('DATA TRAQUE'!G105,'DATA TRAQUE'!H105,'DATA TRAQUE'!I105)+TIME(0,$F$3,$G$3),\" \")","v":"18:16:34"},{"$f":"IF(F74=\"A PORTEE\",I74-VLOOKUP($B$3,'DATA TRAQUE'!$B$41:$L$126,11),\"\")","v":"18:01:19"}]
[null,{"$f":"'DATA TRAQUE'!B112","v":"Rockslide"},{"$f":"'DATA TRAQUE'!C112","v":192556364},{"$f":"SQRT(($C$6-'DATA TRAQUE'!D112)^2+(TRAQUE!$D$6-'DATA TRAQUE'!E112)^2)","v":7.0710678118654755},{"$f":"CONCATENATE('DATA TRAQUE'!G112,\"h\",'DATA TRAQUE'!H112,\"min\",'DATA TRAQUE'!I112,\"s\")","v":"0h16min57s"}," ",{"$f":"IF(F75=\"A PORTEE\",'DATA TRAQUE'!$M$2+TIME(0,$D$3,$E$3)+TIME('DATA TRAQUE'!G112,'DATA TRAQUE'!H112,'DATA TRAQUE'!I112),\" \")","v":" "},{"$f":"IF(F75=\"A PORTEE\",G75-VLOOKUP($B$3,'DATA TRAQUE'!$B$41:$L$126,11),\"\")","v":""},{"$f":"IF(F75=\"A PORTEE\",'DATA TRAQUE'!$M$2+TIME(0,$D$3,$E$3)+2*TIME('DATA TRAQUE'!G106,'DATA TRAQUE'!H106,'DATA TRAQUE'!I106)+TIME(0,$F$3,$G$3),\" \")","v":" "},{"$f":"IF(F75=\"A PORTEE\",I75-VLOOKUP($B$3,'DATA TRAQUE'!$B$41:$L$126,11),\"\")","v":""}]
[null,{"$f":"'DATA TRAQUE'!B113","v":"Rofulus"},{"$f":"'DATA TRAQUE'!C113","v":599979},{"$f":"SQRT(($C$6-'DATA TRAQUE'!D113)^2+(TRAQUE!$D$6-'DATA TRAQUE'!E113)^2)","v":65.12296062065974},{"$f":"CONCATENATE('DATA TRAQUE'!G113,\"h\",'DATA TRAQUE'!H113,\"min\",'DATA TRAQUE'!I113,\"s\")","v":"2h23min50s"}," ",{"$f":"IF(F76=\"A PORTEE\",'DATA TRAQUE'!$M$2+TIME(0,$D$3,$E$3)+TIME('DATA TRAQUE'!G113,'DATA TRAQUE'!H113,'DATA TRAQUE'!I113),\" \")","v":" "},{"$f":"IF(F76=\"A PORTEE\",G76-VLOOKUP($B$3,'DATA TRAQUE'!$B$41:$L$126,11),\"\")","v":""},{"$f":"IF(F76=\"A PORTEE\",'DATA TRAQUE'!$M$2+TIME(0,$D$3,$E$3)+2*TIME('DATA TRAQUE'!G107,'DATA TRAQUE'!H107,'DATA TRAQUE'!I107)+TIME(0,$F$3,$G$3),\" \")","v":" "},{"$f":"IF(F76=\"A PORTEE\",I76-VLOOKUP($B$3,'DATA TRAQUE'!$B$41:$L$126,11),\"\")","v":""}]
[null,{"$f":"'DATA TRAQUE'!B114","v":"ryuk44"},{"$f":"'DATA TRAQUE'!C114","v":53860510},{"$f":"SQRT(($C$6-'DATA TRAQUE'!D114)^2+(TRAQUE!$D$6-'DATA TRAQUE'!E114)^2)","v":111.04053313993049},{"$f":"CONCATENATE('DATA TRAQUE'!G114,\"h\",'DATA TRAQUE'!H114,\"min\",'DATA TRAQUE'!I114,\"s\")","v":"3h50min18s"}," ",{"$f":"IF(F77=\"A PORTEE\",'DATA TRAQUE'!$M$2+TIME(0,$D$3,$E$3)+TIME('DATA TRAQUE'!G114,'DATA TRAQUE'!H114,'DATA TRAQUE'!I114),\" \")","v":" "},{"$f":"IF(F77=\"A PORTEE\",G77-VLOOKUP($B$3,'DATA TRAQUE'!$B$41:$L$126,11),\"\")","v":""},{"$f":"IF(F77=\"A PORTEE\",'DATA TRAQUE'!$M$2+TIME(0,$D$3,$E$3)+2*TIME('DATA TRAQUE'!G108,'DATA TRAQUE'!H108,'DATA TRAQUE'!I108)+TIME(0,$F$3,$G$3),\" \")","v":" "},{"$f":"IF(F77=\"A PORTEE\",I77-VLOOKUP($B$3,'DATA TRAQUE'!$B$41:$L$126,11),\"\")","v":""}]
[null,{"$f":"'DATA TRAQUE'!B115","v":"Seiduna"},{"$f":"'DATA TRAQUE'!C115","v":184276},{"$f":"SQRT(($C$6-'DATA TRAQUE'!D115)^2+(TRAQUE!$D$6-'DATA TRAQUE'!E115)^2)","v":109.00458705944443},{"$f":"CONCATENATE('DATA TRAQUE'!G115,\"h\",'DATA TRAQUE'!H115,\"min\",'DATA TRAQUE'!I115,\"s\")","v":"3h46min42s"}," ",{"$f":"IF(F78=\"A PORTEE\",'DATA TRAQUE'!$M$2+TIME(0,$D$3,$E$3)+TIME('DATA TRAQUE'!G115,'DATA TRAQUE'!H115,'DATA TRAQUE'!I115),\" \")","v":" "},{"$f":"IF(F78=\"A PORTEE\",G78-VLOOKUP($B$3,'DATA TRAQUE'!$B$41:$L$126,11),\"\")","v":""},{"$f":"IF(F78=\"A PORTEE\",'DATA TRAQUE'!$M$2+TIME(0,$D$3,$E$3)+2*TIME('DATA TRAQUE'!G109,'DATA TRAQUE'!H109,'DATA TRAQUE'!I109)+TIME(0,$F$3,$G$3),\" \")","v":" "},{"$f":"IF(F78=\"A PORTEE\",I78-VLOOKUP($B$3,'DATA TRAQUE'!$B$41:$L$126,11),\"\")","v":""}]
[null,{"$f":"'DATA TRAQUE'!B116","v":"sentih"},{"$f":"'DATA TRAQUE'!C116","v":12854744},{"$f":"SQRT(($C$6-'DATA TRAQUE'!D116)^2+(TRAQUE!$D$6-'DATA TRAQUE'!E116)^2)","v":117.03845521878696},{"$f":"CONCATENATE('DATA TRAQUE'!G116,\"h\",'DATA TRAQUE'!H116,\"min\",'DATA TRAQUE'!I116,\"s\")","v":"4h0min47s"}," ",{"$f":"IF(F79=\"A PORTEE\",'DATA TRAQUE'!$M$2+TIME(0,$D$3,$E$3)+TIME('DATA TRAQUE'!G116,'DATA TRAQUE'!H116,'DATA TRAQUE'!I116),\" \")","v":" "},{"$f":"IF(F79=\"A PORTEE\",G79-VLOOKUP($B$3,'DATA TRAQUE'!$B$41:$L$126,11),\"\")","v":""},{"$f":"IF(F79=\"A PORTEE\",'DATA TRAQUE'!$M$2+TIME(0,$D$3,$E$3)+2*TIME('DATA TRAQUE'!G110,'DATA TRAQUE'!H110,'DATA TRAQUE'!I110)+TIME(0,$F$3,$G$3),\" \")","v":" "},{"$f":"IF(F79=\"A PORTEE\",I79-VLOOKUP($B$3,'DATA TRAQUE'!$B$41:$L$126,11),\"\")","v":""}]
[null,{"$f":"'DATA TRAQUE'!B64","v":"sergioo"},{"$f":"'DATA TRAQUE'!C64","v":29711962},{"$f":"SQRT(($C$6-'DATA TRAQUE'!D64)^2+(TRAQUE!$D$6-'DATA TRAQUE'!E64)^2)","v":154.14927829866735},{"$f":"CONCATENATE('DATA TRAQUE'!G64,\"h\",'DATA TRAQUE'!H64,\"min\",'DATA TRAQUE'!I64,\"s\")","v":"5h1min47s"}," ",{"$f":"IF(F80=\"A PORTEE\",'DATA TRAQUE'!$M$2+TIME(0,$D$3,$E$3)+TIME('DATA TRAQUE'!G64,'DATA TRAQUE'!H64,'DATA TRAQUE'!I64),\" \")","v":" "},{"$f":"IF(F80=\"A PORTEE\",G80-VLOOKUP($B$3,'DATA TRAQUE'!$B$41:$L$126,11),\"\")","v":""},{"$f":"IF(F80=\"A PORTEE\",'DATA TRAQUE'!$M$2+TIME(0,$D$3,$E$3)+2*TIME('DATA TRAQUE'!G111,'DATA TRAQUE'!H111,'DATA TRAQUE'!I111)+TIME(0,$F$3,$G$3),\" \")","v":" "},{"$f":"IF(F80=\"A PORTEE\",I80-VLOOKUP($B$3,'DATA TRAQUE'!$B$41:$L$126,11),\"\")","v":""}]
[null,{"$f":"'DATA TRAQUE'!B117","v":"Shikamaru"},{"$f":"'DATA TRAQUE'!C117","v":8133785},{"$f":"SQRT(($C$6-'DATA TRAQUE'!D117)^2+(TRAQUE!$D$6-'DATA TRAQUE'!E117)^2)","v":26.172504656604801},{"$f":"CONCATENATE('DATA TRAQUE'!G117,\"h\",'DATA TRAQUE'!H117,\"min\",'DATA TRAQUE'!I117,\"s\")","v":"1h1min3s"}," ",{"$f":"IF(F81=\"A PORTEE\",'DATA TRAQUE'!$M$2+TIME(0,$D$3,$E$3)+TIME('DATA TRAQUE'!G117,'DATA TRAQUE'!H117,'DATA TRAQUE'!I117),\" \")","v":" "},{"$f":"IF(F81=\"A PORTEE\",G81-VLOOKUP($B$3,'DATA TRAQUE'!$B$41:$L$126,11),\"\")","v":""},{"$f":"IF(F81=\"A PORTEE\",'DATA TRAQUE'!$M$2+TIME(0,$D$3,$E$3)+2*TIME('DATA TRAQUE'!G112,'DATA TRAQUE'!H112,'DATA TRAQUE'!I112)+TIME(0,$F$3,$G$3),\" \")","v":" "},{"$f":"IF(F81=\"A PORTEE\",I81-VLOOKUP($B$3,'DATA TRAQUE'!$B$41:$L$126,11),\"\")","v":""}]
[null,{"$f":"'DATA TRAQUE'!B65","v":"shub"},{"$f":"'DATA TRAQUE'!C65","v":728876},{"$f":"SQRT(($C$6-'DATA TRAQUE'!D65)^2+(TRAQUE!$D$6-'DATA TRAQUE'!E65)^2)","v":140.91841611372163},{"$f":"CONCATENATE('DATA TRAQUE'!G65,\"h\",'DATA TRAQUE'!H65,\"min\",'DATA TRAQUE'!I65,\"s\")","v":"4h40min46s"}," ",{"$f":"IF(F82=\"A PORTEE\",'DATA TRAQUE'!$M$2+TIME(0,$D$3,$E$3)+TIME('DATA TRAQUE'!G65,'DATA TRAQUE'!H65,'DATA TRAQUE'!I65),\" \")","v":" "},{"$f":"IF(F82=\"A PORTEE\",G82-VLOOKUP($B$3,'DATA TRAQUE'!$B$41:$L$126,11),\"\")","v":""},{"$f":"IF(F82=\"A PORTEE\",'DATA TRAQUE'!$M$2+TIME(0,$D$3,$E$3)+2*TIME('DATA TRAQUE'!G113,'DATA TRAQUE'!H113,'DATA TRAQUE'!I113)+TIME(0,$F$3,$G$3),\" \")","v":" "},{"$f":"IF(F82=\"A PORTEE\",I82-VLOOKUP($B$3,'DATA TRAQUE'!$B$41:$L$126,11),\"\")","v":""}]
[null,{"$f":"'DATA TRAQUE'!B66","v":"Slipstream"},{"$f":"'DATA TRAQUE'!C66","v":104115},{"$f":"SQRT(($C$6-'DATA TRAQUE'!D66)^2+(TRAQUE!$D$6-'DATA TRAQUE'!E66)^2)","v":6.0827625302982193},{"$f":"CONCATENATE('DATA TRAQUE'!G66,\"h\",'DATA TRAQUE'!H66,\"min\",'DATA TRAQUE'!I66,\"s\")","v":"0h14min36s"}," ",{"$f":"IF(F83=\"A PORTEE\",'DATA TRAQUE'!$M$2+TIME(0,$D$3,$E$3)+TIME('DATA TRAQUE'!G66,'DATA TRAQUE'!H66,'DATA TRAQUE'!I66),\" \")","v":" "},{"$f":"IF(F83=\"A PORTEE\",G83-VLOOKUP($B$3,'DATA TRAQUE'!$B$41:$L$126,11),\"\")","v":""},{"$f":"IF(F83=\"A PORTEE\",'DATA TRAQUE'!$M$2+TIME(0,$D$3,$E$3)+2*TIME('DATA TRAQUE'!G114,'DATA TRAQUE'!H114,'DATA TRAQUE'!I114)+TIME(0,$F$3,$G$3),\" \")","v":" "},{"$f":"IF(F83=\"A PORTEE\",I83-VLOOKUP($B$3,'DATA TRAQUE'!$B$41:$L$126,11),\"\")","v":""}]
[null,{"$f":"'DATA TRAQUE'!B118","v":"spetsnaz"},{"$f":"'DATA TRAQUE'!C118","v":3500000000},{"$f":"SQRT(($C$6-'DATA TRAQUE'!D118)^2+(TRAQUE!$D$6-'DATA TRAQUE'!E118)^2)","v":56.302753041036986},{"$f":"CONCATENATE('DATA TRAQUE'!G118,\"h\",'DATA TRAQUE'!H118,\"min\",'DATA TRAQUE'!I118,\"s\")","v":"2h5min53s"}," ",{"$f":"IF(F84=\"A PORTEE\",'DATA TRAQUE'!$M$2+TIME(0,$D$3,$E$3)+TIME('DATA TRAQUE'!G118,'DATA TRAQUE'!H118,'DATA TRAQUE'!I118),\" \")","v":" "},{"$f":"IF(F84=\"A PORTEE\",G84-VLOOKUP($B$3,'DATA TRAQUE'!$B$41:$L$126,11),\"\")","v":""},{"$f":"IF(F84=\"A PORTEE\",'DATA TRAQUE'!$M$2+TIME(0,$D$3,$E$3)+2*TIME('DATA TRAQUE'!G115,'DATA TRAQUE'!H115,'DATA TRAQUE'!I115)+TIME(0,$F$3,$G$3),\" \")","v":" "},{"$f":"IF(F84=\"A PORTEE\",I84-VLOOKUP($B$3,'DATA TRAQUE'!$B$41:$L$126,11),\"\")","v":""}]
[null,{"$f":"'DATA TRAQUE'!B119","v":"svanhilde"},{"$f":"'DATA TRAQUE'!C119","v":2500000000},{"$f":"SQRT(($C$6-'DATA TRAQUE'!D119)^2+(TRAQUE!$D$6-'DATA TRAQUE'!E119)^2)","v":52},{"$f":"CONCATENATE('DATA TRAQUE'!G119,\"h\",'DATA TRAQUE'!H119,\"min\",'DATA TRAQUE'!I119,\"s\")","v":"1h56min58s"}," ",{"$f":"IF(F85=\"A PORTEE\",'DATA TRAQUE'!$M$2+TIME(0,$D$3,$E$3)+TIME('DATA TRAQUE'!G119,'DATA TRAQUE'!H119,'DATA TRAQUE'!I119),\" \")","v":" "},{"$f":"IF(F85=\"A PORTEE\",G85-VLOOKUP($B$3,'DATA TRAQUE'!$B$41:$L$126,11),\"\")","v":""},{"$f":"IF(F85=\"A PORTEE\",'DATA TRAQUE'!$M$2+TIME(0,$D$3,$E$3)+2*TIME('DATA TRAQUE'!G116,'DATA TRAQUE'!H116,'DATA TRAQUE'!I116)+TIME(0,$F$3,$G$3),\" \")","v":" "},{"$f":"IF(F85=\"A PORTEE\",I85-VLOOKUP($B$3,'DATA TRAQUE'!$B$41:$L$126,11),\"\")","v":""}]
[null,{"$f":"'DATA TRAQUE'!B120","v":"Taouret"},{"$f":"'DATA TRAQUE'!C120","v":688628575},{"$f":"SQRT(($C$6-'DATA TRAQUE'!D120)^2+(TRAQUE!$D$6-'DATA TRAQUE'!E120)^2)","v":69.289248805280025},{"$f":"CONCATENATE('DATA TRAQUE'!G120,\"h\",'DATA TRAQUE'!H120,\"min\",'DATA TRAQUE'!I120,\"s\")","v":"2h32min9s"},"A PORTEE",{"$f":"IF(F86=\"A PORTEE\",'DATA TRAQUE'!$M$2+TIME(0,$D$3,$E$3)+TIME('DATA TRAQUE'!G120,'DATA TRAQUE'!H120,'DATA TRAQUE'!I120),\" \")","v":"20:03:39"},{"$f":"IF(F86=\"A PORTEE\",G86-VLOOKUP($B$3,'DATA TRAQUE'!$B$41:$L$126,11),\"\")","v":"19:48:24"},{"$f":"IF(F86=\"A PORTEE\",'DATA TRAQUE'!$M$2+TIME(0,$D$3,$E$3)+2*TIME('DATA TRAQUE'!G117,'DATA TRAQUE'!H117,'DATA TRAQUE'!I117)+TIME(0,$F$3,$G$3),\" \")","v":"19:34:36"},{"$f":"IF(F86=\"A PORTEE\",I86-VLOOKUP($B$3,'DATA TRAQUE'!$B$41:$L$126,11),\"\")","v":"19:19:21"}]
[null,{"$f":"'DATA TRAQUE'!B121","v":"TheDentist"},{"$f":"'DATA TRAQUE'!C121","v":14367717},{"$f":"SQRT(($C$6-'DATA TRAQUE'!D121)^2+(TRAQUE!$D$6-'DATA TRAQUE'!E121)^2)","v":119.41942890501528},{"$f":"CONCATENATE('DATA TRAQUE'!G121,\"h\",'DATA TRAQUE'!H121,\"min\",'DATA TRAQUE'!I121,\"s\")","v":"4h4min54s"}," ",{"$f":"IF(F87=\"A PORTEE\",'DATA TRAQUE'!$M$2+TIME(0,$D$3,$E$3)+TIME('DATA TRAQUE'!G121,'DATA TRAQUE'!H121,'DATA TRAQUE'!I121),\" \")","v":" "},{"$f":"IF(F87=\"A PORTEE\",G87-VLOOKUP($B$3,'DATA TRAQUE'!$B$41:$L$126,11),\"\")","v":""},{"$f":"IF(F87=\"A PORTEE\",'DATA TRAQUE'!$M$2+TIME(0,$D$3,$E$3)+2*TIME('DATA TRAQUE'!G118,'DATA TRAQUE'!H118,'DATA TRAQUE'!I118)+TIME(0,$F$3,$G$3),\" \")","v":" "},{"$f":"IF(F87=\"A PORTEE\",I87-VLOOKUP($B$3,'DATA TRAQUE'!$B$41:$L$126,11),\"\")","v":""}]
[null,{"$f":"'DATA TRAQUE'!B122","v":"Thunderbird"},{"$f":"'DATA TRAQUE'!C122","v":2202808830},{"$f":"SQRT(($C$6-'DATA TRAQUE'!D122)^2+(TRAQUE!$D$6-'DATA TRAQUE'!E122)^2)","v":4},{"$f":"CONCATENATE('DATA TRAQUE'!G122,\"h\",'DATA TRAQUE'!H122,\"min\",'DATA TRAQUE'!I122,\"s\")","v":"0h9min38s"}," ",{"$f":"IF(F88=\"A PORTEE\",'DATA TRAQUE'!$M$2+TIME(0,$D$3,$E$3)+TIME('DATA TRAQUE'!G122,'DATA TRAQUE'!H122,'DATA TRAQUE'!I122),\" \")","v":" "},{"$f":"IF(F88=\"A PORTEE\",G88-VLOOKUP($B$3,'DATA TRAQUE'!$B$41:$L$126,11),\"\")","v":""},{"$f":"IF(F88=\"A PORTEE\",'DATA TRAQUE'!$M$2+TIME(0,$D$3,$E$3)+2*TIME('DATA TRAQUE'!G119,'DATA TRAQUE'!H119,'DATA TRAQUE'!I119)+TIME(0,$F$3,$G$3),\" \")","v":" "},{"$f":"IF(F88=\"A PORTEE\",I88-VLOOKUP($B$3,'DATA TRAQUE'!$B$41:$L$126,11),\"\")","v":""}]
[null,{"$f":"'DATA TRAQUE'!B123","v":"Tradjette"},{"$f":"'DATA TRAQUE'!C123","v":34256999},{"$f":"SQRT(($C$6-'DATA TRAQUE'!D123)^2+(TRAQUE!$D$6-'DATA TRAQUE'!E123)^2)","v":159.0125781188394},{"$f":"CONCATENATE('DATA TRAQUE'!G123,\"h\",'DATA TRAQUE'!H123,\"min\",'DATA TRAQUE'!I123,\"s\")","v":"5h9min19s"}," ",{"$f":"IF(F89=\"A PORTEE\",'DATA TRAQUE'!$M$2+TIME(0,$D$3,$E$3)+TIME('DATA TRAQUE'!G123,'DATA TRAQUE'!H123,'DATA TRAQUE'!I123),\" \")","v":" "},{"$f":"IF(F89=\"A PORTEE\",G89-VLOOKUP($B$3,'DATA TRAQUE'!$B$41:$L$126,11),\"\")","v":""},{"$f":"IF(F89=\"A PORTEE\",'DATA TRAQUE'!$M$2+TIME(0,$D$3,$E$3)+2*TIME('DATA TRAQUE'!G120,'DATA TRAQUE'!H120,'DATA TRAQUE'!I120)+TIME(0,$F$3,$G$3),\" \")","v":" "},{"$f":"IF(F89=\"A PORTEE\",I89-VLOOKUP($B$3,'DATA TRAQUE'!$B$41:$L$126,11),\"\")","v":""}]
[null,{"$f":"'DATA TRAQUE'!B124","v":"vinkou"},{"$f":"'DATA TRAQUE'!C124","v":2046872542},{"$f":"SQRT(($C$6-'DATA TRAQUE'!D124)^2+(TRAQUE!$D$6-'DATA TRAQUE'!E124)^2)","v":74.303431953039691},{"$f":"CONCATENATE('DATA TRAQUE'!G124,\"h\",'DATA TRAQUE'!H124,\"min\",'DATA TRAQUE'!I124,\"s\")","v":"2h42min2s"}," ",{"$f":"IF(F90=\"A PORTEE\",'DATA TRAQUE'!$M$2+TIME(0,$D$3,$E$3)+TIME('DATA TRAQUE'!G124,'DATA TRAQUE'!H124,'DATA TRAQUE'!I124),\" \")","v":" "},{"$f":"IF(F90=\"A PORTEE\",G90-VLOOKUP($B$3,'DATA TRAQUE'!$B$41:$L$126,11),\"\")","v":""},{"$f":"IF(F90=\"A PORTEE\",'DATA TRAQUE'!$M$2+TIME(0,$D$3,$E$3)+2*TIME('DATA TRAQUE'!G121,'DATA TRAQUE'!H121,'DATA TRAQUE'!I121)+TIME(0,$F$3,$G$3),\" \")","v":" "},{"$f":"IF(F90=\"A PORTEE\",I90-VLOOKUP($B$3,'DATA TRAQUE'!$B$41:$L$126,11),\"\")","v":""}]
[null,{"$f":"'DATA TRAQUE'!B67","v":"waylander"},{"$f":"'DATA TRAQUE'!C67","v":145222702},{"$f":"SQRT(($C$6-'DATA TRAQUE'!D67)^2+(TRAQUE!$D$6-'DATA TRAQUE'!E67)^2)","v":142.1724305201258},{"$f":"CONCATENATE('DATA TRAQUE'!G67,\"h\",'DATA TRAQUE'!H67,\"min\",'DATA TRAQUE'!I67,\"s\")","v":"4h42min48s"}," ",{"$f":"IF(F91=\"A PORTEE\",'DATA TRAQUE'!$M$2+TIME(0,$D$3,$E$3)+TIME('DATA TRAQUE'!G67,'DATA TRAQUE'!H67,'DATA TRAQUE'!I67),\" \")","v":" "},{"$f":"IF(F91=\"A PORTEE\",G91-VLOOKUP($B$3,'DATA TRAQUE'!$B$41:$L$126,11),\"\")","v":""},{"$f":"IF(F91=\"A PORTEE\",'DATA TRAQUE'!$M$2+TIME(0,$D$3,$E$3)+2*TIME('DATA TRAQUE'!G122,'DATA TRAQUE'!H122,'DATA TRAQUE'!I122)+TIME(0,$F$3,$G$3),\" \")","v":" "},{"$f":"IF(F91=\"A PORTEE\",I91-VLOOKUP($B$3,'DATA TRAQUE'!$B$41:$L$126,11),\"\")","v":""}]
[null,{"$f":"'DATA TRAQUE'!B125","v":"weaver"},{"$f":"'DATA TRAQUE'!C125","v":12457093},{"$f":"SQRT(($C$6-'DATA TRAQUE'!D125)^2+(TRAQUE!$D$6-'DATA TRAQUE'!E125)^2)","v":159.15401345866212},{"$f":"CONCATENATE('DATA TRAQUE'!G125,\"h\",'DATA TRAQUE'!H125,\"min\",'DATA TRAQUE'!I125,\"s\")","v":"5h9min32s"}," ",{"$f":"IF(F92=\"A PORTEE\",'DATA TRAQUE'!$M$2+TIME(0,$D$3,$E$3)+TIME('DATA TRAQUE'!G125,'DATA TRAQUE'!H125,'DATA TRAQUE'!I125),\" \")","v":" "},{"$f":"IF(F92=\"A PORTEE\",G92-VLOOKUP($B$3,'DATA TRAQUE'!$B$41:$L$126,11),\"\")","v":""},{"$f":"IF(F92=\"A PORTEE\",'DATA TRAQUE'!$M$2+TIME(0,$D$3,$E$3)+2*TIME('DATA TRAQUE'!G123,'DATA TRAQUE'!H123,'DATA TRAQUE'!I123)+TIME(0,$F$3,$G$3),\" \")","v":" "},{"$f":"IF(F92=\"A PORTEE\",I92-VLOOKUP($B$3,'DATA TRAQUE'!$B$41:$L$126,11),\"\")","v":""}]
[null,{"$f":"'DATA TRAQUE'!B68","v":"weed"},{"$f":"'DATA TRAQUE'!C68","v":1827888},{"$f":"SQRT(($C$6-'DATA TRAQUE'!D68)^2+(TRAQUE!$D$6-'DATA TRAQUE'!E68)^2)","v":44.045431091090478},{"$f":"CONCATENATE('DATA TRAQUE'!G68,\"h\",'DATA TRAQUE'!H68,\"min\",'DATA TRAQUE'!I68,\"s\")","v":"1h40min11s"}," ",{"$f":"IF(F93=\"A PORTEE\",'DATA TRAQUE'!$M$2+TIME(0,$D$3,$E$3)+TIME('DATA TRAQUE'!G68,'DATA TRAQUE'!H68,'DATA TRAQUE'!I68),\" \")","v":" "},{"$f":"IF(F93=\"A PORTEE\",G93-VLOOKUP($B$3,'DATA TRAQUE'!$B$41:$L$126,11),\"\")","v":""},{"$f":"IF(F93=\"A PORTEE\",'DATA TRAQUE'!$M$2+TIME(0,$D$3,$E$3)+2*TIME('DATA TRAQUE'!G124,'DATA TRAQUE'!H124,'DATA TRAQUE'!I124)+TIME(0,$F$3,$G$3),\" \")","v":" "},{"$f":"IF(F93=\"A PORTEE\",I93-VLOOKUP($B$3,'DATA TRAQUE'!$B$41:$L$126,11),\"\")","v":""}]
[null,{"$f":"'DATA TRAQUE'!B126","v":"Wolverine"},{"$f":"'DATA TRAQUE'!C126","v":2500000000},{"$f":"SQRT(($C$6-'DATA TRAQUE'!D126)^2+(TRAQUE!$D$6-'DATA TRAQUE'!E126)^2)","v":138.03260484392808},{"$f":"CONCATENATE('DATA TRAQUE'!G126,\"h\",'DATA TRAQUE'!H126,\"min\",'DATA TRAQUE'!I126,\"s\")","v":"4h36min5s"}," ",{"$f":"IF(F94=\"A PORTEE\",'DATA TRAQUE'!$M$2+TIME(0,$D$3,$E$3)+TIME('DATA TRAQUE'!G126,'DATA TRAQUE'!H126,'DATA TRAQUE'!I126),\" \")","v":" "},{"$f":"IF(F94=\"A PORTEE\",G94-VLOOKUP($B$3,'DATA TRAQUE'!$B$41:$L$126,11),\"\")","v":""},{"$f":"IF(F94=\"A PORTEE\",'DATA TRAQUE'!$M$2+TIME(0,$D$3,$E$3)+2*TIME('DATA TRAQUE'!G125,'DATA TRAQUE'!H125,'DATA TRAQUE'!I125)+TIME(0,$F$3,$G$3),\" \")","v":" "},{"$f":"IF(F94=\"A PORTEE\",I94-VLOOKUP($B$3,'DATA TRAQUE'!$B$41:$L$126,11),\"\")","v":""}]
[null,{"$f":"'DATA TRAQUE'!B69","v":"Zerek"},{"$f":"'DATA TRAQUE'!C69","v":305693},{"$f":"SQRT(($C$6-'DATA TRAQUE'!D69)^2+(TRAQUE!$D$6-'DATA TRAQUE'!E69)^2)","v":113},{"$f":"CONCATENATE('DATA TRAQUE'!G69,\"h\",'DATA TRAQUE'!H69,\"min\",'DATA TRAQUE'!I69,\"s\")","v":"3h53min45s"}," ",{"$f":"IF(F95=\"A PORTEE\",'DATA TRAQUE'!$M$2+TIME(0,$D$3,$E$3)+TIME('DATA TRAQUE'!G69,'DATA TRAQUE'!H69,'DATA TRAQUE'!I69),\" \")","v":" "},{"$f":"IF(F95=\"A PORTEE\",G95-VLOOKUP($B$3,'DATA TRAQUE'!$B$41:$L$126,11),\"\")","v":""},{"$f":"IF(F95=\"A PORTEE\",'DATA TRAQUE'!$M$2+TIME(0,$D$3,$E$3)+2*TIME('DATA TRAQUE'!G126,'DATA TRAQUE'!H126,'DATA TRAQUE'!I126)+TIME(0,$F$3,$G$3),\" \")","v":" "},{"$f":"IF(F95=\"A PORTEE\",I95-VLOOKUP($B$3,'DATA TRAQUE'!$B$41:$L$126,11),\"\")","v":""}]
[]
[]
[]
[]
[]
[]
[]
[]
[]
[]
[]
[]
[]
[]
[]
[]
[]
[]
[]
[]
[]
[]
[]
[]
[]
[]
[]
[]
[]
[]
[]
[]
[]
[]
[]
[]
[]
[]
[]
[]
[]
[]
[]
[]
[]
[]
[]
[]
[]
[]
[]
[]
[]
[]
[]
[]
[]
[]
[]
[]
[]
[]
[]
[]
[]
[]
[]
[]
[]
[]
[]
[]
[]
[]
[]
[]
[]
[]
[]
[]
[]
[]
[]
[]
[]
[]
[]
[]
[]
[]
[null,{"$f":"LXM!A4","v":"_Angel_"}]
[null,{"$f":"LXM!A5","v":"_diablo_"}]
[null,{"$f":"LXM!A6","v":"_Wolverine_"}]
[null,{"$f":"LXM!A7","v":"4midiable"}]
[null,{"$f":"LXM!A8","v":"AB64"}]
[null,{"$f":"LXM!A9","v":"Allerdyce"}]
[null,{"$f":"LXM!A10","v":"bubulle"}]
[null,{"$f":"LXM!A11","v":"creamy"}]
[null,{"$f":"LXM!A12","v":"crunchy"}]
[null,{"$f":"LXM!A13","v":"Cyclope"}]
[null,{"$f":"LXM!A14","v":"Domino"}]
[null,{"$f":"LXM!A15","v":"Eltornado"}]
[null,{"$f":"LXM!A16","v":"Fleau"}]
[null,{"$f":"LXM!A17","v":"Formidabilis"}]
[null,{"$f":"LXM!A18","v":"Jericho"}]
[null,{"$f":"LXM!A19","v":"kandide"}]
[null,{"$f":"LXM!A20","v":"laika"}]
[null,{"$f":"LXM!A21","v":"Matteo37"}]
[null,{"$f":"LXM!A22","v":"maxbo"}]
[null,{"$f":"LXM!A23","v":"moontribe"}]
[null,{"$f":"LXM!A24","v":"mouche"}]
[null,{"$f":"LXM!A25","v":"Norrin-Radd"}]
[null,{"$f":"LXM!A26","v":"Prend-Ta-Claque"}]
[null,{"$f":"LXM!A27","v":"sergioo"}]
[null,{"$f":"LXM!A28","v":"shub"}]
[null,{"$f":"LXM!A29","v":"Slipstream"}]
[null,{"$f":"LXM!A30","v":"waylander"}]
[null,{"$f":"LXM!A31","v":"weed"}]
[null,{"$f":"LXM!A32","v":"Zerek"}]

{"sheet":"DATA BES","index":9,"n_rows":123,"n_cols":14,"rows_kept":123,"cut":false,"hidden":false,"merged":[]}
[null,"Distance","Temps (s)","heures","minutes","secondes"]
["agecanonix",{"$f":"SQRT((BES!$L$1-BES!E4)^2+(BES!$N$1-BES!F4)^2)","v":98.081598681913832},{"$f":"24*3600*(1-EXP(-B2/350))*7.375*(0.9^LXM!$H$1)","v":11179.600174950123},{"$f":"ROUNDDOWN(C2/(60*60),0)","v":3},{"$f":"ROUNDDOWN(((C2-D2*60*60)/60),0)","v":6},{"$f":"ROUNDUP((C2-D2*60*60-E2*60),0)","v":20},null,null,null,null,null,{"$f":"BES!D4","v":" "},{"$f":"BES!A4","v":"agecanonix"},{"$f":"BES!C4","v":3461184525}]
["aubertignac",{"$f":"SQRT((BES!$L$1-BES!E5)^2+(BES!$N$1-BES!F5)^2)","v":121.41251994749142},{"$f":"24*3600*(1-EXP(-B3/350))*7.375*(0.9^LXM!$H$1)","v":13408.569336591723},{"$f":"ROUNDDOWN(C3/(60*60),0)","v":3},{"$f":"ROUNDDOWN(((C3-D3*60*60)/60),0)","v":43},{"$f":"ROUNDUP((C3-D3*60*60-E3*60),0)","v":29},null,null,null,null,null,{"$f":"BES!D5","v":" "},{"$f":"BES!A5","v":"aubertignac"},{"$f":"BES!C5","v":87905571}]
["Azkanith",{"$f":"SQRT((BES!$L$1-BES!E6)^2+(BES!$N$1-BES!F6)^2)","v":112.64102272262978},{"$f":"24*3600*(1-EXP(-B4/350))*7.375*(0.9^LXM!$H$1)","v":12587.945941018934},3,29,48,null,"Pour temps",null,null,null,{"$f":"BES!D6","v":" "},{"$f":"BES!A6","v":"Azkanith"},{"$f":"BES!C6","v":3500000000}]
["Bactroban",{"$f":"SQRT((BES!$L$1-BES!E7)^2+(BES!$N$1-BES!F7)^2)","v":58.137767414994535},{"$f":"24*3600*(1-EXP(-B5/350))*7.375*(0.9^LXM!$H$1)","v":7000.9683032987787},1,56,41,null,null,null,null,null,{"$f":"BES!D7","v":" "},{"$f":"BES!A7","v":"Bactroban"},{"$f":"BES!C7","v":2154874164}]
["ben57",{"$f":"SQRT((BES!$L$1-BES!E8)^2+(BES!$N$1-BES!F8)^2)","v":167.76471619503309},{"$f":"24*3600*(1-EXP(-B6/350))*7.375*(0.9^LXM!$H$1)","v":17419.513051631115},4,50,20,null,null,null,null,null,{"$f":"BES!D8","v":" "},{"$f":"BES!A8","v":"ben57"},{"$f":"BES!C8","v":149380852}]
["bib595",{"$f":"SQRT((BES!$L$1-BES!E9)^2+(BES!$N$1-BES!F9)^2)","v":64.124878167525594},{"$f":"24*3600*(1-EXP(-B7/350))*7.375*(0.9^LXM!$H$1)","v":7658.0793543996369},2,7,39,null,null,null,null,null,{"$f":"BES!D9","v":" "},{"$f":"BES!A9","v":"bib595"},{"$f":"BES!C9","v":2905019}]
["bill",{"$f":"SQRT((BES!$L$1-BES!E10)^2+(BES!$N$1-BES!F10)^2)","v":61.073725938409879},{"$f":"24*3600*(1-EXP(-B8/350))*7.375*(0.9^LXM!$H$1)","v":7324.6069461038587},2,2,5,null,null,null,null,null,{"$f":"BES!D10","v":" "},{"$f":"BES!A10","v":"bill"},{"$f":"BES!C10","v":54154338}]
["Bruxelles",{"$f":"SQRT((BES!$L$1-BES!E11)^2+(BES!$N$1-BES!F11)^2)","v":119.64113005150027},{"$f":"24*3600*(1-EXP(-B9/350))*7.375*(0.9^LXM!$H$1)","v":13244.498869710833},3,40,45,null,null,null,null,null,{"$f":"BES!D11","v":" "},{"$f":"BES!A11","v":"Bruxelles"},{"$f":"BES!C11","v":3200000000}]
["Chryom",{"$f":"SQRT((BES!$L$1-BES!E12)^2+(BES!$N$1-BES!F12)^2)","v":115.21284650593439},{"$f":"24*3600*(1-EXP(-B10/350))*7.375*(0.9^LXM!$H$1)","v":12830.6893180979},3,33,51,null,null,null,null,null,{"$f":"BES!D12","v":" "},{"$f":"BES!A12","v":"Chryom"},{"$f":"BES!C12","v":9996200}]
["CroolisVar",{"$f":"SQRT((BES!$L$1-BES!E13)^2+(BES!$N$1-BES!F13)^2)","v":41.868842830916641},{"$f":"24*3600*(1-EXP(-B11/350))*7.375*(0.9^LXM!$H$1)","v":5157.5570598178347},1,25,58,null,null,null,null,null,{"$f":"BES!D14","v":" "},{"$f":"BES!A14","v":"Damping"},{"$f":"BES!C14","v":16221345}]
["Damping",{"$f":"SQRT((BES!$L$1-BES!E14)^2+(BES!$N$1-BES!F14)^2)","v":97.867257037274726},{"$f":"24*3600*(1-EXP(-B12/350))*7.375*(0.9^LXM!$H$1)","v":11158.426009593994},3,5,59,null,null,null,null,null,{"$f":"BES!D15","v":" "},{"$f":"BES!A15","v":"DrAnts"},{"$f":"BES!C15","v":3848814}]
["DrAnts",{"$f":"SQRT((BES!$L$1-BES!E15)^2+(BES!$N$1-BES!F15)^2)","v":103.07764064044152},{"$f":"24*3600*(1-EXP(-B13/350))*7.375*(0.9^LXM!$H$1)","v":11669.488251486338},3,14,30,null,null,null,null,null,{"$f":"BES!D16","v":" "},{"$f":"BES!A16","v":"Drusilla"},{"$f":"BES!C16","v":1855225863}]
["Drusilla",{"$f":"SQRT((BES!$L$1-BES!E16)^2+(BES!$N$1-BES!F16)^2)","v":150.74813431681335},{"$f":"24*3600*(1-EXP(-B14/350))*7.375*(0.9^LXM!$H$1)","v":16008.361694210183},4,26,49,null,null,null,null,null,{"$f":"BES!D17","v":" "},{"$f":"BES!A17","v":"EllaVonZedanltha"},{"$f":"BES!C17","v":1952804}]
["EllaVonZedanltha",{"$f":"SQRT((BES!$L$1-BES!E17)^2+(BES!$N$1-BES!F17)^2)","v":114.73883387938018},{"$f":"24*3600*(1-EXP(-B15/350))*7.375*(0.9^LXM!$H$1)","v":12786.08328292626},3,33,7,null,null,null,null,null,{"$f":"BES!D18","v":" "},{"$f":"BES!A18","v":"Flipper1"},{"$f":"BES!C18","v":92127906}]
["Flipper1",{"$f":"SQRT((BES!$L$1-BES!E18)^2+(BES!$N$1-BES!F18)^2)","v":104.17293314484334},{"$f":"24*3600*(1-EXP(-B16/350))*7.375*(0.9^LXM!$H$1)","v":11775.956033787372},3,16,16,null,null,null,null,null,{"$f":"BES!D19","v":" "},{"$f":"BES!A19","v":"Greeny"},{"$f":"BES!C19","v":26570199}]
["Greeny",{"$f":"SQRT((BES!$L$1-BES!E19)^2+(BES!$N$1-BES!F19)^2)","v":123.1990259701756},{"$f":"24*3600*(1-EXP(-B17/350))*7.375*(0.9^LXM!$H$1)","v":13573.20099427716},3,46,14,null,null,null,null,null,{"$f":"BES!D20","v":" "},{"$f":"BES!A20","v":"Gueust"},{"$f":"BES!C20","v":1480632393}]
["Gueust",{"$f":"SQRT((BES!$L$1-BES!E20)^2+(BES!$N$1-BES!F20)^2)","v":212.39821091525229},{"$f":"24*3600*(1-EXP(-B18/350))*7.375*(0.9^LXM!$H$1)","v":20810.800833584588},5,46,51,null,null,null,null,null,{"$f":"BES!D23","v":" "},{"$f":"BES!A23","v":"Lesqual"},{"$f":"BES!C23","v":4423829}]
["hador",{"$f":"SQRT((BES!$L$1-BES!E21)^2+(BES!$N$1-BES!F21)^2)","v":17.029386365926403},{"$f":"24*3600*(1-EXP(-B19/350))*7.375*(0.9^LXM!$H$1)","v":2172.435604015885},0,36,13,null,null,null,null,null,{"$f":"BES!D24","v":" "},{"$f":"BES!A24","v":"lipoussou"},{"$f":"BES!C24","v":11917308}]
["Ishigo",{"$f":"SQRT((BES!$L$1-BES!E22)^2+(BES!$N$1-BES!F22)^2)","v":70.34912934784623},{"$f":"24*3600*(1-EXP(-B20/350))*7.375*(0.9^LXM!$H$1)","v":8329.4043777067491},2,18,50,null,null,null,null,null,{"$f":"BES!D25","v":" "},{"$f":"BES!A25","v":"Lockheed"},{"$f":"BES!C25","v":11216156}]
["Lesqual",{"$f":"SQRT((BES!$L$1-BES!E23)^2+(BES!$N$1-BES!F23)^2)","v":122.20065466273084},{"$f":"24*3600*(1-EXP(-B21/350))*7.375*(0.9^LXM!$H$1)","v":13481.301809600538},3,44,42,null,null,null,null,null,{"$f":"BES!D26","v":" "},{"$f":"BES!A26","v":"MagnetO"},{"$f":"BES!C26","v":111707}]
["lipoussou",{"$f":"SQRT((BES!$L$1-BES!E24)^2+(BES!$N$1-BES!F24)^2)","v":35.383612025908263},{"$f":"24*3600*(1-EXP(-B22/350))*7.375*(0.9^LXM!$H$1)","v":4398.5023361436188},1,13,19,null,null,null,null,null,{"$f":"BES!D27","v":" "},{"$f":"BES!A27","v":"marchombre"},{"$f":"BES!C27","v":1650134494}]
["Lockheed",{"$f":"SQRT((BES!$L$1-BES!E25)^2+(BES!$N$1-BES!F25)^2)","v":12.369316876852981},{"$f":"24*3600*(1-EXP(-B23/350))*7.375*(0.9^LXM!$H$1)","v":1588.4172503106686},0,26,29,null,null,null,null,null,{"$f":"BES!D28","v":" "},{"$f":"BES!A28","v":"Melissa"},{"$f":"BES!C28","v":4325226}]
["MagnetO",{"$f":"SQRT((BES!$L$1-BES!E26)^2+(BES!$N$1-BES!F26)^2)","v":10.04987562112089},{"$f":"24*3600*(1-EXP(-B24/350))*7.375*(0.9^LXM!$H$1)","v":1294.8245182928829},0,21,35,null,null,null,null,null,{"$f":"BES!D29","v":" "},{"$f":"BES!A29","v":"MilesGloriosus"},{"$f":"BES!C29","v":1229557}]
["marchombre",{"$f":"SQRT((BES!$L$1-BES!E27)^2+(BES!$N$1-BES!F27)^2)","v":67},{"$f":"24*3600*(1-EXP(-B25/350))*7.375*(0.9^LXM!$H$1)","v":7969.6634956424441},2,12,50,null,null,null,null,null,{"$f":"BES!D30","v":" "},{"$f":"BES!A30","v":"miloveam"},{"$f":"BES!C30","v":10733921}]
["Melissa",{"$f":"SQRT((BES!$L$1-BES!E28)^2+(BES!$N$1-BES!F28)^2)","v":144.00694427700353},{"$f":"24*3600*(1-EXP(-B26/350))*7.375*(0.9^LXM!$H$1)","v":15430.077139065881},4,17,11,null,null,null,null,null,{"$f":"BES!D31","v":" "},{"$f":"BES!A31","v":"Mime"},{"$f":"BES!C31","v":1741606}]
["MilesGloriosus",{"$f":"SQRT((BES!$L$1-BES!E29)^2+(BES!$N$1-BES!F29)^2)","v":79.762146410437069},{"$f":"24*3600*(1-EXP(-B27/350))*7.375*(0.9^LXM!$H$1)","v":9322.2466324774723},2,35,23,null,null,null,null,null,{"$f":"BES!D33","v":" "},{"$f":"BES!A33","v":"Morphy"},{"$f":"BES!C33","v":1927950}]
["miloveam",{"$f":"SQRT((BES!$L$1-BES!E30)^2+(BES!$N$1-BES!F30)^2)","v":133.37541002748594},{"$f":"24*3600*(1-EXP(-B28/350))*7.375*(0.9^LXM!$H$1)","v":14495.12507085244},4,1,36,null,null,null,null,null,{"$f":"BES!D34","v":" "},{"$f":"BES!A34","v":"Myvin"},{"$f":"BES!C34","v":1983940382}]
["Mime",{"$f":"SQRT((BES!$L$1-BES!E31)^2+(BES!$N$1-BES!F31)^2)","v":45.044422518220834},{"$f":"24*3600*(1-EXP(-B29/350))*7.375*(0.9^LXM!$H$1)","v":5524.1399372237211},1,32,5,null,null,null,null,null,{"$f":"BES!D35","v":" "},{"$f":"BES!A35","v":"osman"},{"$f":"BES!C35","v":953794}]
["Mimic",{"$f":"SQRT((BES!$L$1-BES!E32)^2+(BES!$N$1-BES!F32)^2)","v":28},{"$f":"24*3600*(1-EXP(-B30/350))*7.375*(0.9^LXM!$H$1)","v":3517.0012001273067},0,58,38,null,null,null,null,null,{"$f":"BES!D36","v":" "},{"$f":"BES!A36","v":"pacpac001"},{"$f":"BES!C36","v":2291704}]
["Morphy",{"$f":"SQRT((BES!$L$1-BES!E33)^2+(BES!$N$1-BES!F33)^2)","v":168.07736313971611},{"$f":"24*3600*(1-EXP(-B31/350))*7.375*(0.9^LXM!$H$1)","v":17444.803777142453},4,50,45,null,null,null,null,null,{"$f":"BES!D37","v":" "},{"$f":"BES!A37","v":"Panda"},{"$f":"BES!C37","v":74522661}]
["Myvin",{"$f":"SQRT((BES!$L$1-BES!E34)^2+(BES!$N$1-BES!F34)^2)","v":136.61991070118586},{"$f":"24*3600*(1-EXP(-B32/350))*7.375*(0.9^LXM!$H$1)","v":14783.46792944727},4,6,24,null,null,null,null,null,{"$f":"BES!D38","v":" "},{"$f":"BES!A38","v":"pANTSu"},{"$f":"BES!C38","v":1909810001}]
["osman",{"$f":"SQRT((BES!$L$1-BES!E35)^2+(BES!$N$1-BES!F35)^2)","v":145.03103116229988},{"$f":"24*3600*(1-EXP(-B33/350))*7.375*(0.9^LXM!$H$1)","v":15518.646248626706},4,18,39,null,null,null,null,null,{"$f":"BES!D40","v":" "},{"$f":"BES!A40","v":"Pinou"},{"$f":"BES!C40","v":7212325}]
["pacpac001",{"$f":"SQRT((BES!$L$1-BES!E36)^2+(BES!$N$1-BES!F36)^2)","v":122.40914998479485},{"$f":"24*3600*(1-EXP(-B34/350))*7.375*(0.9^LXM!$H$1)","v":13500.515279180036},3,45,1,null,null,null,null,null,{"$f":"BES!D41","v":" "},{"$f":"BES!A41","v":"pluginbaby"},{"$f":"BES!C41","v":12705822}]
["Panda",{"$f":"SQRT((BES!$L$1-BES!E37)^2+(BES!$N$1-BES!F37)^2)","v":138.52075656738234},{"$f":"24*3600*(1-EXP(-B35/350))*7.375*(0.9^LXM!$H$1)","v":14951.160928954323},4,9,12,null,null,null,null,null,{"$f":"BES!D42","v":" "},{"$f":"BES!A42","v":"Quivala"},{"$f":"BES!C42","v":9761369}]
["pANTSu",{"$f":"SQRT((BES!$L$1-BES!E38)^2+(BES!$N$1-BES!F38)^2)","v":119.70797801316336},{"$f":"24*3600*(1-EXP(-B36/350))*7.375*(0.9^LXM!$H$1)","v":13250.705580228319},3,40,51,null,null,null,null,null,{"$f":"BES!D43","v":" "},{"$f":"BES!A43","v":"Reex"},{"$f":"BES!C43","v":1332809}]
["Phenixx",{"$f":"SQRT((BES!$L$1-BES!E39)^2+(BES!$N$1-BES!F39)^2)","v":12.041594578792296},{"$f":"24*3600*(1-EXP(-B37/350))*7.375*(0.9^LXM!$H$1)","v":1547.0524024151778},0,25,48,null,null,null,null,null,{"$f":"BES!D44","v":" "},{"$f":"BES!A44","v":"riblibli"},{"$f":"BES!C44","v":194929}]
["Pinou",{"$f":"SQRT((BES!$L$1-BES!E40)^2+(BES!$N$1-BES!F40)^2)","v":154.37940277122465},{"$f":"24*3600*(1-EXP(-B38/350))*7.375*(0.9^LXM!$H$1)","v":16315.280377835486},4,31,56,null,null,null,null,null,{"$f":"BES!D46","v":" "},{"$f":"BES!A46","v":"Rockslide"},{"$f":"BES!C46","v":192556364}]
["pluginbaby",{"$f":"SQRT((BES!$L$1-BES!E41)^2+(BES!$N$1-BES!F41)^2)","v":151.19854496654392},{"$f":"24*3600*(1-EXP(-B39/350))*7.375*(0.9^LXM!$H$1)","v":16046.604097116979},4,27,27,null,null,null,null,null,{"$f":"BES!D47","v":" "},{"$f":"BES!A47","v":"Rofulus"},{"$f":"BES!C47","v":599979}]
["Quivala",{"$f":"SQRT((BES!$L$1-BES!E42)^2+(BES!$N$1-BES!F42)^2)","v":41.036569057366385},{"$f":"24*3600*(1-EXP(-B40/350))*7.375*(0.9^LXM!$H$1)","v":5060.9296055552013},1,24,21,null,null,null,null,null,{"$f":"BES!D48","v":" "},{"$f":"BES!A48","v":"ryuk44"},{"$f":"BES!C48","v":53860510}]
["Reex",{"$f":"SQRT((BES!$L$1-BES!E43)^2+(BES!$N$1-BES!F43)^2)","v":28.284271247461902},{"$f":"24*3600*(1-EXP(-B41/350))*7.375*(0.9^LXM!$H$1)","v":3551.2845680670671},0,59,12,null,null,null,null,null,{"$f":"BES!D49","v":" "},{"$f":"BES!A49","v":"Seiduna"},{"$f":"BES!C49","v":184276}]
["riblibli",{"$f":"SQRT((BES!$L$1-BES!E44)^2+(BES!$N$1-BES!F44)^2)","v":149.77650015940418},{"$f":"24*3600*(1-EXP(-B42/350))*7.375*(0.9^LXM!$H$1)","v":15925.696693948372},4,25,26,null,null,null,null,null,{"$f":"BES!D50","v":" "},{"$f":"BES!A50","v":"sentih"},{"$f":"BES!C50","v":12854744}]
["Rita",{"$f":"SQRT((BES!$L$1-BES!E45)^2+(BES!$N$1-BES!F45)^2)","v":145.9931505242626},{"$f":"24*3600*(1-EXP(-B43/350))*7.375*(0.9^LXM!$H$1)","v":15601.620267720977},4,20,2,null,null,null,null,null,{"$f":"BES!D51","v":" "},{"$f":"BES!A51","v":"Shikamaru"},{"$f":"BES!C51","v":8133785}]
["Rockslide",{"$f":"SQRT((BES!$L$1-BES!E46)^2+(BES!$N$1-BES!F46)^2)","v":0},{"$f":"24*3600*(1-EXP(-B44/350))*7.375*(0.9^LXM!$H$1)","v":0},0,0,0,null,null,null,null,null,{"$f":"BES!D52","v":" "},{"$f":"BES!A52","v":"spetsnaz"},{"$f":"BES!C52","v":3500000000}]
["Rofulus",{"$f":"SQRT((BES!$L$1-BES!E47)^2+(BES!$N$1-BES!F47)^2)","v":66.068146636635717},{"$f":"24*3600*(1-EXP(-B45/350))*7.375*(0.9^LXM!$H$1)","v":7868.9564320688733},2,11,9,null,null,null,null,null,{"$f":"BES!D53","v":" "},{"$f":"BES!A53","v":"svanhilde"},{"$f":"BES!C53","v":2500000000}]
["ryuk44",{"$f":"SQRT((BES!$L$1-BES!E48)^2+(BES!$N$1-BES!F48)^2)","v":112.0714058089752},{"$f":"24*3600*(1-EXP(-B46/350))*7.375*(0.9^LXM!$H$1)","v":12533.940546450163},3,28,54,null,null,null,null,null,{"$f":"BES!D55","v":" "},{"$f":"BES!A55","v":"TheDentist"},{"$f":"BES!C55","v":14367717}]
["Seiduna",{"$f":"SQRT((BES!$L$1-BES!E49)^2+(BES!$N$1-BES!F49)^2)","v":110.16351483136329},{"$f":"24*3600*(1-EXP(-B47/350))*7.375*(0.9^LXM!$H$1)","v":12352.411800161473},3,25,53,null,null,null,null,null,{"$f":"BES!D56","v":" "},{"$f":"BES!A56","v":"Thunderbird"},{"$f":"BES!C56","v":2202808830}]
["sentih",{"$f":"SQRT((BES!$L$1-BES!E50)^2+(BES!$N$1-BES!F50)^2)","v":118.4229707446997},{"$f":"24*3600*(1-EXP(-B48/350))*7.375*(0.9^LXM!$H$1)","v":13131.187139186726},3,38,52,null,null,null,null,null,{"$f":"BES!D57","v":" "},{"$f":"BES!A57","v":"Tradjette"},{"$f":"BES!C57","v":34256999}]
["Shikamaru",{"$f":"SQRT((BES!$L$1-BES!E51)^2+(BES!$N$1-BES!F51)^2)","v":19.416487838947599},{"$f":"24*3600*(1-EXP(-B49/350))*7.375*(0.9^LXM!$H$1)","v":2468.5983355153899},0,41,9,null,null,null,null,null,{"$f":"BES!D58","v":" "},{"$f":"BES!A58","v":"vinkou"},{"$f":"BES!C58","v":2046872542}]
["spetsnaz",{"$f":"SQRT((BES!$L$1-BES!E52)^2+(BES!$N$1-BES!F52)^2)","v":53.665631459994955},{"$f":"24*3600*(1-EXP(-B50/350))*7.375*(0.9^LXM!$H$1)","v":6502.7458805560582},1,48,23,null,null,null,null,null,{"$f":"BES!D59","v":" "},{"$f":"BES!A59","v":"weaver"},{"$f":"BES!C59","v":12457093}]
["svanhilde",{"$f":"SQRT((BES!$L$1-BES!E53)^2+(BES!$N$1-BES!F53)^2)","v":50.695167422546305},{"$f":"24*3600*(1-EXP(-B51/350))*7.375*(0.9^LXM!$H$1)","v":6168.2825867754982},1,42,49,null,null,null,null,null,{"$f":"BES!D60","v":" "},{"$f":"BES!A60","v":"Wolverine"},{"$f":"BES!C60","v":2500000000}]
["Taouret",{"$f":"SQRT((BES!$L$1-BES!E54)^2+(BES!$N$1-BES!F54)^2)","v":66.219332524573218},{"$f":"24*3600*(1-EXP(-B52/350))*7.375*(0.9^LXM!$H$1)","v":7885.3135892957371},2,11,26,null,null,null,null,null,{"$f":"BES!D13","v":"A PORTEE"},{"$f":"BES!A13","v":"CroolisVar"},{"$f":"BES!C13","v":786759706}]
["TheDentist",{"$f":"SQRT((BES!$L$1-BES!E55)^2+(BES!$N$1-BES!F55)^2)","v":120.03749414245534},{"$f":"24*3600*(1-EXP(-B53/350))*7.375*(0.9^LXM!$H$1)","v":13281.283229953357},3,41,22,null,null,null,null,null,{"$f":"BES!D21","v":"A PORTEE"},{"$f":"BES!A21","v":"hador"},{"$f":"BES!C21","v":1289178436}]
["Thunderbird",{"$f":"SQRT((BES!$L$1-BES!E56)^2+(BES!$N$1-BES!F56)^2)","v":11.045361017187261},{"$f":"24*3600*(1-EXP(-B54/350))*7.375*(0.9^LXM!$H$1)","v":1421.0705038757371},0,23,42,null,null,null,null,null,{"$f":"BES!D22","v":"A PORTEE"},{"$f":"BES!A22","v":"Ishigo"},{"$f":"BES!C22","v":757282747}]
["Tradjette",{"$f":"SQRT((BES!$L$1-BES!E57)^2+(BES!$N$1-BES!F57)^2)","v":160.25292509030842},{"$f":"24*3600*(1-EXP(-B55/350))*7.375*(0.9^LXM!$H$1)","v":16805.025109373371},4,40,6,null,null,null,null,null,{"$f":"BES!D32","v":"A PORTEE"},{"$f":"BES!A32","v":"Mimic"},{"$f":"BES!C32","v":510734725}]
["vinkou",{"$f":"SQRT((BES!$L$1-BES!E58)^2+(BES!$N$1-BES!F58)^2)","v":72.090221250874237},{"$f":"24*3600*(1-EXP(-B56/350))*7.375*(0.9^LXM!$H$1)","v":8515.0652054780639},2,21,56,null,null,null,null,null,{"$f":"BES!D39","v":"A PORTEE"},{"$f":"BES!A39","v":"Phenixx"},{"$f":"BES!C39","v":908308062}]
["weaver",{"$f":"SQRT((BES!$L$1-BES!E59)^2+(BES!$N$1-BES!F59)^2)","v":160},{"$f":"24*3600*(1-EXP(-B57/350))*7.375*(0.9^LXM!$H$1)","v":16784.104668058881},4,39,45,null,null,null,null,null,{"$f":"BES!D45","v":"A PORTEE"},{"$f":"BES!A45","v":"Rita"},{"$f":"BES!C45","v":616559697}]
["Wolverine",{"$f":"SQRT((BES!$L$1-BES!E60)^2+(BES!$N$1-BES!F60)^2)","v":139.35924798878617},{"$f":"24*3600*(1-EXP(-B58/350))*7.375*(0.9^LXM!$H$1)","v":15024.843824233298},4,10,25,null,null,null,null,null,{"$f":"BES!D54","v":"A PORTEE"},{"$f":"BES!A54","v":"Taouret"},{"$f":"BES!C54","v":688628575}]
[]
[]
[]
[]
[]
[]
[]
[]
[{"$f":"'CC Page BES'!D4","v":"agecanonix"},{"$f":"'CC Page BES'!E4","v":3461184525}]
[{"$f":"'CC Page BES'!D26","v":"aubertignac"},{"$f":"'CC Page BES'!E26","v":87905571}]
[{"$f":"'CC Page BES'!D2","v":"Azkanith"},{"$f":"'CC Page BES'!E2","v":3500000000}]
[{"$f":"'CC Page BES'!D9","v":"Bactroban"},{"$f":"'CC Page BES'!E9","v":2154874164}]
[{"$f":"'CC Page BES'!D24","v":"ben57"},{"$f":"'CC Page BES'!E24","v":149380852}]
[{"$f":"'CC Page BES'!D47","v":"bib595"},{"$f":"'CC Page BES'!E47","v":2905019}]
[{"$f":"'CC Page BES'!D28","v":"bill"},{"$f":"'CC Page BES'!E28","v":54154338}]
[{"$f":"'CC Page BES'!D5","v":"Bruxelles"},{"$f":"'CC Page BES'!E5","v":3200000000}]
[{"$f":"'CC Page BES'!D40","v":"Chryom"},{"$f":"'CC Page BES'!E40","v":9996200}]
[{"$f":"'CC Page BES'!D18","v":"CroolisVar"},{"$f":"'CC Page BES'!E18","v":786759706}]
[{"$f":"'CC Page BES'!D32","v":"Damping"},{"$f":"'CC Page BES'!E32","v":16221345}]
[{"$f":"'CC Page BES'!D46","v":"DrAnts"},{"$f":"'CC Page BES'!E46","v":3848814}]
[{"$f":"'CC Page BES'!D13","v":"Drusilla"},{"$f":"'CC Page BES'!E13","v":1855225863}]
[{"$f":"'CC Page BES'!D49","v":"EllaVonZedanltha"},{"$f":"'CC Page BES'!E49","v":1952804}]
[{"$f":"'CC Page BES'!D25","v":"Flipper1"},{"$f":"'CC Page BES'!E25","v":92127906}]
[{"$f":"'CC Page BES'!D31","v":"Greeny"},{"$f":"'CC Page BES'!E31","v":26570199}]
[{"$f":"'CC Page BES'!D15","v":"Gueust"},{"$f":"'CC Page BES'!E15","v":1480632393}]
[{"$f":"'CC Page BES'!D16","v":"hador"},{"$f":"'CC Page BES'!E16","v":1289178436}]
[{"$f":"'CC Page BES'!D19","v":"Ishigo"},{"$f":"'CC Page BES'!E19","v":757282747}]
[{"$f":"'CC Page BES'!D44","v":"Lesqual"},{"$f":"'CC Page BES'!E44","v":4423829}]
[{"$f":"'CC Page BES'!D37","v":"lipoussou"},{"$f":"'CC Page BES'!E37","v":11917308}]
[{"$f":"'CC Page BES'!D38","v":"Lockheed"},{"$f":"'CC Page BES'!E38","v":11216156}]
[{"$f":"'CC Page BES'!D58","v":"MagnetO"},{"$f":"'CC Page BES'!E58","v":111707}]
[{"$f":"'CC Page BES'!D14","v":"marchombre"},{"$f":"'CC Page BES'!E14","v":1650134494}]
[{"$f":"'CC Page BES'!D45","v":"Melissa"},{"$f":"'CC Page BES'!E45","v":4325226}]
[{"$f":"'CC Page BES'!D53","v":"MilesGloriosus"},{"$f":"'CC Page BES'!E53","v":1229557}]
[{"$f":"'CC Page BES'!D39","v":"miloveam"},{"$f":"'CC Page BES'!E39","v":10733921}]
[{"$f":"'CC Page BES'!D51","v":"Mime"},{"$f":"'CC Page BES'!E51","v":1741606}]
[{"$f":"'CC Page BES'!D22","v":"Mimic"},{"$f":"'CC Page BES'!E22","v":510734725}]
[{"$f":"'CC Page BES'!D50","v":"Morphy"},{"$f":"'CC Page BES'!E50","v":1927950}]
[{"$f":"'CC Page BES'!D11","v":"Myvin"},{"$f":"'CC Page BES'!E11","v":1983940382}]
[{"$f":"'CC Page BES'!D54","v":"osman"},{"$f":"'CC Page BES'!E54","v":953794}]
[{"$f":"'CC Page BES'!D48","v":"pacpac001"},{"$f":"'CC Page BES'!E48","v":2291704}]
[{"$f":"'CC Page BES'!D27","v":"Panda"},{"$f":"'CC Page BES'!E27","v":74522661}]
[{"$f":"'CC Page BES'!D12","v":"pANTSu"},{"$f":"'CC Page BES'!E12","v":1909810001}]
[{"$f":"'CC Page BES'!D17","v":"Phenixx"},{"$f":"'CC Page BES'!E17","v":908308062}]
[{"$f":"'CC Page BES'!D43","v":"Pinou"},{"$f":"'CC Page BES'!E43","v":7212325}]
[{"$f":"'CC Page BES'!D35","v":"pluginbaby"},{"$f":"'CC Page BES'!E35","v":12705822}]
[{"$f":"'CC Page BES'!D41","v":"Quivala"},{"$f":"'CC Page BES'!E41","v":9761369}]
[{"$f":"'CC Page BES'!D52","v":"Reex"},{"$f":"'CC Page BES'!E52","v":1332809}]
[{"$f":"'CC Page BES'!D56","v":"riblibli"},{"$f":"'CC Page BES'!E56","v":194929}]
[{"$f":"'CC Page BES'!D21","v":"Rita"},{"$f":"'CC Page BES'!E21","v":616559697}]
[{"$f":"'CC Page BES'!D23","v":"Rockslide"},{"$f":"'CC Page BES'!E23","v":192556364}]
[{"$f":"'CC Page BES'!D55","v":"Rofulus"},{"$f":"'CC Page BES'!E55","v":599979}]
[{"$f":"'CC Page BES'!D29","v":"ryuk44"},{"$f":"'CC Page BES'!E29","v":53860510}]
[{"$f":"'CC Page BES'!D57","v":"Seiduna"},{"$f":"'CC Page BES'!E57","v":184276}]
[{"$f":"'CC Page BES'!D34","v":"sentih"},{"$f":"'CC Page BES'!E34","v":12854744}]
[{"$f":"'CC Page BES'!D42","v":"Shikamaru"},{"$f":"'CC Page BES'!E42","v":8133785}]
[{"$f":"'CC Page BES'!D3","v":"spetsnaz"},{"$f":"'CC Page BES'!E3","v":3500000000}]
[{"$f":"'CC Page BES'!D6","v":"svanhilde"},{"$f":"'CC Page BES'!E6","v":2500000000}]
[{"$f":"'CC Page BES'!D20","v":"Taouret"},{"$f":"'CC Page BES'!E20","v":688628575}]
[{"$f":"'CC Page BES'!D33","v":"TheDentist"},{"$f":"'CC Page BES'!E33","v":14367717}]
[{"$f":"'CC Page BES'!D8","v":"Thunderbird"},{"$f":"'CC Page BES'!E8","v":2202808830}]
[{"$f":"'CC Page BES'!D30","v":"Tradjette"},{"$f":"'CC Page BES'!E30","v":34256999}]
[{"$f":"'CC Page BES'!D10","v":"vinkou"},{"$f":"'CC Page BES'!E10","v":2046872542}]
[{"$f":"'CC Page BES'!D36","v":"weaver"},{"$f":"'CC Page BES'!E36","v":12457093}]
[{"$f":"'CC Page BES'!D7","v":"Wolverine"},{"$f":"'CC Page BES'!E7","v":2500000000}]

{"sheet":"DATA LXM","index":10,"n_rows":64,"n_cols":14,"rows_kept":64,"cut":false,"hidden":false,"merged":[]}
[null,"Distance","Temps (s)","heures","minutes","secondes"]
["_Angel_",{"$f":"SQRT((LXM!$L$1-LXM!E4)^2+(LXM!$N$1-LXM!F4)^2)","v":24},{"$f":"24*3600*(1-EXP(-'DATA LXM'!B2/350))*7.375*(0.9^LXM!$H$1)","v":3031.6334263160279},{"$f":"ROUNDDOWN(C2/(60*60),0)","v":0},{"$f":"ROUNDDOWN(((C2-D2*60*60)/60),0)","v":50},{"$f":"ROUNDUP((C2-D2*60*60-E2*60),0)","v":32}]
["_diablo_",{"$f":"SQRT((LXM!$L$1-LXM!E5)^2+(LXM!$N$1-LXM!F5)^2)","v":11},{"$f":"24*3600*(1-EXP(-'DATA LXM'!B3/350))*7.375*(0.9^LXM!$H$1)","v":1415.3256915471411},0,23,36,null,null,null,null,null,{"$f":"LXM!D11","v":" "},{"$f":"LXM!A11","v":"creamy"},{"$f":"LXM!C11","v":4979692}]
["_Wolverine_",{"$f":"SQRT((LXM!$L$1-LXM!E6)^2+(LXM!$N$1-LXM!F6)^2)","v":20},{"$f":"24*3600*(1-EXP(-'DATA LXM'!B4/350))*7.375*(0.9^LXM!$H$1)","v":2540.6867736472241},0,42,21,null,null,null,null,null,{"$f":"LXM!D17","v":" "},{"$f":"LXM!A17","v":"Formidabilis"},{"$f":"LXM!C17","v":215020}]
["4midiable",{"$f":"SQRT((LXM!$L$1-LXM!E7)^2+(LXM!$N$1-LXM!F7)^2)","v":26.832815729997478},{"$f":"24*3600*(1-EXP(-'DATA LXM'!B5/350))*7.375*(0.9^LXM!$H$1)","v":3375.9454896650723},0,56,16,null,null,null,null,null,{"$f":"LXM!D22","v":" "},{"$f":"LXM!A22","v":"maxbo"},{"$f":"LXM!C22","v":474073}]
["AB64",{"$f":"SQRT((LXM!$L$1-LXM!E8)^2+(LXM!$N$1-LXM!F8)^2)","v":159.11316727411344},{"$f":"24*3600*(1-EXP(-'DATA LXM'!B6/350))*7.375*(0.9^LXM!$H$1)","v":16710.631650794156},4,38,31,null,null,null,null,null,{"$f":"LXM!D25","v":" "},{"$f":"LXM!A25","v":"Norrin-Radd"},{"$f":"LXM!C25","v":32853830}]
["Allerdyce",{"$f":"SQRT((LXM!$L$1-LXM!E9)^2+(LXM!$N$1-LXM!F9)^2)","v":7.0710678118654755},{"$f":"24*3600*(1-EXP(-'DATA LXM'!B7/350))*7.375*(0.9^LXM!$H$1)","v":914.90459776542934},0,15,15,null,null,null,null,null,{"$f":"LXM!D27","v":" "},{"$f":"LXM!A27","v":"sergioo"},{"$f":"LXM!C27","v":29711962}]
["bubulle",{"$f":"SQRT((LXM!$L$1-LXM!E10)^2+(LXM!$N$1-LXM!F10)^2)","v":53.366656256505337},{"$f":"24*3600*(1-EXP(-'DATA LXM'!B8/350))*7.375*(0.9^LXM!$H$1)","v":6469.2107040518058},1,47,50,null,null,null,null,null,{"$f":"LXM!D28","v":" "},{"$f":"LXM!A28","v":"shub"},{"$f":"LXM!C28","v":728876}]
["creamy",{"$f":"SQRT((LXM!$L$1-LXM!E11)^2+(LXM!$N$1-LXM!F11)^2)","v":23.194827009486403},{"$f":"24*3600*(1-EXP(-'DATA LXM'!B9/350))*7.375*(0.9^LXM!$H$1)","v":2933.2597038233503},{"$f":"ROUNDDOWN(C9/(60*60),0)","v":0},{"$f":"ROUNDDOWN(((C9-D9*60*60)/60),0)","v":48},{"$f":"ROUNDUP((C9-D9*60*60-E9*60),0)","v":54},null,null,null,null,null,{"$f":"LXM!D29","v":" "},{"$f":"LXM!A29","v":"Slipstream"},{"$f":"LXM!C29","v":104115}]
["crunchy",{"$f":"SQRT((LXM!$L$1-LXM!E12)^2+(LXM!$N$1-LXM!F12)^2)","v":137.18600511714013},{"$f":"24*3600*(1-EXP(-'DATA LXM'!B10/350))*7.375*(0.9^LXM!$H$1)","v":14833.504152777195},4,7,14,null,null,null,null,null,{"$f":"LXM!D30","v":" "},{"$f":"LXM!A30","v":"waylander"},{"$f":"LXM!C30","v":145222702}]
["Cyclope",{"$f":"SQRT((LXM!$L$1-LXM!E13)^2+(LXM!$N$1-LXM!F13)^2)","v":5.0990195135927845},{"$f":"24*3600*(1-EXP(-'DATA LXM'!B11/350))*7.375*(0.9^LXM!$H$1)","v":661.60295492463911},0,11,2,null,null,null,null,null,{"$f":"LXM!D31","v":" "},{"$f":"LXM!A31","v":"weed"},{"$f":"LXM!C31","v":1827888}]
["Domino",{"$f":"SQRT((LXM!$L$1-LXM!E14)^2+(LXM!$N$1-LXM!F14)^2)","v":6},{"$f":"24*3600*(1-EXP(-'DATA LXM'!B12/350))*7.375*(0.9^LXM!$H$1)","v":777.5073494002329},0,12,58,null,null,null,null,null,{"$f":"LXM!D32","v":" "},{"$f":"LXM!A32","v":"Zerek"},{"$f":"LXM!C32","v":305693}]
["Eltornado",{"$f":"SQRT((LXM!$L$1-LXM!E15)^2+(LXM!$N$1-LXM!F15)^2)","v":155.72411502397438},{"$f":"24*3600*(1-EXP(-'DATA LXM'!B13/350))*7.375*(0.9^LXM!$H$1)","v":16428.131387750978},4,33,49,null,null,null,null,null,{"$f":"LXM!D10","v":" "},{"$f":"LXM!A10","v":"bubulle"},{"$f":"LXM!C10","v":3255300}]
["Fleau",{"$f":"SQRT((LXM!$L$1-LXM!E16)^2+(LXM!$N$1-LXM!F16)^2)","v":3},{"$f":"24*3600*(1-EXP(-'DATA LXM'!B14/350))*7.375*(0.9^LXM!$H$1)","v":390.41975167694312},0,6,31,null,null,null,null,null,{"$f":"LXM!D15","v":" "},{"$f":"LXM!A15","v":"Eltornado"},{"$f":"LXM!C15","v":119767}]
["Formidabilis",{"$f":"SQRT((LXM!$L$1-LXM!E17)^2+(LXM!$N$1-LXM!F17)^2)","v":3.1622776601683795},{"$f":"24*3600*(1-EXP(-'DATA LXM'!B15/350))*7.375*(0.9^LXM!$H$1)","v":411.44329892391573},0,6,52,null,null,null,null,null,{"$f":"LXM!D13","v":" "},{"$f":"LXM!A13","v":"Cyclope"},{"$f":"LXM!C13","v":111173}]
["Jericho",{"$f":"SQRT((LXM!$L$1-LXM!E18)^2+(LXM!$N$1-LXM!F18)^2)","v":36.124783736376884},{"$f":"24*3600*(1-EXP(-'DATA LXM'!B16/350))*7.375*(0.9^LXM!$H$1)","v":4485.9652790787786},1,14,46,null,null,null,null,null,{"$f":"LXM!D14","v":" "},{"$f":"LXM!A14","v":"Domino"},{"$f":"LXM!C14","v":892741}]
["kandide",{"$f":"SQRT((LXM!$L$1-LXM!E19)^2+(LXM!$N$1-LXM!F19)^2)","v":118.06777714516353},{"$f":"24*3600*(1-EXP(-'DATA LXM'!B17/350))*7.375*(0.9^LXM!$H$1)","v":13098.073123046672},3,38,19,null,null,null,null,null,{"$f":"LXM!D18","v":" "},{"$f":"LXM!A18","v":"Jericho"},{"$f":"LXM!C18","v":1839285687}]
["laika",{"$f":"SQRT((LXM!$L$1-LXM!E20)^2+(LXM!$N$1-LXM!F20)^2)","v":27.856776554368238},{"$f":"24*3600*(1-EXP(-'DATA LXM'!B18/350))*7.375*(0.9^LXM!$H$1)","v":3499.7177723298837},0,58,20,null,null,null,null,null,{"$f":"LXM!D19","v":" "},{"$f":"LXM!A19","v":"kandide"},{"$f":"LXM!C19","v":74951}]
["Matteo37",{"$f":"SQRT((LXM!$L$1-LXM!E21)^2+(LXM!$N$1-LXM!F21)^2)","v":29.274562336608895},{"$f":"24*3600*(1-EXP(-'DATA LXM'!B19/350))*7.375*(0.9^LXM!$H$1)","v":3670.4973392754405},1,1,11,null,null,null,null,null,{"$f":"LXM!D23","v":" "},{"$f":"LXM!A23","v":"moontribe"},{"$f":"LXM!C23","v":577004}]
["maxbo",{"$f":"SQRT((LXM!$L$1-LXM!E22)^2+(LXM!$N$1-LXM!F22)^2)","v":6.324555320336759},{"$f":"24*3600*(1-EXP(-'DATA LXM'!B20/350))*7.375*(0.9^LXM!$H$1)","v":819.18591826697138},0,13,40,null,null,null,null,null,{"$f":"LXM!D24","v":" "},{"$f":"LXM!A24","v":"mouche"},{"$f":"LXM!C24","v":140617522}]
["moontribe",{"$f":"SQRT((LXM!$L$1-LXM!E23)^2+(LXM!$N$1-LXM!F23)^2)","v":35.805027579936315},{"$f":"24*3600*(1-EXP(-'DATA LXM'!B21/350))*7.375*(0.9^LXM!$H$1)","v":4448.2547482503469},1,14,9,null,null,null,null,null,{"$f":"LXM!D26","v":" "},{"$f":"LXM!A26","v":"Prend-Ta-Claque"},{"$f":"LXM!C26","v":2568004}]
["mouche",{"$f":"SQRT((LXM!$L$1-LXM!E24)^2+(LXM!$N$1-LXM!F24)^2)","v":72.560319734686942},{"$f":"24*3600*(1-EXP(-'DATA LXM'!B22/350))*7.375*(0.9^LXM!$H$1)","v":8565.0358733175617},2,22,46,null,null,null,null,null,{"$f":"LXM!D20","v":" "},{"$f":"LXM!A20","v":"laika"},{"$f":"LXM!C20","v":352856}]
["Norrin-Radd",{"$f":"SQRT((LXM!$L$1-LXM!E25)^2+(LXM!$N$1-LXM!F25)^2)","v":17.11724276862369},{"$f":"24*3600*(1-EXP(-'DATA LXM'!B23/350))*7.375*(0.9^LXM!$H$1)","v":2183.3716065385906},0,36,24,null,null,null,null,null,{"$f":"LXM!D4","v":" "},{"$f":"LXM!A4","v":"_Angel_"},{"$f":"LXM!C4","v":45216292}]
["Prend-Ta-Claque",{"$f":"SQRT((LXM!$L$1-LXM!E26)^2+(LXM!$N$1-LXM!F26)^2)","v":153.00326793895613},{"$f":"24*3600*(1-EXP(-'DATA LXM'!B24/350))*7.375*(0.9^LXM!$H$1)","v":16199.342550348454},4,29,60,null,null,null,null,null,{"$f":"LXM!D7","v":" "},{"$f":"LXM!A7","v":"4midiable"},{"$f":"LXM!C7","v":1940203}]
["sergioo",{"$f":"SQRT((LXM!$L$1-LXM!E27)^2+(LXM!$N$1-LXM!F27)^2)","v":153.88307249337075},{"$f":"24*3600*(1-EXP(-'DATA LXM'!B25/350))*7.375*(0.9^LXM!$H$1)","v":16273.517651004198},4,31,14,null,null,null,null,null,{"$f":"LXM!D6","v":" "},{"$f":"LXM!A6","v":"_Wolverine_"},{"$f":"LXM!C6","v":573345}]
["shub",{"$f":"SQRT((LXM!$L$1-LXM!E28)^2+(LXM!$N$1-LXM!F28)^2)","v":140.42791745233566},{"$f":"24*3600*(1-EXP(-'DATA LXM'!B26/350))*7.375*(0.9^LXM!$H$1)","v":15118.498244871309},4,11,59,null,null,null,null,null,{"$f":"LXM!D5","v":" "},{"$f":"LXM!A5","v":"_diablo_"},{"$f":"LXM!C5","v":134710356}]
["Slipstream",{"$f":"SQRT((LXM!$L$1-LXM!E29)^2+(LXM!$N$1-LXM!F29)^2)","v":13},{"$f":"24*3600*(1-EXP(-'DATA LXM'!B27/350))*7.375*(0.9^LXM!$H$1)","v":1667.9126647934779},0,27,48,null,null,null,null,null,{"$f":"LXM!D9","v":"A PORTEE"},{"$f":"LXM!A9","v":"Allerdyce"},{"$f":"LXM!C9","v":511366515}]
["waylander",{"$f":"SQRT((LXM!$L$1-LXM!E30)^2+(LXM!$N$1-LXM!F30)^2)","v":143},{"$f":"24*3600*(1-EXP(-'DATA LXM'!B28/350))*7.375*(0.9^LXM!$H$1)","v":15342.73757890285},4,15,43,null,null,null,null,null,{"$f":"LXM!D16","v":"A PORTEE"},{"$f":"LXM!A16","v":"Fleau"},{"$f":"LXM!C16","v":1034979412}]
["weed",{"$f":"SQRT((LXM!$L$1-LXM!E31)^2+(LXM!$N$1-LXM!F31)^2)","v":45.891175622335062},{"$f":"24*3600*(1-EXP(-'DATA LXM'!B29/350))*7.375*(0.9^LXM!$H$1)","v":5621.327129516043},1,33,42,null,null,null,null,null,{"$f":"LXM!D21","v":"A PORTEE"},{"$f":"LXM!A21","v":"Matteo37"},{"$f":"LXM!C21","v":1045506653}]
["Zerek",{"$f":"SQRT((LXM!$L$1-LXM!E32)^2+(LXM!$N$1-LXM!F32)^2)","v":114.21471008587291},{"$f":"24*3600*(1-EXP(-'DATA LXM'!B30/350))*7.375*(0.9^LXM!$H$1)","v":12736.691254774014},3,32,17,null,null,null,null,null,{"$f":"LXM!D12","v":"A PORTEE"},{"$f":"LXM!A12","v":"crunchy"},{"$f":"LXM!C12","v":637917142}]
[null,null,null,null,null,null,null,null,null,null,null,{"$f":"LXM!D8","v":"A PORTEE"},{"$f":"LXM!A8","v":"AB64"},{"$f":"LXM!C8","v":399362427}]
[null,null,null,null,null,null,"CALCUL DE TEMPS"]
[]
[]
[{"$f":"'CC Page LXM'!D11","v":"_Angel_"},{"$f":"'CC Page LXM'!E11","v":45216292},"x","y","tdc","va",null,null,"Pour Flood"]
[{"$f":"'CC Page LXM'!D10","v":"_diablo_"},{"$f":"'CC Page LXM'!E10","v":134710356},{"$f":"LXM!E4","v":40},{"$f":"LXM!F4","v":173},{"$f":"LXM!C4","v":45216292},{"$f":"LXM!K4","v":24}]
[{"$f":"'CC Page LXM'!D22","v":"_Wolverine_"},{"$f":"'CC Page LXM'!E22","v":573345},{"$f":"LXM!E5","v":5},{"$f":"LXM!F5","v":173},{"$f":"LXM!C5","v":134710356},{"$f":"LXM!K5","v":1}]
[{"$f":"'CC Page LXM'!D17","v":"4midiable"},{"$f":"'CC Page LXM'!E17","v":1940203},{"$f":"LXM!E6","v":36},{"$f":"LXM!F6","v":173},{"$f":"LXM!C6","v":573345},{"$f":"LXM!K6","v":1}]
[{"$f":"'CC Page LXM'!D7","v":"AB64"},{"$f":"'CC Page LXM'!E7","v":399362427},{"$f":"LXM!E7","v":40},{"$f":"LXM!F7","v":161},{"$f":"LXM!C7","v":1940203},{"$f":"LXM!K7","v":1}]
[{"$f":"'CC Page LXM'!D6","v":"Allerdyce"},{"$f":"'CC Page LXM'!E6","v":511366515},{"$f":"LXM!E8","v":22},{"$f":"LXM!F8","v":14},{"$f":"LXM!C8","v":399362427},{"$f":"LXM!K8","v":1}]
[{"$f":"'CC Page LXM'!D15","v":"bubulle"},{"$f":"'CC Page LXM'!E15","v":3255300},{"$f":"LXM!E9","v":9},{"$f":"LXM!F9","v":172},{"$f":"LXM!C9","v":511366515},{"$f":"LXM!K9","v":24}]
[{"$f":"'CC Page LXM'!D31","v":"Charles_Francois_Xavier"},{"$f":"'CC Page LXM'!E31","v":405},{"$f":"LXM!E10","v":4},{"$f":"LXM!F10","v":225},{"$f":"LXM!C10","v":3255300},{"$f":"LXM!K10","v":1}]
[{"$f":"'CC Page LXM'!D14","v":"creamy"},{"$f":"'CC Page LXM'!E14","v":4979692},{"$f":"LXM!E11","v":39},{"$f":"LXM!F11","v":176},{"$f":"LXM!C11","v":4979692},{"$f":"LXM!K11","v":1}]
[{"$f":"'CC Page LXM'!D5","v":"crunchy"},{"$f":"'CC Page LXM'!E5","v":637917142},{"$f":"LXM!E12","v":34},{"$f":"LXM!F12","v":37},{"$f":"LXM!C12","v":637917142},{"$f":"LXM!K12","v":1}]
[{"$f":"'CC Page LXM'!D28","v":"Cyclope"},{"$f":"'CC Page LXM'!E28","v":111173},{"$f":"LXM!E13","v":11},{"$f":"LXM!F13","v":172},{"$f":"LXM!C13","v":111173},{"$f":"LXM!K13","v":1}]
[{"$f":"'CC Page LXM'!D19","v":"Domino"},{"$f":"'CC Page LXM'!E19","v":892741},{"$f":"LXM!E14","v":10},{"$f":"LXM!F14","v":173},{"$f":"LXM!C14","v":892741},{"$f":"LXM!K14","v":1}]
[{"$f":"'CC Page LXM'!D27","v":"ElTornado"},{"$f":"'CC Page LXM'!E27","v":119767},{"$f":"LXM!E15","v":45},{"$f":"LXM!F15","v":20},{"$f":"LXM!C15","v":119767},{"$f":"LXM!K15","v":1}]
[{"$f":"'CC Page LXM'!D4","v":"Fleau"},{"$f":"'CC Page LXM'!E4","v":1034979412},{"$f":"LXM!E16","v":13},{"$f":"LXM!F16","v":173},{"$f":"LXM!C16","v":1034979412},{"$f":"LXM!K16","v":1}]
[{"$f":"'CC Page LXM'!D26","v":"Formidabilis"},{"$f":"'CC Page LXM'!E26","v":215020},{"$f":"LXM!E17","v":17},{"$f":"LXM!F17","v":176},{"$f":"LXM!C17","v":215020},{"$f":"LXM!K17","v":1}]
[{"$f":"'CC Page LXM'!D2","v":"Jericho"},{"$f":"'CC Page LXM'!E2","v":1839285687},{"$f":"LXM!E18","v":13},{"$f":"LXM!F18","v":209},{"$f":"LXM!C18","v":1839285687},{"$f":"LXM!K18","v":1}]
[{"$f":"'CC Page LXM'!D30","v":"kandide"},{"$f":"'CC Page LXM'!E30","v":74951},{"$f":"LXM!E19","v":12},{"$f":"LXM!F19","v":55},{"$f":"LXM!C19","v":74951},{"$f":"LXM!K19","v":1}]
[{"$f":"'CC Page LXM'!D24","v":"laika"},{"$f":"'CC Page LXM'!E24","v":352856},{"$f":"LXM!E20","v":42},{"$f":"LXM!F20","v":183},{"$f":"LXM!C20","v":352856},{"$f":"LXM!K20","v":1}]
[{"$f":"'CC Page LXM'!D3","v":"Matteo37"},{"$f":"'CC Page LXM'!E3","v":1045506653},{"$f":"LXM!E21","v":45},{"$f":"LXM!F21","v":169},{"$f":"LXM!C21","v":1045506653},{"$f":"LXM!K21","v":1}]
[{"$f":"'CC Page LXM'!D23","v":"maxbo"},{"$f":"'CC Page LXM'!E23","v":474073},{"$f":"LXM!E22","v":18},{"$f":"LXM!F22","v":179},{"$f":"LXM!C22","v":474073},{"$f":"LXM!K22","v":1}]
[{"$f":"'CC Page LXM'!D21","v":"moontribe"},{"$f":"'CC Page LXM'!E21","v":577004},{"$f":"LXM!E23","v":37},{"$f":"LXM!F23","v":144},{"$f":"LXM!C23","v":577004},{"$f":"LXM!K23","v":1}]
[{"$f":"'CC Page LXM'!D9","v":"mouche"},{"$f":"'CC Page LXM'!E9","v":140617522},{"$f":"LXM!E24","v":7},{"$f":"LXM!F24","v":245},{"$f":"LXM!C24","v":140617522},{"$f":"LXM!K24","v":1}]
[{"$f":"'CC Page LXM'!D12","v":"Norrin-Radd"},{"$f":"'CC Page LXM'!E12","v":32853830},{"$f":"LXM!E25","v":33},{"$f":"LXM!F25","v":171},{"$f":"LXM!C25","v":32853830},{"$f":"LXM!K25","v":1}]
[{"$f":"'CC Page LXM'!D16","v":"Prend-Ta-Claque"},{"$f":"'CC Page LXM'!E16","v":2568004},{"$f":"LXM!E26","v":15},{"$f":"LXM!F26","v":20},{"$f":"LXM!C26","v":2568004},{"$f":"LXM!K26","v":1}]
[{"$f":"'CC Page LXM'!D13","v":"sergioo"},{"$f":"'CC Page LXM'!E13","v":29711962},{"$f":"LXM!E27","v":40},{"$f":"LXM!F27","v":21},{"$f":"LXM!C27","v":29711962},{"$f":"LXM!K27","v":1}]
[{"$f":"'CC Page LXM'!D20","v":"shub"},{"$f":"'CC Page LXM'!E20","v":728876},{"$f":"LXM!E28","v":42},{"$f":"LXM!F28","v":35},{"$f":"LXM!C28","v":728876},{"$f":"LXM!K28","v":1}]
[{"$f":"'CC Page LXM'!D29","v":"Slipstream"},{"$f":"'CC Page LXM'!E29","v":104115},{"$f":"LXM!E29","v":3},{"$f":"LXM!F29","v":173},{"$f":"LXM!C29","v":104115},{"$f":"LXM!K29","v":1}]
[{"$f":"'CC Page LXM'!D8","v":"waylander"},{"$f":"'CC Page LXM'!E8","v":145222702},{"$f":"LXM!E30","v":16},{"$f":"LXM!F30","v":30},{"$f":"LXM!C30","v":145222702},{"$f":"LXM!K30","v":1}]
[{"$f":"'CC Page LXM'!D18","v":"weed"},{"$f":"'CC Page LXM'!E18","v":1827888},{"$f":"LXM!E31","v":7},{"$f":"LXM!F31","v":128},{"$f":"LXM!C31","v":1827888},{"$f":"LXM!K31","v":1}]
[{"$f":"'CC Page LXM'!D25","v":"Zerek"},{"$f":"'CC Page LXM'!E25","v":305693},{"$f":"LXM!E32","v":9},{"$f":"LXM!F32","v":59},{"$f":"LXM!C32","v":305693},{"$f":"LXM!K32","v":1}]

{"sheet":"DATA COMMON","index":11,"n_rows":87,"n_cols":6,"rows_kept":87,"cut":false,"hidden":false,"merged":[]}
[null,"Distance","Temps (s)","heures","minutes","secondes"]
[{"$f":"'DATA LXM'!A2","v":"_Angel_"},{"$f":"'DATA LXM'!B2","v":24},{"$f":"'DATA LXM'!C2","v":3031.6334263160279},{"$f":"'DATA LXM'!D2","v":0},{"$f":"'DATA LXM'!E2","v":50},{"$f":"'DATA LXM'!F2","v":32}]
[{"$f":"'DATA LXM'!A3","v":"_diablo_"},{"$f":"'DATA LXM'!B3","v":11},{"$f":"'DATA LXM'!C3","v":1415.3256915471411},{"$f":"'DATA LXM'!D3","v":0},{"$f":"'DATA LXM'!E3","v":23},{"$f":"'DATA LXM'!F3","v":36}]
[{"$f":"'DATA LXM'!A4","v":"_Wolverine_"},{"$f":"'DATA LXM'!B4","v":20},{"$f":"'DATA LXM'!C4","v":2540.6867736472241},{"$f":"'DATA LXM'!D4","v":0},{"$f":"'DATA LXM'!E4","v":42},{"$f":"'DATA LXM'!F4","v":21}]
[{"$f":"'DATA LXM'!A5","v":"4midiable"},{"$f":"'DATA LXM'!B5","v":26.832815729997478},{"$f":"'DATA LXM'!C5","v":3375.9454896650723},{"$f":"'DATA LXM'!D5","v":0},{"$f":"'DATA LXM'!E5","v":56},{"$f":"'DATA LXM'!F5","v":16}]
[{"$f":"'DATA LXM'!A6","v":"AB64"},{"$f":"'DATA LXM'!B6","v":159.11316727411344},{"$f":"'DATA LXM'!C6","v":16710.631650794156},{"$f":"'DATA LXM'!D6","v":4},{"$f":"'DATA LXM'!E6","v":38},{"$f":"'DATA LXM'!F6","v":31}]
[{"$f":"'DATA BES'!A2","v":"agecanonix"},{"$f":"'DATA BES'!B2","v":98.081598681913832},{"$f":"'DATA BES'!C2","v":11179.600174950123},{"$f":"'DATA BES'!D2","v":3},{"$f":"'DATA BES'!E2","v":6},{"$f":"'DATA BES'!F2","v":20}]
[{"$f":"'DATA LXM'!A7","v":"Allerdyce"},{"$f":"'DATA LXM'!B7","v":7.0710678118654755},{"$f":"'DATA LXM'!C7","v":914.90459776542934},{"$f":"'DATA LXM'!D7","v":0},{"$f":"'DATA LXM'!E7","v":15},{"$f":"'DATA LXM'!F7","v":15}]
[{"$f":"'DATA BES'!A3","v":"aubertignac"},{"$f":"'DATA BES'!B3","v":121.41251994749142},{"$f":"'DATA BES'!C3","v":13408.569336591723},{"$f":"'DATA BES'!D3","v":3},{"$f":"'DATA BES'!E3","v":43},{"$f":"'DATA BES'!F3","v":29}]
[{"$f":"'DATA BES'!A4","v":"Azkanith"},{"$f":"'DATA BES'!B4","v":112.64102272262978},{"$f":"'DATA BES'!C4","v":12587.945941018934},{"$f":"'DATA BES'!D4","v":3},{"$f":"'DATA BES'!E4","v":29},{"$f":"'DATA BES'!F4","v":48}]
[{"$f":"'DATA BES'!A5","v":"Bactroban"},{"$f":"'DATA BES'!B5","v":58.137767414994535},{"$f":"'DATA BES'!C5","v":7000.9683032987787},{"$f":"'DATA BES'!D5","v":1},{"$f":"'DATA BES'!E5","v":56},{"$f":"'DATA BES'!F5","v":41}]
[{"$f":"'DATA BES'!A6","v":"ben57"},{"$f":"'DATA BES'!B6","v":167.76471619503309},{"$f":"'DATA BES'!C6","v":17419.513051631115},{"$f":"'DATA BES'!D6","v":4},{"$f":"'DATA BES'!E6","v":50},{"$f":"'DATA BES'!F6","v":20}]
[{"$f":"'DATA BES'!A7","v":"bib595"},{"$f":"'DATA BES'!B7","v":64.124878167525594},{"$f":"'DATA BES'!C7","v":7658.0793543996369},{"$f":"'DATA BES'!D7","v":2},{"$f":"'DATA BES'!E7","v":7},{"$f":"'DATA BES'!F7","v":39}]
[{"$f":"'DATA BES'!A8","v":"bill"},{"$f":"'DATA BES'!B8","v":61.073725938409879},{"$f":"'DATA BES'!C8","v":7324.6069461038587},{"$f":"'DATA BES'!D8","v":2},{"$f":"'DATA BES'!E8","v":2},{"$f":"'DATA BES'!F8","v":5}]
[{"$f":"'DATA BES'!A9","v":"Bruxelles"},{"$f":"'DATA BES'!B9","v":119.64113005150027},{"$f":"'DATA BES'!C9","v":13244.498869710833},{"$f":"'DATA BES'!D9","v":3},{"$f":"'DATA BES'!E9","v":40},{"$f":"'DATA BES'!F9","v":45}]
[{"$f":"'DATA LXM'!A8","v":"bubulle"},{"$f":"'DATA LXM'!B8","v":53.366656256505337},{"$f":"'DATA LXM'!C8","v":6469.2107040518058},{"$f":"'DATA LXM'!D8","v":1},{"$f":"'DATA LXM'!E8","v":47},{"$f":"'DATA LXM'!F8","v":50}]
[{"$f":"'DATA BES'!A10","v":"Chryom"},{"$f":"'DATA BES'!B10","v":115.21284650593439},{"$f":"'DATA BES'!C10","v":12830.6893180979},{"$f":"'DATA BES'!D10","v":3},{"$f":"'DATA BES'!E10","v":33},{"$f":"'DATA BES'!F10","v":51}]
[{"$f":"'DATA LXM'!A9","v":"creamy"},{"$f":"'DATA LXM'!B9","v":23.194827009486403},{"$f":"'DATA LXM'!C9","v":2933.2597038233503},{"$f":"'DATA LXM'!D9","v":0},{"$f":"'DATA LXM'!E9","v":48},{"$f":"'DATA LXM'!F9","v":54}]
[{"$f":"'DATA BES'!A11","v":"CroolisVar"},{"$f":"'DATA BES'!B11","v":41.868842830916641},{"$f":"'DATA BES'!C11","v":5157.5570598178347},{"$f":"'DATA BES'!D11","v":1},{"$f":"'DATA BES'!E11","v":25},{"$f":"'DATA BES'!F11","v":58}]
[{"$f":"'DATA LXM'!A10","v":"crunchy"},{"$f":"'DATA LXM'!B10","v":137.18600511714013},{"$f":"'DATA LXM'!C10","v":14833.504152777195},{"$f":"'DATA LXM'!D10","v":4},{"$f":"'DATA LXM'!E10","v":7},{"$f":"'DATA LXM'!F10","v":14}]
[{"$f":"'DATA LXM'!A11","v":"Cyclope"},{"$f":"'DATA LXM'!B11","v":5.0990195135927845},{"$f":"'DATA LXM'!C11","v":661.60295492463911},{"$f":"'DATA LXM'!D11","v":0},{"$f":"'DATA LXM'!E11","v":11},{"$f":"'DATA LXM'!F11","v":2}]
[{"$f":"'DATA BES'!A12","v":"Damping"},{"$f":"'DATA BES'!B12","v":97.867257037274726},{"$f":"'DATA BES'!C12","v":11158.426009593994},{"$f":"'DATA BES'!D12","v":3},{"$f":"'DATA BES'!E12","v":5},{"$f":"'DATA BES'!F12","v":59}]
[{"$f":"'DATA LXM'!A12","v":"Domino"},{"$f":"'DATA LXM'!B12","v":6},{"$f":"'DATA LXM'!C12","v":777.5073494002329},{"$f":"'DATA LXM'!D12","v":0},{"$f":"'DATA LXM'!E12","v":12},{"$f":"'DATA LXM'!F12","v":58}]
[{"$f":"'DATA BES'!A13","v":"DrAnts"},{"$f":"'DATA BES'!B13","v":103.07764064044152},{"$f":"'DATA BES'!C13","v":11669.488251486338},{"$f":"'DATA BES'!D13","v":3},{"$f":"'DATA BES'!E13","v":14},{"$f":"'DATA BES'!F13","v":30}]
[{"$f":"'DATA BES'!A14","v":"Drusilla"},{"$f":"'DATA BES'!B14","v":150.74813431681335},{"$f":"'DATA BES'!C14","v":16008.361694210183},{"$f":"'DATA BES'!D14","v":4},{"$f":"'DATA BES'!E14","v":26},{"$f":"'DATA BES'!F14","v":49}]
[{"$f":"'DATA BES'!A15","v":"EllaVonZedanltha"},{"$f":"'DATA BES'!B15","v":114.73883387938018},{"$f":"'DATA BES'!C15","v":12786.08328292626},{"$f":"'DATA BES'!D15","v":3},{"$f":"'DATA BES'!E15","v":33},{"$f":"'DATA BES'!F15","v":7}]
[{"$f":"'DATA LXM'!A13","v":"Eltornado"},{"$f":"'DATA LXM'!B13","v":155.72411502397438},{"$f":"'DATA LXM'!C13","v":16428.131387750978},{"$f":"'DATA LXM'!D13","v":4},{"$f":"'DATA LXM'!E13","v":33},{"$f":"'DATA LXM'!F13","v":49}]
[{"$f":"'DATA LXM'!A14","v":"Fleau"},{"$f":"'DATA LXM'!B14","v":3},{"$f":"'DATA LXM'!C14","v":390.41975167694312},{"$f":"'DATA LXM'!D14","v":0},{"$f":"'DATA LXM'!E14","v":6},{"$f":"'DATA LXM'!F14","v":31}]
[{"$f":"'DATA BES'!A16","v":"Flipper1"},{"$f":"'DATA BES'!B16","v":104.17293314484334},{"$f":"'DATA BES'!C16","v":11775.956033787372},{"$f":"'DATA BES'!D16","v":3},{"$f":"'DATA BES'!E16","v":16},{"$f":"'DATA BES'!F16","v":16}]
[{"$f":"'DATA LXM'!A15","v":"Formidabilis"},{"$f":"'DATA LXM'!B15","v":3.1622776601683795},{"$f":"'DATA LXM'!C15","v":411.44329892391573},{"$f":"'DATA LXM'!D15","v":0},{"$f":"'DATA LXM'!E15","v":6},{"$f":"'DATA LXM'!F15","v":52}]
[{"$f":"'DATA BES'!A17","v":"Greeny"},{"$f":"'DATA BES'!B17","v":123.1990259701756},{"$f":"'DATA BES'!C17","v":13573.20099427716},{"$f":"'DATA BES'!D17","v":3},{"$f":"'DATA BES'!E17","v":46},{"$f":"'DATA BES'!F17","v":14}]
[{"$f":"'DATA BES'!A18","v":"Gueust"},{"$f":"'DATA BES'!B18","v":212.39821091525229},{"$f":"'DATA BES'!C18","v":20810.800833584588},{"$f":"'DATA BES'!D18","v":5},{"$f":"'DATA BES'!E18","v":46},{"$f":"'DATA BES'!F18","v":51}]
[{"$f":"'DATA BES'!A19","v":"hador"},{"$f":"'DATA BES'!B19","v":17.029386365926403},{"$f":"'DATA BES'!C19","v":2172.435604015885},{"$f":"'DATA BES'!D19","v":0},{"$f":"'DATA BES'!E19","v":36},{"$f":"'DATA BES'!F19","v":13}]
[{"$f":"'DATA BES'!A20","v":"Ishigo"},{"$f":"'DATA BES'!B20","v":70.34912934784623},{"$f":"'DATA BES'!C20","v":8329.4043777067491},{"$f":"'DATA BES'!D20","v":2},{"$f":"'DATA BES'!E20","v":18},{"$f":"'DATA BES'!F20","v":50}]
[{"$f":"'DATA LXM'!A16","v":"Jericho"},{"$f":"'DATA LXM'!B16","v":36.124783736376884},{"$f":"'DATA LXM'!C16","v":4485.9652790787786},{"$f":"'DATA LXM'!D16","v":1},{"$f":"'DATA LXM'!E16","v":14},{"$f":"'DATA LXM'!F16","v":46}]
[{"$f":"'DATA LXM'!A17","v":"kandide"},{"$f":"'DATA LXM'!B17","v":118.06777714516353},{"$f":"'DATA LXM'!C17","v":13098.073123046672},{"$f":"'DATA LXM'!D17","v":3},{"$f":"'DATA LXM'!E17","v":38},{"$f":"'DATA LXM'!F17","v":19}]
[{"$f":"'DATA LXM'!A18","v":"laika"},{"$f":"'DATA LXM'!B18","v":27.856776554368238},{"$f":"'DATA LXM'!C18","v":3499.7177723298837},{"$f":"'DATA LXM'!D18","v":0},{"$f":"'DATA LXM'!E18","v":58},{"$f":"'DATA LXM'!F18","v":20}]
[{"$f":"'DATA BES'!A21","v":"Lesqual"},{"$f":"'DATA BES'!B21","v":122.20065466273084},{"$f":"'DATA BES'!C21","v":13481.301809600538},{"$f":"'DATA BES'!D21","v":3},{"$f":"'DATA BES'!E21","v":44},{"$f":"'DATA BES'!F21","v":42}]
[{"$f":"'DATA BES'!A22","v":"lipoussou"},{"$f":"'DATA BES'!B22","v":35.383612025908263},{"$f":"'DATA BES'!C22","v":4398.5023361436188},{"$f":"'DATA BES'!D22","v":1},{"$f":"'DATA BES'!E22","v":13},{"$f":"'DATA BES'!F22","v":19}]
[{"$f":"'DATA BES'!A23","v":"Lockheed"},{"$f":"'DATA BES'!B23","v":12.369316876852981},{"$f":"'DATA BES'!C23","v":1588.4172503106686},{"$f":"'DATA BES'!D23","v":0},{"$f":"'DATA BES'!E23","v":26},{"$f":"'DATA BES'!F23","v":29}]
[{"$f":"'DATA BES'!A24","v":"MagnetO"},{"$f":"'DATA BES'!B24","v":10.04987562112089},{"$f":"'DATA BES'!C24","v":1294.8245182928829},{"$f":"'DATA BES'!D24","v":0},{"$f":"'DATA BES'!E24","v":21},{"$f":"'DATA BES'!F24","v":35}]
[{"$f":"'DATA BES'!A25","v":"marchombre"},{"$f":"'DATA BES'!B25","v":67},{"$f":"'DATA BES'!C25","v":7969.6634956424441},{"$f":"'DATA BES'!D25","v":2},{"$f":"'DATA BES'!E25","v":12},{"$f":"'DATA BES'!F25","v":50}]
[{"$f":"'DATA LXM'!A19","v":"Matteo37"},{"$f":"'DATA LXM'!B19","v":29.274562336608895},{"$f":"'DATA LXM'!C19","v":3670.4973392754405},{"$f":"'DATA LXM'!D19","v":1},{"$f":"'DATA LXM'!E19","v":1},{"$f":"'DATA LXM'!F19","v":11}]
[{"$f":"'DATA LXM'!A20","v":"maxbo"},{"$f":"'DATA LXM'!B20","v":6.324555320336759},{"$f":"'DATA LXM'!C20","v":819.18591826697138},{"$f":"'DATA LXM'!D20","v":0},{"$f":"'DATA LXM'!E20","v":13},{"$f":"'DATA LXM'!F20","v":40}]
[{"$f":"'DATA BES'!A26","v":"Melissa"},{"$f":"'DATA BES'!B26","v":144.00694427700353},{"$f":"'DATA BES'!C26","v":15430.077139065881},{"$f":"'DATA BES'!D26","v":4},{"$f":"'DATA BES'!E26","v":17},{"$f":"'DATA BES'!F26","v":11}]
[{"$f":"'DATA BES'!A27","v":"MilesGloriosus"},{"$f":"'DATA BES'!B27","v":79.762146410437069},{"$f":"'DATA BES'!C27","v":9322.2466324774723},{"$f":"'DATA BES'!D27","v":2},{"$f":"'DATA BES'!E27","v":35},{"$f":"'DATA BES'!F27","v":23}]
[{"$f":"'DATA BES'!A28","v":"miloveam"},{"$f":"'DATA BES'!B28","v":133.37541002748594},{"$f":"'DATA BES'!C28","v":14495.12507085244},{"$f":"'DATA BES'!D28","v":4},{"$f":"'DATA BES'!E28","v":1},{"$f":"'DATA BES'!F28","v":36}]
[{"$f":"'DATA BES'!A29","v":"Mime"},{"$f":"'DATA BES'!B29","v":45.044422518220834},{"$f":"'DATA BES'!C29","v":5524.1399372237211},{"$f":"'DATA BES'!D29","v":1},{"$f":"'DATA BES'!E29","v":32},{"$f":"'DATA BES'!F29","v":5}]
[{"$f":"'DATA BES'!A30","v":"Mimic"},{"$f":"'DATA BES'!B30","v":28},{"$f":"'DATA BES'!C30","v":3517.0012001273067},{"$f":"'DATA BES'!D30","v":0},{"$f":"'DATA BES'!E30","v":58},{"$f":"'DATA BES'!F30","v":38}]
[{"$f":"'DATA LXM'!A21","v":"moontribe"},{"$f":"'DATA LXM'!B21","v":35.805027579936315},{"$f":"'DATA LXM'!C21","v":4448.2547482503469},{"$f":"'DATA LXM'!D21","v":1},{"$f":"'DATA LXM'!E21","v":14},{"$f":"'DATA LXM'!F21","v":9}]
[{"$f":"'DATA BES'!A31","v":"Morphy"},{"$f":"'DATA BES'!B31","v":168.07736313971611},{"$f":"'DATA BES'!C31","v":17444.803777142453},{"$f":"'DATA BES'!D31","v":4},{"$f":"'DATA BES'!E31","v":50},{"$f":"'DATA BES'!F31","v":45}]
[{"$f":"'DATA LXM'!A22","v":"mouche"},{"$f":"'DATA LXM'!B22","v":72.560319734686942},{"$f":"'DATA LXM'!C22","v":8565.0358733175617},{"$f":"'DATA LXM'!D22","v":2},{"$f":"'DATA LXM'!E22","v":22},{"$f":"'DATA LXM'!F22","v":46}]
[{"$f":"'DATA BES'!A32","v":"Myvin"},{"$f":"'DATA BES'!B32","v":136.61991070118586},{"$f":"'DATA BES'!C32","v":14783.46792944727},{"$f":"'DATA BES'!D32","v":4},{"$f":"'DATA BES'!E32","v":6},{"$f":"'DATA BES'!F32","v":24}]
[{"$f":"'DATA LXM'!A23","v":"Norrin-Radd"},{"$f":"'DATA LXM'!B23","v":17.11724276862369},{"$f":"'DATA LXM'!C23","v":2183.3716065385906},{"$f":"'DATA LXM'!D23","v":0},{"$f":"'DATA LXM'!E23","v":36},{"$f":"'DATA LXM'!F23","v":24}]
[{"$f":"'DATA BES'!A33","v":"osman"},{"$f":"'DATA BES'!B33","v":145.03103116229988},{"$f":"'DATA BES'!C33","v":15518.646248626706},{"$f":"'DATA BES'!D33","v":4},{"$f":"'DATA BES'!E33","v":18},{"$f":"'DATA BES'!F33","v":39}]
[{"$f":"'DATA BES'!A34","v":"pacpac001"},{"$f":"'DATA BES'!B34","v":122.40914998479485},{"$f":"'DATA BES'!C34","v":13500.515279180036},{"$f":"'DATA BES'!D34","v":3},{"$f":"'DATA BES'!E34","v":45},{"$f":"'DATA BES'!F34","v":1}]
[{"$f":"'DATA BES'!A35","v":"Panda"},{"$f":"'DATA BES'!B35","v":138.52075656738234},{"$f":"'DATA BES'!C35","v":14951.160928954323},{"$f":"'DATA BES'!D35","v":4},{"$f":"'DATA BES'!E35","v":9},{"$f":"'DATA BES'!F35","v":12}]
[{"$f":"'DATA BES'!A36","v":"pANTSu"},{"$f":"'DATA BES'!B36","v":119.70797801316336},{"$f":"'DATA BES'!C36","v":13250.705580228319},{"$f":"'DATA BES'!D36","v":3},{"$f":"'DATA BES'!E36","v":40},{"$f":"'DATA BES'!F36","v":51}]
[{"$f":"'DATA BES'!A37","v":"Phenixx"},{"$f":"'DATA BES'!B37","v":12.041594578792296},{"$f":"'DATA BES'!C37","v":1547.0524024151778},{"$f":"'DATA BES'!D37","v":0},{"$f":"'DATA BES'!E37","v":25},{"$f":"'DATA BES'!F37","v":48}]
[{"$f":"'DATA BES'!A38","v":"Pinou"},{"$f":"'DATA BES'!B38","v":154.37940277122465},{"$f":"'DATA BES'!C38","v":16315.280377835486},{"$f":"'DATA BES'!D38","v":4},{"$f":"'DATA BES'!E38","v":31},{"$f":"'DATA BES'!F38","v":56}]
[{"$f":"'DATA BES'!A39","v":"pluginbaby"},{"$f":"'DATA BES'!B39","v":151.19854496654392},{"$f":"'DATA BES'!C39","v":16046.604097116979},{"$f":"'DATA BES'!D39","v":4},{"$f":"'DATA BES'!E39","v":27},{"$f":"'DATA BES'!F39","v":27}]
[{"$f":"'DATA LXM'!A24","v":"Prend-Ta-Claque"},{"$f":"'DATA LXM'!B24","v":153.00326793895613},{"$f":"'DATA LXM'!C24","v":16199.342550348454},{"$f":"'DATA LXM'!D24","v":4},{"$f":"'DATA LXM'!E24","v":29},{"$f":"'DATA LXM'!F24","v":60}]
[{"$f":"'DATA BES'!A40","v":"Quivala"},{"$f":"'DATA BES'!B40","v":41.036569057366385},{"$f":"'DATA BES'!C40","v":5060.9296055552013},{"$f":"'DATA BES'!D40","v":1},{"$f":"'DATA BES'!E40","v":24},{"$f":"'DATA BES'!F40","v":21}]
[{"$f":"'DATA BES'!A41","v":"Reex"},{"$f":"'DATA BES'!B41","v":28.284271247461902},{"$f":"'DATA BES'!C41","v":3551.2845680670671},{"$f":"'DATA BES'!D41","v":0},{"$f":"'DATA BES'!E41","v":59},{"$f":"'DATA BES'!F41","v":12}]
[{"$f":"'DATA BES'!A42","v":"riblibli"},{"$f":"'DATA BES'!B42","v":149.77650015940418},{"$f":"'DATA BES'!C42","v":15925.696693948372},{"$f":"'DATA BES'!D42","v":4},{"$f":"'DATA BES'!E42","v":25},{"$f":"'DATA BES'!F42","v":26}]
[{"$f":"'DATA BES'!A43","v":"Rita"},{"$f":"'DATA BES'!B43","v":145.9931505242626},{"$f":"'DATA BES'!C43","v":15601.620267720977},{"$f":"'DATA BES'!D43","v":4},{"$f":"'DATA BES'!E43","v":20},{"$f":"'DATA BES'!F43","v":2}]
[{"$f":"'DATA BES'!A44","v":"Rockslide"},{"$f":"'DATA BES'!B44","v":0},{"$f":"'DATA BES'!C44","v":0},{"$f":"'DATA BES'!D44","v":0},{"$f":"'DATA BES'!E44","v":0},{"$f":"'DATA BES'!F44","v":0}]
[{"$f":"'DATA BES'!A45","v":"Rofulus"},{"$f":"'DATA BES'!B45","v":66.068146636635717},{"$f":"'DATA BES'!C45","v":7868.9564320688733},{"$f":"'DATA BES'!D45","v":2},{"$f":"'DATA BES'!E45","v":11},{"$f":"'DATA BES'!F45","v":9}]
[{"$f":"'DATA BES'!A46","v":"ryuk44"},{"$f":"'DATA BES'!B46","v":112.0714058089752},{"$f":"'DATA BES'!C46","v":12533.940546450163},{"$f":"'DATA BES'!D46","v":3},{"$f":"'DATA BES'!E46","v":28},{"$f":"'DATA BES'!F46","v":54}]
[{"$f":"'DATA BES'!A47","v":"Seiduna"},{"$f":"'DATA BES'!B47","v":110.16351483136329},{"$f":"'DATA BES'!C47","v":12352.411800161473},{"$f":"'DATA BES'!D47","v":3},{"$f":"'DATA BES'!E47","v":25},{"$f":"'DATA BES'!F47","v":53}]
[{"$f":"'DATA BES'!A48","v":"sentih"},{"$f":"'DATA BES'!B48","v":118.4229707446997},{"$f":"'DATA BES'!C48","v":13131.187139186726},{"$f":"'DATA BES'!D48","v":3},{"$f":"'DATA BES'!E48","v":38},{"$f":"'DATA BES'!F48","v":52}]
[{"$f":"'DATA LXM'!A25","v":"sergioo"},{"$f":"'DATA LXM'!B25","v":153.88307249337075},{"$f":"'DATA LXM'!C25","v":16273.517651004198},{"$f":"'DATA LXM'!D25","v":4},{"$f":"'DATA LXM'!E25","v":31},{"$f":"'DATA LXM'!F25","v":14}]
[{"$f":"'DATA BES'!A49","v":"Shikamaru"},{"$f":"'DATA BES'!B49","v":19.416487838947599},{"$f":"'DATA BES'!C49","v":2468.5983355153899},{"$f":"'DATA BES'!D49","v":0},{"$f":"'DATA BES'!E49","v":41},{"$f":"'DATA BES'!F49","v":9}]
[{"$f":"'DATA LXM'!A26","v":"shub"},{"$f":"'DATA LXM'!B26","v":140.42791745233566},{"$f":"'DATA LXM'!C26","v":15118.498244871309},{"$f":"'DATA LXM'!D26","v":4},{"$f":"'DATA LXM'!E26","v":11},{"$f":"'DATA LXM'!F26","v":59}]
[{"$f":"'DATA LXM'!A27","v":"Slipstream"},{"$f":"'DATA LXM'!B27","v":13},{"$f":"'DATA LXM'!C27","v":1667.9126647934779},{"$f":"'DATA LXM'!D27","v":0},{"$f":"'DATA LXM'!E27","v":27},{"$f":"'DATA LXM'!F27","v":48}]
[{"$f":"'DATA BES'!A50","v":"spetsnaz"},{"$f":"'DATA BES'!B50","v":53.665631459994955},{"$f":"'DATA BES'!C50","v":6502.7458805560582},{"$f":"'DATA BES'!D50","v":1},{"$f":"'DATA BES'!E50","v":48},{"$f":"'DATA BES'!F50","v":23}]
[{"$f":"'DATA BES'!A51","v":"svanhilde"},{"$f":"'DATA BES'!B51","v":50.695167422546305},{"$f":"'DATA BES'!C51","v":6168.2825867754982},{"$f":"'DATA BES'!D51","v":1},{"$f":"'DATA BES'!E51","v":42},{"$f":"'DATA BES'!F51","v":49}]
[{"$f":"'DATA BES'!A52","v":"Taouret"},{"$f":"'DATA BES'!B52","v":66.219332524573218},{"$f":"'DATA BES'!C52","v":7885.3135892957371},{"$f":"'DATA BES'!D52","v":2},{"$f":"'DATA BES'!E52","v":11},{"$f":"'DATA BES'!F52","v":26}]
[{"$f":"'DATA BES'!A53","v":"TheDentist"},{"$f":"'DATA BES'!B53","v":120.03749414245534},{"$f":"'DATA BES'!C53","v":13281.283229953357},{"$f":"'DATA BES'!D53","v":3},{"$f":"'DATA BES'!E53","v":41},{"$f":"'DATA BES'!F53","v":22}]
[{"$f":"'DATA BES'!A54","v":"Thunderbird"},{"$f":"'DATA BES'!B54","v":11.045361017187261},{"$f":"'DATA BES'!C54","v":1421.0705038757371},{"$f":"'DATA BES'!D54","v":0},{"$f":"'DATA BES'!E54","v":23},{"$f":"'DATA BES'!F54","v":42}]
[{"$f":"'DATA BES'!A55","v":"Tradjette"},{"$f":"'DATA BES'!B55","v":160.25292509030842},{"$f":"'DATA BES'!C55","v":16805.025109373371},{"$f":"'DATA BES'!D55","v":4},{"$f":"'DATA BES'!E55","v":40},{"$f":"'DATA BES'!F55","v":6}]
[{"$f":"'DATA BES'!A56","v":"vinkou"},{"$f":"'DATA BES'!B56","v":72.090221250874237},{"$f":"'DATA BES'!C56","v":8515.0652054780639},{"$f":"'DATA BES'!D56","v":2},{"$f":"'DATA BES'!E56","v":21},{"$f":"'DATA BES'!F56","v":56}]
[{"$f":"'DATA LXM'!A28","v":"waylander"},{"$f":"'DATA LXM'!B28","v":143},{"$f":"'DATA LXM'!C28","v":15342.73757890285},{"$f":"'DATA LXM'!D28","v":4},{"$f":"'DATA LXM'!E28","v":15},{"$f":"'DATA LXM'!F28","v":43}]
[{"$f":"'DATA BES'!A57","v":"weaver"},{"$f":"'DATA BES'!B57","v":160},{"$f":"'DATA BES'!C57","v":16784.104668058881},{"$f":"'DATA BES'!D57","v":4},{"$f":"'DATA BES'!E57","v":39},{"$f":"'DATA BES'!F57","v":45}]
[{"$f":"'DATA LXM'!A29","v":"weed"},{"$f":"'DATA LXM'!B29","v":45.891175622335062},{"$f":"'DATA LXM'!C29","v":5621.327129516043},{"$f":"'DATA LXM'!D29","v":1},{"$f":"'DATA LXM'!E29","v":33},{"$f":"'DATA LXM'!F29","v":42}]
[{"$f":"'DATA BES'!A58","v":"Wolverine"},{"$f":"'DATA BES'!B58","v":139.35924798878617},{"$f":"'DATA BES'!C58","v":15024.843824233298},{"$f":"'DATA BES'!D58","v":4},{"$f":"'DATA BES'!E58","v":10},{"$f":"'DATA BES'!F58","v":25}]
[{"$f":"'DATA LXM'!A30","v":"Zerek"},{"$f":"'DATA LXM'!B30","v":114.21471008587291},{"$f":"'DATA LXM'!C30","v":12736.691254774014},{"$f":"'DATA LXM'!D30","v":3},{"$f":"'DATA LXM'!E30","v":32},{"$f":"'DATA LXM'!F30","v":17}]

{"sheet":"DATA TRAQUE","index":12,"n_rows":126,"n_cols":18,"rows_kept":126,"cut":false,"hidden":false,"merged":[]}
[null,null,"TDC","VA","x","y",null,null,null,null,null,null,"Heure",null,null,"TDP Basique"]
[null,{"$f":"'DATA LXM'!A2","v":"_Angel_"},{"$f":"'DATA LXM'!E36","v":45216292},{"$f":"'DATA LXM'!F36","v":24},{"$f":"'DATA LXM'!C36","v":40},{"$f":"'DATA LXM'!D36","v":173},null,null,null,null,null,null,{"$f":"REPLACE(TRAQUE!C3,3,1,\":\")","v":"17:30"},null,null,"JSN",300]
[null,{"$f":"'DATA LXM'!A3","v":"_diablo_"},{"$f":"'DATA LXM'!E37","v":134710356},{"$f":"'DATA LXM'!F37","v":1},{"$f":"'DATA LXM'!C37","v":5},{"$f":"'DATA LXM'!D37","v":173},null,null,null,null,null,null,null,null,null,"SN",450]
[null,{"$f":"'DATA LXM'!A4","v":"_Wolverine_"},{"$f":"'DATA LXM'!E38","v":573345},{"$f":"'DATA LXM'!F38","v":1},{"$f":"'DATA LXM'!C38","v":36},{"$f":"'DATA LXM'!D38","v":173},null,null,null,null,null,null,null,null,null,"NE",570]
[null,{"$f":"'DATA LXM'!A5","v":"4midiable"},{"$f":"'DATA LXM'!E39","v":1940203},{"$f":"'DATA LXM'!F39","v":1},{"$f":"'DATA LXM'!C39","v":40},{"$f":"'DATA LXM'!D39","v":161},null,null,null,null,null,null,"Heure",null,null,"JS",740]
[null,{"$f":"'DATA LXM'!A6","v":"AB64"},{"$f":"'DATA LXM'!E40","v":399362427},{"$f":"'DATA LXM'!F40","v":1},{"$f":"'DATA LXM'!C40","v":22},{"$f":"'DATA LXM'!D40","v":14},null,null,null,null,null,null,{"$f":"REPLACE(TRAQUE!J4,3,1,\":\")","v":"17:40"},null,null,"S",1000]
[null,{"$f":"'DATA LXM'!A7","v":"Allerdyce"},{"$f":"'DATA LXM'!E41","v":511366515},{"$f":"'DATA LXM'!F41","v":24},{"$f":"'DATA LXM'!C41","v":9},{"$f":"'DATA LXM'!D41","v":172},null,null,null,null,null,null,null,null,null,"C",1410]
[null,{"$f":"'DATA LXM'!A8","v":"bubulle"},{"$f":"'DATA LXM'!E42","v":3255300},{"$f":"'DATA LXM'!F42","v":1},{"$f":"'DATA LXM'!C42","v":4},{"$f":"'DATA LXM'!D42","v":225},null,null,null,null,null,null,null,null,null,"CE",1410]
[null,{"$f":"'DATA LXM'!A9","v":"creamy"},{"$f":"'DATA LXM'!E43","v":4979692},{"$f":"'DATA LXM'!F43","v":1},{"$f":"'DATA LXM'!C43","v":39},{"$f":"'DATA LXM'!D43","v":176},null,null,null,null,null,null,null,null,null,"A",1440]
[null,{"$f":"'DATA LXM'!A10","v":"crunchy"},{"$f":"'DATA LXM'!E44","v":637917142},{"$f":"'DATA LXM'!F44","v":1},{"$f":"'DATA LXM'!C44","v":34},{"$f":"'DATA LXM'!D44","v":37},null,null,null,null,null,null,null,null,null,"AE",1520]
[null,{"$f":"'DATA LXM'!A11","v":"Cyclope"},{"$f":"'DATA LXM'!E45","v":111173},{"$f":"'DATA LXM'!F45","v":1},{"$f":"'DATA LXM'!C45","v":11},{"$f":"'DATA LXM'!D45","v":172},null,null,null,null,null,null,null,null,null,"SE",1450]
[null,{"$f":"'DATA LXM'!A12","v":"Domino"},{"$f":"'DATA LXM'!E46","v":892741},{"$f":"'DATA LXM'!F46","v":1},{"$f":"'DATA LXM'!C46","v":10},{"$f":"'DATA LXM'!D46","v":173},null,null,null,null,null,null,null,null,null,"Tk",1860]
[null,{"$f":"'DATA LXM'!A13","v":"Eltornado"},{"$f":"'DATA LXM'!E47","v":119767},{"$f":"'DATA LXM'!F47","v":1},{"$f":"'DATA LXM'!C47","v":45},{"$f":"'DATA LXM'!D47","v":20},null,null,null,null,null,null,null,null,null,"TkE",1860]
[null,{"$f":"'DATA LXM'!A14","v":"Fleau"},{"$f":"'DATA LXM'!E48","v":1034979412},{"$f":"'DATA LXM'!F48","v":1},{"$f":"'DATA LXM'!C48","v":13},{"$f":"'DATA LXM'!D48","v":173},null,null,null,null,null,null,null,null,null,"Tu",2740]
[null,{"$f":"'DATA LXM'!A15","v":"Formidabilis"},{"$f":"'DATA LXM'!E49","v":215020},{"$f":"'DATA LXM'!F49","v":1},{"$f":"'DATA LXM'!C49","v":17},{"$f":"'DATA LXM'!D49","v":176},null,null,null,null,null,null,null,null,null,"TuE",2740]
[null,{"$f":"'DATA LXM'!A16","v":"Jericho"},{"$f":"'DATA LXM'!E50","v":1839285687},{"$f":"'DATA LXM'!F50","v":1},{"$f":"'DATA LXM'!C50","v":13},{"$f":"'DATA LXM'!D50","v":209}]
[null,{"$f":"'DATA LXM'!A17","v":"kandide"},{"$f":"'DATA LXM'!E51","v":74951},{"$f":"'DATA LXM'!F51","v":1},{"$f":"'DATA LXM'!C51","v":12},{"$f":"'DATA LXM'!D51","v":55}]
[null,{"$f":"'DATA LXM'!A18","v":"laika"},{"$f":"'DATA LXM'!E52","v":352856},{"$f":"'DATA LXM'!F52","v":1},{"$f":"'DATA LXM'!C52","v":42},{"$f":"'DATA LXM'!D52","v":183},null,null,null,null,null,null,null,null,"t","h","m","s"]
[null,{"$f":"'DATA LXM'!A19","v":"Matteo37"},{"$f":"'DATA LXM'!E53","v":1045506653},{"$f":"'DATA LXM'!F53","v":1},{"$f":"'DATA LXM'!C53","v":45},{"$f":"'DATA LXM'!D53","v":169},null,null,null,null,null,null,null,"JSN",{"$f":"Q2*0.9^TRAQUE!$K$4*TRAQUE!P3","v":594.30948361140543},{"$f":"ROUNDDOWN(O19/(60*60),0)","v":0},{"$f":"ROUNDDOWN(((O19-P19*60*60)/60),0)","v":9},{"$f":"ROUNDUP((O19-P19*60*60-Q19*60),0)","v":55}]
[null,{"$f":"'DATA LXM'!A20","v":"maxbo"},{"$f":"'DATA LXM'!E54","v":474073},{"$f":"'DATA LXM'!F54","v":1},{"$f":"'DATA LXM'!C54","v":18},{"$f":"'DATA LXM'!D54","v":179},null,null,null,null,null,null,null,"SN",{"$f":"Q3*0.9^TRAQUE!$K$4*TRAQUE!Q3","v":0},{"$f":"ROUNDDOWN(O20/(60*60),0)","v":0},{"$f":"ROUNDDOWN(((O20-P20*60*60)/60),0)","v":0},{"$f":"ROUNDUP((O20-P20*60*60-Q20*60),0)","v":0}]
[null,{"$f":"'DATA LXM'!A21","v":"moontribe"},{"$f":"'DATA LXM'!E55","v":577004},{"$f":"'DATA LXM'!F55","v":1},{"$f":"'DATA LXM'!C55","v":37},{"$f":"'DATA LXM'!D55","v":144},null,null,null,null,null,null,null,"NE",{"$f":"Q4*0.9^TRAQUE!$K$4*TRAQUE!R3","v":0},0,0,0]
[null,{"$f":"'DATA LXM'!A22","v":"mouche"},{"$f":"'DATA LXM'!E56","v":140617522},{"$f":"'DATA LXM'!F56","v":1},{"$f":"'DATA LXM'!C56","v":7},{"$f":"'DATA LXM'!D56","v":245},null,null,null,null,null,null,null,"JS",{"$f":"Q5*0.9^TRAQUE!$K$4*TRAQUE!S3","v":0},0,0,0]
[null,{"$f":"'DATA LXM'!A23","v":"Norrin-Radd"},{"$f":"'DATA LXM'!E57","v":32853830},{"$f":"'DATA LXM'!F57","v":1},{"$f":"'DATA LXM'!C57","v":33},{"$f":"'DATA LXM'!D57","v":171},null,null,null,null,null,null,null,"S",{"$f":"Q6*0.9^TRAQUE!$K$4*TRAQUE!T3","v":0},0,0,0]
[null,{"$f":"'DATA LXM'!A24","v":"Prend-Ta-Claque"},{"$f":"'DATA LXM'!E58","v":2568004},{"$f":"'DATA LXM'!F58","v":1},{"$f":"'DATA LXM'!C58","v":15},{"$f":"'DATA LXM'!D58","v":20},null,null,null,null,null,null,null,"C",{"$f":"Q7*0.9^TRAQUE!$K$4*TRAQUE!U3","v":0},0,0,0]
[null,{"$f":"'DATA LXM'!A25","v":"sergioo"},{"$f":"'DATA LXM'!E59","v":29711962},{"$f":"'DATA LXM'!F59","v":1},{"$f":"'DATA LXM'!C59","v":40},{"$f":"'DATA LXM'!D59","v":21},null,null,null,null,null,null,null,"CE",{"$f":"Q8*0.9^TRAQUE!$K$4*TRAQUE!V3","v":0},0,0,0]
[null,{"$f":"'DATA LXM'!A26","v":"shub"},{"$f":"'DATA LXM'!E60","v":728876},{"$f":"'DATA LXM'!F60","v":1},{"$f":"'DATA LXM'!C60","v":42},{"$f":"'DATA LXM'!D60","v":35},null,null,null,null,null,null,null,"A",{"$f":"Q9*0.9^TRAQUE!$K$4*TRAQUE!W3","v":0},0,0,0]
[null,{"$f":"'DATA LXM'!A27","v":"Slipstream"},{"$f":"'DATA LXM'!E61","v":104115},{"$f":"'DATA LXM'!F61","v":1},{"$f":"'DATA LXM'!C61","v":3},{"$f":"'DATA LXM'!D61","v":173},null,null,null,null,null,null,null,"AE",{"$f":"Q10*0.9^TRAQUE!$K$4*TRAQUE!X3","v":0},0,0,0]
[null,{"$f":"'DATA LXM'!A28","v":"waylander"},{"$f":"'DATA LXM'!E62","v":145222702},{"$f":"'DATA LXM'!F62","v":1},{"$f":"'DATA LXM'!C62","v":16},{"$f":"'DATA LXM'!D62","v":30},null,null,null,null,null,null,null,"SE",{"$f":"Q11*0.9^TRAQUE!$K$4*TRAQUE!Y3","v":0},0,0,0]
[null,{"$f":"'DATA LXM'!A29","v":"weed"},{"$f":"'DATA LXM'!E63","v":1827888},{"$f":"'DATA LXM'!F63","v":1},{"$f":"'DATA LXM'!C63","v":7},{"$f":"'DATA LXM'!D63","v":128},null,null,null,null,null,null,null,"Tk",{"$f":"Q12*0.9^TRAQUE!$K$4*TRAQUE!Z3","v":1096.105461777076},0,18,17]
[null,{"$f":"'DATA LXM'!A30","v":"Zerek"},{"$f":"'DATA LXM'!E64","v":305693},{"$f":"'DATA LXM'!F64","v":1},{"$f":"'DATA LXM'!C64","v":9},{"$f":"'DATA LXM'!D64","v":59},null,null,null,null,null,null,null,"TkE",{"$f":"Q13*0.9^TRAQUE!$K$4*TRAQUE!AA3","v":5.9988258634910032},0,0,6]
[null,null,null,null,null,null,null,null,null,null,null,null,null,"Tu",{"$f":"Q14*0.9^TRAQUE!$K$4*TRAQUE!AB3","v":0},0,0,0]
[null,null,null,null,null,null,null,null,null,null,null,null,null,"TuE",{"$f":"Q15*0.9^TRAQUE!$K$4*TRAQUE!AC3","v":0},0,0,0]
[null,null,null,null,null,null,null,null,null,null,null,null,null,"Somme",null,{"$f":"SUM(P19:P32)","v":0},{"$f":"SUM(Q19:Q32)","v":27},78]
[null,null,null,null,null,null,null,null,null,null,null,null,null,null,"TEMPS",{"$f":"TIME(P33,Q33,R33)","v":"00:28:18"}]
[]
[]
[]
[]
[null,null,null,null,null,null,null,null,null,null,null,"Temps Trajet Perso"]
[null,null,"TDC","x","y","Temps","h","m","s"]
[null,{"$f":"'DATA LXM'!A2","v":"_Angel_"},{"$f":"'DATA LXM'!E36","v":45216292},{"$f":"'DATA LXM'!C36","v":40},{"$f":"'DATA LXM'!D36","v":173},{"$f":"24*3600*(1-EXP(-VLOOKUP(B41,Tableau1[],3)/350))*7.375*(0.9^TRAQUE!$H$3)","v":4310.3698513050322},{"$f":"ROUNDDOWN(F41/(60*60),0)","v":1},{"$f":"ROUNDDOWN(((F41-G41*60*60)/60),0)","v":11},{"$f":"ROUNDUP((F41-G41*60*60-H41*60),0)","v":51},null,null,{"$f":"TIME('DATA LXM'!D2,'DATA LXM'!E2,'DATA LXM'!F2)","v":"00:50:32"}]
[null,{"$f":"'DATA LXM'!A3","v":"_diablo_"},{"$f":"'DATA LXM'!E37","v":134710356},{"$f":"'DATA LXM'!C37","v":5},{"$f":"'DATA LXM'!D37","v":173},{"$f":"24*3600*(1-EXP(-VLOOKUP(B42,Tableau1[],3)/350))*7.375*(0.9^TRAQUE!$H$3)","v":595.24651471453274},0,{"$f":"ROUNDDOWN(((F42-G42*60*60)/60),0)","v":9},{"$f":"ROUNDUP((F42-G42*60*60-H42*60),0)","v":56},null,null,{"$f":"TIME('DATA LXM'!D3,'DATA LXM'!E3,'DATA LXM'!F3)","v":"00:23:36"}]
[null,{"$f":"'DATA LXM'!A4","v":"_Wolverine_"},{"$f":"'DATA LXM'!E38","v":573345},{"$f":"'DATA LXM'!C38","v":36},{"$f":"'DATA LXM'!D38","v":173},{"$f":"24*3600*(1-EXP(-VLOOKUP(B43,Tableau1[],3)/350))*7.375*(0.9^TRAQUE!$H$3)","v":3776.0206888030398},1,2,57,null,null,{"$f":"TIME('DATA LXM'!D4,'DATA LXM'!E4,'DATA LXM'!F4)","v":"00:42:21"}]
[null,{"$f":"'DATA LXM'!A5","v":"4midiable"},{"$f":"'DATA LXM'!E39","v":1940203},{"$f":"'DATA LXM'!C39","v":40},{"$f":"'DATA LXM'!D39","v":161},{"$f":"24*3600*(1-EXP(-VLOOKUP(B44,Tableau1[],3)/350))*7.375*(0.9^TRAQUE!$H$3)","v":4559.2501985776526},1,15,60,null,null,{"$f":"TIME('DATA LXM'!D5,'DATA LXM'!E5,'DATA LXM'!F5)","v":"00:56:16"}]
[null,{"$f":"'DATA LXM'!A6","v":"AB64"},{"$f":"'DATA LXM'!E40","v":399362427},{"$f":"'DATA LXM'!C40","v":22},{"$f":"'DATA LXM'!D40","v":14},{"$f":"24*3600*(1-EXP(-VLOOKUP(B45,Tableau1[],3)/350))*7.375*(0.9^TRAQUE!$H$3)","v":18513.933460276483},5,8,34,null,null,{"$f":"TIME('DATA LXM'!D6,'DATA LXM'!E6,'DATA LXM'!F6)","v":"04:38:31"}]
[null,{"$f":"'DATA LXM'!A7","v":"Allerdyce"},{"$f":"'DATA LXM'!E41","v":511366515},{"$f":"'DATA LXM'!C41","v":9},{"$f":"'DATA LXM'!D41","v":172},{"$f":"24*3600*(1-EXP(-VLOOKUP(B46,Tableau1[],3)/350))*7.375*(0.9^TRAQUE!$H$3)","v":0},0,0,0,null,null,{"$f":"TIME('DATA LXM'!D7,'DATA LXM'!E7,'DATA LXM'!F7)","v":"00:15:15"}]
[null,{"$f":"'DATA LXM'!A8","v":"bubulle"},{"$f":"'DATA LXM'!E42","v":3255300},{"$f":"'DATA LXM'!C42","v":4},{"$f":"'DATA LXM'!D42","v":225},{"$f":"24*3600*(1-EXP(-VLOOKUP(B47,Tableau1[],3)/350))*7.375*(0.9^TRAQUE!$H$3)","v":7171.6342040491782},1,59,32,null,null,{"$f":"TIME('DATA LXM'!D8,'DATA LXM'!E8,'DATA LXM'!F8)","v":"01:47:50"}]
[null,{"$f":"'DATA LXM'!A9","v":"creamy"},{"$f":"'DATA LXM'!E43","v":4979692},{"$f":"'DATA LXM'!C43","v":39},{"$f":"'DATA LXM'!D43","v":176},{"$f":"24*3600*(1-EXP(-VLOOKUP(B48,Tableau1[],3)/350))*7.375*(0.9^TRAQUE!$H$3)","v":4210.4998013747472},1,10,11,null,null,{"$f":"TIME('DATA LXM'!D9,'DATA LXM'!E9,'DATA LXM'!F9)","v":"00:48:54"}]
[null,{"$f":"'DATA LXM'!A10","v":"crunchy"},{"$f":"'DATA LXM'!E44","v":637917142},{"$f":"'DATA LXM'!C44","v":34},{"$f":"'DATA LXM'!D44","v":37},{"$f":"24*3600*(1-EXP(-VLOOKUP(B49,Tableau1[],3)/350))*7.375*(0.9^TRAQUE!$H$3)","v":16492.394928880589},4,34,53,null,null,{"$f":"TIME('DATA LXM'!D10,'DATA LXM'!E10,'DATA LXM'!F10)","v":"04:07:14"}]
[null,{"$f":"'DATA LXM'!A11","v":"Cyclope"},{"$f":"'DATA LXM'!E45","v":111173},{"$f":"'DATA LXM'!C45","v":11},{"$f":"'DATA LXM'!D45","v":172},{"$f":"24*3600*(1-EXP(-VLOOKUP(B50,Tableau1[],3)/350))*7.375*(0.9^TRAQUE!$H$3)","v":289.61276135509502},0,4,50,null,null,{"$f":"TIME('DATA LXM'!D11,'DATA LXM'!E11,'DATA LXM'!F11)","v":"00:11:02"}]
[null,{"$f":"'DATA LXM'!A12","v":"Domino"},{"$f":"'DATA LXM'!E46","v":892741},{"$f":"'DATA LXM'!C46","v":10},{"$f":"'DATA LXM'!D46","v":173},{"$f":"24*3600*(1-EXP(-VLOOKUP(B51,Tableau1[],3)/350))*7.375*(0.9^TRAQUE!$H$3)","v":204.95845339021966},0,3,25,null,null,{"$f":"TIME('DATA LXM'!D12,'DATA LXM'!E12,'DATA LXM'!F12)","v":"00:12:58"}]
[null,{"$f":"'DATA LXM'!A13","v":"Eltornado"},{"$f":"'DATA LXM'!E47","v":119767},{"$f":"'DATA LXM'!C47","v":45},{"$f":"'DATA LXM'!D47","v":20},{"$f":"24*3600*(1-EXP(-VLOOKUP(B52,Tableau1[],3)/350))*7.375*(0.9^TRAQUE!$H$3)","v":18298.202848837009},5,4,59,null,null,{"$f":"TIME('DATA LXM'!D13,'DATA LXM'!E13,'DATA LXM'!F13)","v":"04:33:49"}]
[null,{"$f":"'DATA LXM'!A14","v":"Fleau"},{"$f":"'DATA LXM'!E48","v":1034979412},{"$f":"'DATA LXM'!C48","v":13},{"$f":"'DATA LXM'!D48","v":173},{"$f":"24*3600*(1-EXP(-VLOOKUP(B53,Tableau1[],3)/350))*7.375*(0.9^TRAQUE!$H$3)","v":595.24651471453274},0,9,56,null,null,{"$f":"TIME('DATA LXM'!D14,'DATA LXM'!E14,'DATA LXM'!F14)","v":"00:06:31"}]
[null,{"$f":"'DATA LXM'!A15","v":"Formidabilis"},{"$f":"'DATA LXM'!E49","v":215020},{"$f":"'DATA LXM'!C49","v":17},{"$f":"'DATA LXM'!D49","v":176},{"$f":"24*3600*(1-EXP(-VLOOKUP(B54,Tableau1[],3)/350))*7.375*(0.9^TRAQUE!$H$3)","v":1282.4355514736169},0,21,23,null,null,{"$f":"TIME('DATA LXM'!D15,'DATA LXM'!E15,'DATA LXM'!F15)","v":"00:06:52"}]
[null,{"$f":"'DATA LXM'!A16","v":"Jericho"},{"$f":"'DATA LXM'!E50","v":1839285687},{"$f":"'DATA LXM'!C50","v":13},{"$f":"'DATA LXM'!D50","v":209},{"$f":"24*3600*(1-EXP(-VLOOKUP(B55,Tableau1[],3)/350))*7.375*(0.9^TRAQUE!$H$3)","v":5127.0563072256655},1,25,28,null,null,{"$f":"TIME('DATA LXM'!D16,'DATA LXM'!E16,'DATA LXM'!F16)","v":"01:14:46"}]
[null,{"$f":"'DATA LXM'!A17","v":"kandide"},{"$f":"'DATA LXM'!E51","v":74951},{"$f":"'DATA LXM'!C51","v":12},{"$f":"'DATA LXM'!D51","v":55},{"$f":"24*3600*(1-EXP(-VLOOKUP(B56,Tableau1[],3)/350))*7.375*(0.9^TRAQUE!$H$3)","v":14446.579333921076},4,0,47,null,null,{"$f":"TIME('DATA LXM'!D17,'DATA LXM'!E17,'DATA LXM'!F17)","v":"03:38:19"}]
[null,{"$f":"'DATA LXM'!A18","v":"laika"},{"$f":"'DATA LXM'!E52","v":352856},{"$f":"'DATA LXM'!C52","v":42},{"$f":"'DATA LXM'!D52","v":183},{"$f":"24*3600*(1-EXP(-VLOOKUP(B57,Tableau1[],3)/350))*7.375*(0.9^TRAQUE!$H$3)","v":4808.5926990790167},1,20,9,null,null,{"$f":"TIME('DATA LXM'!D18,'DATA LXM'!E18,'DATA LXM'!F18)","v":"00:58:20"}]
[null,{"$f":"'DATA LXM'!A19","v":"Matteo37"},{"$f":"'DATA LXM'!E53","v":1045506653},{"$f":"'DATA LXM'!C53","v":45},{"$f":"'DATA LXM'!D53","v":169},{"$f":"24*3600*(1-EXP(-VLOOKUP(B58,Tableau1[],3)/350))*7.375*(0.9^TRAQUE!$H$3)","v":4984.4058656430871},1,23,5,null,null,{"$f":"TIME('DATA LXM'!D19,'DATA LXM'!E19,'DATA LXM'!F19)","v":"01:01:11"}]
[null,{"$f":"'DATA LXM'!A20","v":"maxbo"},{"$f":"'DATA LXM'!E54","v":474073},{"$f":"'DATA LXM'!C54","v":18},{"$f":"'DATA LXM'!D54","v":179},{"$f":"24*3600*(1-EXP(-VLOOKUP(B59,Tableau1[],3)/350))*7.375*(0.9^TRAQUE!$H$3)","v":1629.0895002235015},0,27,10,null,null,{"$f":"TIME('DATA LXM'!D20,'DATA LXM'!E20,'DATA LXM'!F20)","v":"00:13:40"}]
[null,{"$f":"'DATA LXM'!A21","v":"moontribe"},{"$f":"'DATA LXM'!E55","v":577004},{"$f":"'DATA LXM'!C55","v":37},{"$f":"'DATA LXM'!D55","v":144},{"$f":"24*3600*(1-EXP(-VLOOKUP(B60,Tableau1[],3)/350))*7.375*(0.9^TRAQUE!$H$3)","v":5437.0730956121788},1,30,38,null,null,{"$f":"TIME('DATA LXM'!D21,'DATA LXM'!E21,'DATA LXM'!F21)","v":"01:14:09"}]
[null,{"$f":"'DATA LXM'!A22","v":"mouche"},{"$f":"'DATA LXM'!E56","v":140617522},{"$f":"'DATA LXM'!C56","v":7},{"$f":"'DATA LXM'!D56","v":245},{"$f":"24*3600*(1-EXP(-VLOOKUP(B61,Tableau1[],3)/350))*7.375*(0.9^TRAQUE!$H$3)","v":9571.7982730343228},2,39,32,null,null,{"$f":"TIME('DATA LXM'!D22,'DATA LXM'!E22,'DATA LXM'!F22)","v":"02:22:46"}]
[null,{"$f":"'DATA LXM'!A23","v":"Norrin-Radd"},{"$f":"'DATA LXM'!E57","v":32853830},{"$f":"'DATA LXM'!C57","v":33},{"$f":"'DATA LXM'!D57","v":171},{"$f":"24*3600*(1-EXP(-VLOOKUP(B62,Tableau1[],3)/350))*7.375*(0.9^TRAQUE!$H$3)","v":3371.3051981410758},0,56,12,null,null,{"$f":"TIME('DATA LXM'!D23,'DATA LXM'!E23,'DATA LXM'!F23)","v":"00:36:24"}]
[null,{"$f":"'DATA LXM'!A24","v":"Prend-Ta-Claque"},{"$f":"'DATA LXM'!E58","v":2568004},{"$f":"'DATA LXM'!C58","v":15},{"$f":"'DATA LXM'!D58","v":20},{"$f":"24*3600*(1-EXP(-VLOOKUP(B63,Tableau1[],3)/350))*7.375*(0.9^TRAQUE!$H$3)","v":17916.166819315851},4,58,37,null,null,{"$f":"TIME('DATA LXM'!D24,'DATA LXM'!E24,'DATA LXM'!F24)","v":"04:30:00"}]
[null,{"$f":"'DATA LXM'!A25","v":"sergioo"},{"$f":"'DATA LXM'!E59","v":29711962},{"$f":"'DATA LXM'!C59","v":40},{"$f":"'DATA LXM'!D59","v":21},{"$f":"24*3600*(1-EXP(-VLOOKUP(B64,Tableau1[],3)/350))*7.375*(0.9^TRAQUE!$H$3)","v":18106.582637951349},5,1,47,null,null,{"$f":"TIME('DATA LXM'!D25,'DATA LXM'!E25,'DATA LXM'!F25)","v":"04:31:14"}]
[null,{"$f":"'DATA LXM'!A26","v":"shub"},{"$f":"'DATA LXM'!E60","v":728876},{"$f":"'DATA LXM'!C60","v":42},{"$f":"'DATA LXM'!D60","v":35},{"$f":"24*3600*(1-EXP(-VLOOKUP(B65,Tableau1[],3)/350))*7.375*(0.9^TRAQUE!$H$3)","v":16845.986849709501},4,40,46,null,null,{"$f":"TIME('DATA LXM'!D26,'DATA LXM'!E26,'DATA LXM'!F26)","v":"04:11:59"}]
[null,{"$f":"'DATA LXM'!A27","v":"Slipstream"},{"$f":"'DATA LXM'!E61","v":104115},{"$f":"'DATA LXM'!C61","v":3},{"$f":"'DATA LXM'!D61","v":173},{"$f":"24*3600*(1-EXP(-VLOOKUP(B66,Tableau1[],3)/350))*7.375*(0.9^TRAQUE!$H$3)","v":875.71019389514538},0,14,36,null,null,{"$f":"TIME('DATA LXM'!D27,'DATA LXM'!E27,'DATA LXM'!F27)","v":"00:27:48"}]
[null,{"$f":"'DATA LXM'!A28","v":"waylander"},{"$f":"'DATA LXM'!E62","v":145222702},{"$f":"'DATA LXM'!C62","v":16},{"$f":"'DATA LXM'!D62","v":30},{"$f":"24*3600*(1-EXP(-VLOOKUP(B67,Tableau1[],3)/350))*7.375*(0.9^TRAQUE!$H$3)","v":16967.520149422584},4,42,48,null,null,{"$f":"TIME('DATA LXM'!D28,'DATA LXM'!E28,'DATA LXM'!F28)","v":"04:15:43"}]
[null,{"$f":"'DATA LXM'!A29","v":"weed"},{"$f":"'DATA LXM'!E63","v":1827888},{"$f":"'DATA LXM'!C63","v":7},{"$f":"'DATA LXM'!D63","v":128},{"$f":"24*3600*(1-EXP(-VLOOKUP(B68,Tableau1[],3)/350))*7.375*(0.9^TRAQUE!$H$3)","v":6010.1962760643319},1,40,11,null,null,{"$f":"TIME('DATA LXM'!D29,'DATA LXM'!E29,'DATA LXM'!F29)","v":"01:33:42"}]
[null,{"$f":"'DATA LXM'!A30","v":"Zerek"},{"$f":"'DATA LXM'!E64","v":305693},{"$f":"'DATA LXM'!C64","v":9},{"$f":"'DATA LXM'!D64","v":59},{"$f":"24*3600*(1-EXP(-VLOOKUP(B69,Tableau1[],3)/350))*7.375*(0.9^TRAQUE!$H$3)","v":14024.372738552043},3,53,45,null,null,{"$f":"TIME('DATA LXM'!D30,'DATA LXM'!E30,'DATA LXM'!F30)","v":"03:32:17"}]
[null,"agecanonix",3461184525,{"$f":"BES!E4","v":12},{"$f":"BES!F4","v":271},{"$f":"24*3600*(1-EXP(-VLOOKUP(B70,Tableau1[],3)/350))*7.375*(0.9^TRAQUE!$H$3)","v":12527.394961859323},3,28,48,null,null,{"$f":"TIME('DATA BES'!D2,'DATA BES'!E2,'DATA BES'!F2)","v":"03:06:20"}]
[null,"aubertignac",87905571,{"$f":"BES!E5","v":6},{"$f":"BES!F5","v":52},{"$f":"24*3600*(1-EXP(-VLOOKUP(B71,Tableau1[],3)/350))*7.375*(0.9^TRAQUE!$H$3)","v":14756.98136661484},4,5,57,null,null,{"$f":"TIME('DATA BES'!D3,'DATA BES'!E3,'DATA BES'!F3)","v":"03:43:29"}]
[null,"Azkanith",3500000000,{"$f":"BES!E6","v":28},{"$f":"BES!F6","v":61},{"$f":"24*3600*(1-EXP(-VLOOKUP(B72,Tableau1[],3)/350))*7.375*(0.9^TRAQUE!$H$3)","v":13983.802776443936},3,53,4,null,null,{"$f":"TIME('DATA BES'!D4,'DATA BES'!E4,'DATA BES'!F4)","v":"03:29:48"}]
[null,"Bactroban",2154874164,{"$f":"BES!E7","v":20},{"$f":"BES!F7","v":115},{"$f":"24*3600*(1-EXP(-VLOOKUP(B73,Tableau1[],3)/350))*7.375*(0.9^TRAQUE!$H$3)","v":7768.2666234735934},2,9,29,null,null,{"$f":"TIME('DATA BES'!D5,'DATA BES'!E5,'DATA BES'!F5)","v":"01:56:41"}]
[null,"ben57",149380852,{"$f":"BES!E8","v":32},{"$f":"BES!F8","v":6},{"$f":"24*3600*(1-EXP(-VLOOKUP(B74,Tableau1[],3)/350))*7.375*(0.9^TRAQUE!$H$3)","v":19338.922064382092},5,22,19,null,null,{"$f":"TIME('DATA BES'!D6,'DATA BES'!E6,'DATA BES'!F6)","v":"04:50:20"}]
[null,"bib595",2905019,{"$f":"BES!E9","v":12},{"$f":"BES!F9","v":237},{"$f":"24*3600*(1-EXP(-VLOOKUP(B75,Tableau1[],3)/350))*7.375*(0.9^TRAQUE!$H$3)","v":8622.9995842200824},2,23,43,null,null,{"$f":"TIME('DATA BES'!D7,'DATA BES'!E7,'DATA BES'!F7)","v":"02:07:39"}]
[null,"bill",54154338,{"$f":"BES!E10","v":19},{"$f":"BES!F10","v":112},{"$f":"24*3600*(1-EXP(-VLOOKUP(B76,Tableau1[],3)/350))*7.375*(0.9^TRAQUE!$H$3)","v":8108.4252571220231},2,15,9,null,null,{"$f":"TIME('DATA BES'!D8,'DATA BES'!E8,'DATA BES'!F8)","v":"02:02:05"}]
[null,"Bruxelles",3200000000,{"$f":"BES!E11","v":41},{"$f":"BES!F11","v":56},{"$f":"24*3600*(1-EXP(-VLOOKUP(B77,Tableau1[],3)/350))*7.375*(0.9^TRAQUE!$H$3)","v":14787.409452872971},4,6,28,null,null,{"$f":"TIME('DATA BES'!D9,'DATA BES'!E9,'DATA BES'!F9)","v":"03:40:45"}]
[null,"Chryom",9996200,{"$f":"BES!E12","v":9},{"$f":"BES!F12","v":58},{"$f":"24*3600*(1-EXP(-VLOOKUP(B78,Tableau1[],3)/350))*7.375*(0.9^TRAQUE!$H$3)","v":14129.373536811228},3,55,30,null,null,{"$f":"TIME('DATA BES'!D10,'DATA BES'!E10,'DATA BES'!F10)","v":"03:33:51"}]
[null,"CroolisVar",786759706,{"$f":"BES!E13","v":43},{"$f":"BES!F13","v":205},{"$f":"24*3600*(1-EXP(-VLOOKUP(B79,Tableau1[],3)/350))*7.375*(0.9^TRAQUE!$H$3)","v":6435.3367983420831},1,47,16,null,null,{"$f":"TIME('DATA BES'!D11,'DATA BES'!E11,'DATA BES'!F11)","v":"01:25:58"}]
[null,"Damping",16221345,{"$f":"BES!E14","v":29},{"$f":"BES!F14","v":270},{"$f":"24*3600*(1-EXP(-VLOOKUP(B80,Tableau1[],3)/350))*7.375*(0.9^TRAQUE!$H$3)","v":12633.89006245738},3,30,34,null,null,{"$f":"TIME('DATA BES'!D12,'DATA BES'!E12,'DATA BES'!F12)","v":"03:05:59"}]
[null,"DrAnts",3848814,{"$f":"BES!E15","v":20},{"$f":"BES!F15","v":276},{"$f":"24*3600*(1-EXP(-VLOOKUP(B81,Tableau1[],3)/350))*7.375*(0.9^TRAQUE!$H$3)","v":13128.278902299602},3,38,49,null,null,{"$f":"TIME('DATA BES'!D13,'DATA BES'!E13,'DATA BES'!F13)","v":"03:14:30"}]
[null,"Drusilla",1855225863,{"$f":"BES!E16","v":31},{"$f":"BES!F16","v":23},{"$f":"24*3600*(1-EXP(-VLOOKUP(B82,Tableau1[],3)/350))*7.375*(0.9^TRAQUE!$H$3)","v":17774.536414182072},4,56,15,null,null,{"$f":"TIME('DATA BES'!D14,'DATA BES'!E14,'DATA BES'!F14)","v":"04:26:49"}]
[null,"EllaVonZedanltha",1952804,{"$f":"BES!E17","v":29},{"$f":"BES!F17","v":59},{"$f":"24*3600*(1-EXP(-VLOOKUP(B83,Tableau1[],3)/350))*7.375*(0.9^TRAQUE!$H$3)","v":14208.582809292491},3,56,49,null,null,{"$f":"TIME('DATA BES'!D15,'DATA BES'!E15,'DATA BES'!F15)","v":"03:33:07"}]
[null,"Flipper1",92127906,{"$f":"BES!E18","v":22},{"$f":"BES!F18","v":69},{"$f":"24*3600*(1-EXP(-VLOOKUP(B84,Tableau1[],3)/350))*7.375*(0.9^TRAQUE!$H$3)","v":13046.009340490036},3,37,27,null,null,{"$f":"TIME('DATA BES'!D16,'DATA BES'!E16,'DATA BES'!F16)","v":"03:16:16"}]
[null,"Greeny",26570199,{"$f":"BES!E19","v":23},{"$f":"BES!F19","v":50},{"$f":"24*3600*(1-EXP(-VLOOKUP(B85,Tableau1[],3)/350))*7.375*(0.9^TRAQUE!$H$3)","v":15040.624895599489},4,10,41,null,null,{"$f":"TIME('DATA BES'!D17,'DATA BES'!E17,'DATA BES'!F17)","v":"03:46:14"}]
[null,"Gueust",1480632393,{"$f":"BES!E20","v":3},{"$f":"BES!F20","v":385},{"$f":"24*3600*(1-EXP(-VLOOKUP(B86,Tableau1[],3)/350))*7.375*(0.9^TRAQUE!$H$3)","v":23177.380896512692},6,26,18,null,null,{"$f":"TIME('DATA BES'!D18,'DATA BES'!E18,'DATA BES'!F18)","v":"05:46:51"}]
[null,"hador",1289178436,{"$f":"BES!E21","v":27},{"$f":"BES!F21","v":186},{"$f":"24*3600*(1-EXP(-VLOOKUP(B87,Tableau1[],3)/350))*7.375*(0.9^TRAQUE!$H$3)","v":3205.9641671868631},0,53,26,null,null,{"$f":"TIME('DATA BES'!D19,'DATA BES'!E19,'DATA BES'!F19)","v":"00:36:13"}]
[null,"Ishigo",757282747,{"$f":"BES!E22","v":23},{"$f":"BES!F22","v":103},{"$f":"24*3600*(1-EXP(-VLOOKUP(B88,Tableau1[],3)/350))*7.375*(0.9^TRAQUE!$H$3)","v":9261.6441053137987},2,34,22,null,null,{"$f":"TIME('DATA BES'!D20,'DATA BES'!E20,'DATA BES'!F20)","v":"02:18:50"}]
[null,"Lesqual",4423829,{"$f":"BES!E23","v":23},{"$f":"BES!F23","v":295},{"$f":"24*3600*(1-EXP(-VLOOKUP(B89,Tableau1[],3)/350))*7.375*(0.9^TRAQUE!$H$3)","v":15142.066863378161},4,12,23,null,null,{"$f":"TIME('DATA BES'!D21,'DATA BES'!E21,'DATA BES'!F21)","v":"03:44:42"}]
[null,"lipoussou",11917308,{"$f":"BES!E24","v":40},{"$f":"BES!F24","v":147},{"$f":"24*3600*(1-EXP(-VLOOKUP(B90,Tableau1[],3)/350))*7.375*(0.9^TRAQUE!$H$3)","v":5466.4550693770816},1,31,7,null,null,{"$f":"TIME('DATA BES'!D22,'DATA BES'!E22,'DATA BES'!F22)","v":"01:13:19"}]
[null,"Lockheed",11216156,{"$f":"BES!E25","v":28},{"$f":"BES!F25","v":176},{"$f":"24*3600*(1-EXP(-VLOOKUP(B91,Tableau1[],3)/350))*7.375*(0.9^TRAQUE!$H$3)","v":2742.8870394615442},0,45,43,null,null,{"$f":"TIME('DATA BES'!D23,'DATA BES'!E23,'DATA BES'!F23)","v":"00:26:29"}]
[null,"MagnetO",111707,{"$f":"BES!E26","v":26},{"$f":"BES!F26","v":172},{"$f":"24*3600*(1-EXP(-VLOOKUP(B92,Tableau1[],3)/350))*7.375*(0.9^TRAQUE!$H$3)","v":2409.7523308087179},0,40,10,null,null,{"$f":"TIME('DATA BES'!D24,'DATA BES'!E24,'DATA BES'!F24)","v":"00:21:35"}]
[null,"marchombre",1650134494,{"$f":"BES!E27","v":16},{"$f":"BES!F27","v":106},{"$f":"24*3600*(1-EXP(-VLOOKUP(B93,Tableau1[],3)/350))*7.375*(0.9^TRAQUE!$H$3)","v":8779.584940386776},2,26,20,null,null,{"$f":"TIME('DATA BES'!D25,'DATA BES'!E25,'DATA BES'!F25)","v":"02:12:50"}]
[null,"Melissa",4325226,{"$f":"BES!E28","v":33},{"$f":"BES!F28","v":316},{"$f":"24*3600*(1-EXP(-VLOOKUP(B94,Tableau1[],3)/350))*7.375*(0.9^TRAQUE!$H$3)","v":17334.478156657457},4,48,55,null,null,{"$f":"TIME('DATA BES'!D26,'DATA BES'!E26,'DATA BES'!F26)","v":"04:17:11"}]
[null,"MilesGloriosus",1229557,{"$f":"BES!E29","v":5},{"$f":"BES!F29","v":94},{"$f":"24*3600*(1-EXP(-VLOOKUP(B95,Tableau1[],3)/350))*7.375*(0.9^TRAQUE!$H$3)","v":10165.697343151591},2,49,26,null,null,{"$f":"TIME('DATA BES'!D27,'DATA BES'!E27,'DATA BES'!F27)","v":"02:35:23"}]
[null,"miloveam",10733921,{"$f":"BES!E30","v":26},{"$f":"BES!F30","v":40},{"$f":"24*3600*(1-EXP(-VLOOKUP(B96,Tableau1[],3)/350))*7.375*(0.9^TRAQUE!$H$3)","v":16077.388450281753},4,27,58,null,null,{"$f":"TIME('DATA BES'!D28,'DATA BES'!E28,'DATA BES'!F28)","v":"04:01:36"}]
[null,"Mime",1741606,{"$f":"BES!E31","v":14},{"$f":"BES!F31","v":128},{"$f":"24*3600*(1-EXP(-VLOOKUP(B97,Tableau1[],3)/350))*7.375*(0.9^TRAQUE!$H$3)","v":6040.6292893179943},1,40,41,null,null,{"$f":"TIME('DATA BES'!D29,'DATA BES'!E29,'DATA BES'!F29)","v":"01:32:05"}]
[null,"Mimic",510734725,{"$f":"BES!E32","v":44},{"$f":"BES!F32","v":173},{"$f":"24*3600*(1-EXP(-VLOOKUP(B98,Tableau1[],3)/350))*7.375*(0.9^TRAQUE!$H$3)","v":4838.722182746078},1,20,39,null,null,{"$f":"TIME('DATA BES'!D30,'DATA BES'!E30,'DATA BES'!F30)","v":"00:58:38"}]
[null,"Morphy",1927950,{"$f":"BES!E33","v":35},{"$f":"BES!F33","v":6},{"$f":"24*3600*(1-EXP(-VLOOKUP(B99,Tableau1[],3)/350))*7.375*(0.9^TRAQUE!$H$3)","v":19378.303521878581},5,22,59,null,null,{"$f":"TIME('DATA BES'!D31,'DATA BES'!E31,'DATA BES'!F31)","v":"04:50:45"}]
[null,"Myvin",1983940382,{"$f":"BES!E34","v":29},{"$f":"BES!F34","v":37},{"$f":"24*3600*(1-EXP(-VLOOKUP(B100,Tableau1[],3)/350))*7.375*(0.9^TRAQUE!$H$3)","v":16411.676088582142},4,33,32,null,null,{"$f":"TIME('DATA BES'!D32,'DATA BES'!E32,'DATA BES'!F32)","v":"04:06:24"}]
[null,"osman",953794,{"$f":"BES!E35","v":19},{"$f":"BES!F35","v":28},{"$f":"24*3600*(1-EXP(-VLOOKUP(B101,Tableau1[],3)/350))*7.375*(0.9^TRAQUE!$H$3)","v":17177.221124635918},4,46,18,null,null,{"$f":"TIME('DATA BES'!D33,'DATA BES'!E33,'DATA BES'!F33)","v":"04:18:39"}]
[null,"pacpac001",2291704,{"$f":"BES!E36","v":6},{"$f":"BES!F36","v":51},{"$f":"24*3600*(1-EXP(-VLOOKUP(B102,Tableau1[],3)/350))*7.375*(0.9^TRAQUE!$H$3)","v":14859.860151297094},4,7,40,null,null,{"$f":"TIME('DATA BES'!D34,'DATA BES'!E34,'DATA BES'!F34)","v":"03:45:01"}]
[null,"Panda",74522661,{"$f":"BES!E37","v":4},{"$f":"BES!F37","v":35},{"$f":"24*3600*(1-EXP(-VLOOKUP(B103,Tableau1[],3)/350))*7.375*(0.9^TRAQUE!$H$3)","v":16472.367824870722},4,34,33,null,null,{"$f":"TIME('DATA BES'!D35,'DATA BES'!E35,'DATA BES'!F35)","v":"04:09:12"}]
[null,"pANTSu",1909810001,{"$f":"BES!E38","v":29},{"$f":"BES!F38","v":292},{"$f":"24*3600*(1-EXP(-VLOOKUP(B104,Tableau1[],3)/350))*7.375*(0.9^TRAQUE!$H$3)","v":14923.318916638396},4,8,44,null,null,{"$f":"TIME('DATA BES'!D36,'DATA BES'!E36,'DATA BES'!F36)","v":"03:40:51"}]
[null,"Phenixx",908308062,{"$f":"BES!E39","v":7},{"$f":"BES!F39","v":181},{"$f":"24*3600*(1-EXP(-VLOOKUP(B105,Tableau1[],3)/350))*7.375*(0.9^TRAQUE!$H$3)","v":1321.3868243828952},{"$f":"ROUNDDOWN(F105/(60*60),0)","v":0},22,2,null,null,{"$f":"TIME('DATA BES'!D37,'DATA BES'!E37,'DATA BES'!F37)","v":"00:25:48"}]
[null,"Pinou",7212325,{"$f":"BES!E40","v":43},{"$f":"BES!F40","v":21},{"$f":"24*3600*(1-EXP(-VLOOKUP(B106,Tableau1[],3)/350))*7.375*(0.9^TRAQUE!$H$3)","v":18165.539782575506},5,{"$f":"ROUNDDOWN(((F106-G106*60*60)/60),0)","v":2},{"$f":"ROUNDUP((F106-G106*60*60-H106*60),0)","v":46},null,null,{"$f":"TIME('DATA BES'!D38,'DATA BES'!E38,'DATA BES'!F38)","v":"04:31:56"}]
[null,"pluginbaby",12705822,{"$f":"BES!E41","v":35},{"$f":"BES!F41","v":23},{"$f":"24*3600*(1-EXP(-VLOOKUP(B107,Tableau1[],3)/350))*7.375*(0.9^TRAQUE!$H$3)","v":17834.547208455286},4,57,15,null,null,{"$f":"TIME('DATA BES'!D39,'DATA BES'!E39,'DATA BES'!F39)","v":"04:27:27"}]
[null,"Quivala",9761369,{"$f":"BES!E42","v":44},{"$f":"BES!F42","v":143},{"$f":"24*3600*(1-EXP(-VLOOKUP(B108,Tableau1[],3)/350))*7.375*(0.9^TRAQUE!$H$3)","v":6190.1062307920192},1,43,11,null,null,{"$f":"TIME('DATA BES'!D40,'DATA BES'!E40,'DATA BES'!F40)","v":"01:24:21"}]
[null,"Reex",1332809,{"$f":"BES!E43","v":36},{"$f":"BES!F43","v":193},{"$f":"24*3600*(1-EXP(-VLOOKUP(B109,Tableau1[],3)/350))*7.375*(0.9^TRAQUE!$H$3)","v":4732.2975668985946},1,18,53,null,null,{"$f":"TIME('DATA BES'!D41,'DATA BES'!E41,'DATA BES'!F41)","v":"00:59:12"}]
[null,"riblibli",194929,{"$f":"BES!E44","v":39},{"$f":"BES!F44","v":25},{"$f":"24*3600*(1-EXP(-VLOOKUP(B110,Tableau1[],3)/350))*7.375*(0.9^TRAQUE!$H$3)","v":17719.206566356203},4,55,20,null,null,{"$f":"TIME('DATA BES'!D42,'DATA BES'!E42,'DATA BES'!F42)","v":"04:25:26"}]
[null,"Rita",616559697,{"$f":"BES!E45","v":33},{"$f":"BES!F45","v":318},{"$f":"24*3600*(1-EXP(-VLOOKUP(B111,Tableau1[],3)/350))*7.375*(0.9^TRAQUE!$H$3)","v":17522.764706869988},4,52,3,null,null,{"$f":"TIME('DATA BES'!D43,'DATA BES'!E43,'DATA BES'!F43)","v":"04:20:02"}]
[null,"Rockslide",192556364,{"$f":"BES!E46","v":16},{"$f":"BES!F46","v":173},{"$f":"24*3600*(1-EXP(-VLOOKUP(B112,Tableau1[],3)/350))*7.375*(0.9^TRAQUE!$H$3)","v":1016.5606641838102},0,16,57,null,null,{"$f":"TIME('DATA BES'!D44,'DATA BES'!E44,'DATA BES'!F44)","v":"00:00:00"}]
[null,"Rofulus",599979,{"$f":"BES!E47","v":13},{"$f":"BES!F47","v":107},{"$f":"24*3600*(1-EXP(-VLOOKUP(B113,Tableau1[],3)/350))*7.375*(0.9^TRAQUE!$H$3)","v":8629.4824535710195},2,23,50,null,null,{"$f":"TIME('DATA BES'!D45,'DATA BES'!E45,'DATA BES'!F45)","v":"02:11:09"}]
[null,"ryuk44",53860510,{"$f":"BES!E48","v":12},{"$f":"BES!F48","v":61},{"$f":"24*3600*(1-EXP(-VLOOKUP(B114,Tableau1[],3)/350))*7.375*(0.9^TRAQUE!$H$3)","v":13817.755259947851},3,50,18,null,null,{"$f":"TIME('DATA BES'!D46,'DATA BES'!E46,'DATA BES'!F46)","v":"03:28:54"}]
[null,"Seiduna",184276,{"$f":"BES!E49","v":10},{"$f":"BES!F49","v":63},{"$f":"24*3600*(1-EXP(-VLOOKUP(B115,Tableau1[],3)/350))*7.375*(0.9^TRAQUE!$H$3)","v":13601.844498645518},3,46,42,null,null,{"$f":"TIME('DATA BES'!D47,'DATA BES'!E47,'DATA BES'!F47)","v":"03:25:53"}]
[null,"sentih",12854744,{"$f":"BES!E50","v":6},{"$f":"BES!F50","v":55},{"$f":"24*3600*(1-EXP(-VLOOKUP(B116,Tableau1[],3)/350))*7.375*(0.9^TRAQUE!$H$3)","v":14446.579333921076},4,0,47,null,null,{"$f":"TIME('DATA BES'!D48,'DATA BES'!E48,'DATA BES'!F48)","v":"03:38:52"}]
[null,"Shikamaru",8133785,{"$f":"BES!E51","v":35},{"$f":"BES!F51","v":169},{"$f":"24*3600*(1-EXP(-VLOOKUP(B117,Tableau1[],3)/350))*7.375*(0.9^TRAQUE!$H$3)","v":3662.1527474683094},1,1,3,null,null,{"$f":"TIME('DATA BES'!D49,'DATA BES'!E49,'DATA BES'!F49)","v":"00:41:09"}]
[null,"spetsnaz",3500000000,{"$f":"BES!E52","v":40},{"$f":"BES!F52","v":125},{"$f":"24*3600*(1-EXP(-VLOOKUP(B118,Tableau1[],3)/350))*7.375*(0.9^TRAQUE!$H$3)","v":7552.5629990538509},2,5,53,null,null,{"$f":"TIME('DATA BES'!D50,'DATA BES'!E50,'DATA BES'!F50)","v":"01:48:23"}]
[null,"svanhilde",2500000000,{"$f":"BES!E53","v":29},{"$f":"BES!F53","v":124},{"$f":"24*3600*(1-EXP(-VLOOKUP(B119,Tableau1[],3)/350))*7.375*(0.9^TRAQUE!$H$3)","v":7017.279524679725},1,56,58,null,null,{"$f":"TIME('DATA BES'!D51,'DATA BES'!E51,'DATA BES'!F51)","v":"01:42:49"}]
[null,"Taouret",688628575,{"$f":"BES!E54","v":33},{"$f":"BES!F54","v":237},{"$f":"24*3600*(1-EXP(-VLOOKUP(B120,Tableau1[],3)/350))*7.375*(0.9^TRAQUE!$H$3)","v":9128.8125058876503},2,32,9,null,null,{"$f":"TIME('DATA BES'!D52,'DATA BES'!E52,'DATA BES'!F52)","v":"02:11:26"}]
[null,"TheDentist",14367717,{"$f":"BES!E55","v":19},{"$f":"BES!F55","v":53},{"$f":"24*3600*(1-EXP(-VLOOKUP(B121,Tableau1[],3)/350))*7.375*(0.9^TRAQUE!$H$3)","v":14693.22870887884},4,4,54,null,null,{"$f":"TIME('DATA BES'!D53,'DATA BES'!E53,'DATA BES'!F53)","v":"03:41:22"}]
[null,"Thunderbird",2202808830,{"$f":"BES!E56","v":5},{"$f":"BES!F56","v":172},{"$f":"24*3600*(1-EXP(-VLOOKUP(B122,Tableau1[],3)/350))*7.375*(0.9^TRAQUE!$H$3)","v":577.5753120233486},0,9,38,null,null,{"$f":"TIME('DATA BES'!D54,'DATA BES'!E54,'DATA BES'!F54)","v":"00:23:42"}]
[null,"Tradjette",34256999,{"$f":"BES!E57","v":7},{"$f":"BES!F57","v":13},{"$f":"24*3600*(1-EXP(-VLOOKUP(B123,Tableau1[],3)/350))*7.375*(0.9^TRAQUE!$H$3)","v":18558.095777211591},5,9,19,null,null,{"$f":"TIME('DATA BES'!D55,'DATA BES'!E55,'DATA BES'!F55)","v":"04:40:06"}]
[null,"vinkou",2046872542,{"$f":"BES!E58","v":45},{"$f":"BES!F58","v":107},{"$f":"24*3600*(1-EXP(-VLOOKUP(B124,Tableau1[],3)/350))*7.375*(0.9^TRAQUE!$H$3)","v":9721.9344420140424},2,42,2,null,null,{"$f":"TIME('DATA BES'!D56,'DATA BES'!E56,'DATA BES'!F56)","v":"02:21:56"}]
[null,"weaver",12457093,{"$f":"BES!E59","v":16},{"$f":"BES!F59","v":13},{"$f":"24*3600*(1-EXP(-VLOOKUP(B125,Tableau1[],3)/350))*7.375*(0.9^TRAQUE!$H$3)","v":18571.133110101233},5,9,32,null,null,{"$f":"TIME('DATA BES'!D57,'DATA BES'!E57,'DATA BES'!F57)","v":"04:39:45"}]
[null,"Wolverine",2500000000,{"$f":"BES!E60","v":6},{"$f":"BES!F60","v":34},{"$f":"24*3600*(1-EXP(-VLOOKUP(B126,Tableau1[],3)/350))*7.375*(0.9^TRAQUE!$H$3)","v":16564.647732649428},4,36,5,null,null,{"$f":"TIME('DATA BES'!D58,'DATA BES'!E58,'DATA BES'!F58)","v":"04:10:25"}]