{"text_format":"1","workbook":"xlsx","n_sheets":13,"sheets":["Notice","Feuil1","FLOODMETER","LXM","BES","CC Page LXM","CC Page BES","FLOOD","TRAQUE","DATA BES","DATA LXM","DATA COMMON","DATA TRAQUE"],"not_rendered":{"charts":0,"images":0,"macros":1,"external_links":1,"defined_names":7,"comments":1,"pivot_tables":0},"unopened":[],"bounds":{"document_bytes":16777216,"sheet_cells":100000,"rows_first":2000,"rows_last":500,"rows_between":2000,"halvings":0,"cell_chars":16384,"cell_head_chars":4096},"cells_cut":0,"cells_raw":0,"read":"whole","date_system":"1900"}

{"sheet":"Notice","index":0,"n_rows":32,"n_cols":17,"rows_kept":32,"cut":false,"hidden":false,"merged":[[4,3,4,4]]}
[]
[null,"Préambule",null,"Ceci est un Excel. Donc vous pouvez modifier n'importe qu'elle case si ça vous arrange. Mais faut pas s'etonner si on fait au petit bonheur et qu'après ça marche plus"]
[null,null,null,"Il n'y a aucune connectivité internet dans ce fichier, donc aucune donnée ne sera récupérée et stockées quelque part."]
[]
[null,"Objectifs",null,"PETER DU LXM"]
[]
[null,"Outils à disposition",null,"Floodmeter"]
[null,null,null,"Calculateur de Flood multiples, affichant les heures de retours en fonction de l'heure du PC !, à vous de la paramétrer pour qu'elle soit identique à Fourmizzz"]
[null,null,null,null,"Pour ce faire :","Panneau de configuration",null,"==>","Date et Heure","==>","Temps Internet","==>","Modifier les paramètres",null,"==>","Serveur :","http://s3.fourmizzz.fr"]
[null,null,null,"Traqueur, pour voir tous les retours possibles d'une cible, en fonction de son tdp ou d'une heure de RC",null,null,null,null,null,null,null,null,null,null,null,"Ensuite valider"]
{"$rows_left_out":23}
{"sheet":"Feuil1","index":1,"n_rows":0,"n_cols":0,"rows_kept":0,"cut":false,"hidden":true,"merged":[]}

{"sheet":"FLOODMETER","index":2,"n_rows":381,"n_cols":12,"rows_kept":381,"cut":false,"hidden":false,"merged":[[58,5,58,6],[10,1,10,3],[10,0,13,0],[11,1,11,3],[12,1,12,3],[13,1,13,3],[38,5,38,6],[48,5,48,6],[8,5,8,6],[18,5,18,6],[28,5,28,6],[178,5,178,6],[68,5,68,6],[78,5,78,6],[88,5,88,6],[98,5,98,6],[108,5,108,6],[118,5,118,6],[128,5,128,6],[138,5,138,6],[148,5,148,6],[158,5,158,6],[168,5,168,6],[298,5,298,6],[188,5,188,6],[198,5,198,6],[208,5,208,6],[218,5,218,6],[228,5,228,6],[238,5,238,6],[248,5,248,6],[258,5,258,6],[268,5,268,6],[278,5,278,6],[288,5,288,6],[368,5,368,6],[378,5,378,6],[308,5,308,6],[318,5,318,6],[328,5,328,6],[338,5,338,6],[348,5,348,6],[358,5,358,6]]}
["Coller les RC toutes les 10 cases. Exemple : A10, A20, A30 etc…"]
[null,null,null,null,null,"Constantes : ",null,null,null,null,null,"Total floodé :"]
[null,null,null,null,null,"Titre",29,"Initiaux",null,null,null,{"$f":"SUM(J:J)","v":28244511}]
[null,null,null,null,null,"Corps",88,25]
[]
[]
[]
[]
[null,null,null,null,null,"Décryptage"]
["Fourmizzz","13/04/13 19h17","Terrain de chasse de Panda capturé",null,null,{"$f":"LEN(C10)","v":34},{"$f":"F10-$G$3","v":5},null,"Quantité floodée :",{"$f":"IFERROR(VALUE(MID(B12,$H$4,G11)),0)","v":28244511}]
{"$rows_left_out":372}
{"sheet":"LXM","index":3,"n_rows":32,"n_cols":23,"rows_kept":32,"cut":false,"hidden":false,"merged":[]}
["Dernière MaJ",{"$f":"TODAY()","v":"2013-04-14"},null,"Mon tdc",431842364,null,"VA",25,null,"Pos perso:","x",16,"y",173]
[]
[" ","MAP","TDC","A portée ?","x","y","Distance","Temps","  ","BONUS","VA","Dôme","Loge","BT","Armes","Evo TDP","   ","RC","Vie Dôme","Vie Loge","Fdf","Def","Capa"]
["_Angel_",null,{"$f":"VLOOKUP(A4,'DATA LXM'!$A$35:$B$64,2)","v":45216292},{"$f":"IF(AND((C4<=(3*$E$1)),(C4>=(0.5*$E$1))),\"A PORTEE\",\" \")","v":" "},40,173,{"$f":"ROUNDUP(SQRT((LXM!$L$1-LXM!E4)^2+(LXM!$N$1-LXM!F4)^2),0)","v":24},{"$f":"CONCATENATE('DATA LXM'!D2,\"h\",'DATA LXM'!E2,\"min\",'DATA LXM'!F2,\"sec\")","v":"0h50min32sec"},null,null,24]
["_diablo_",null,{"$f":"VLOOKUP(A5,'DATA LXM'!$A$35:$B$64,2)","v":134710356}," ",5,173,{"$f":"ROUNDUP(SQRT((LXM!$L$1-LXM!E5)^2+(LXM!$N$1-LXM!F5)^2),0)","v":11},{"$f":"CONCATENATE('DATA LXM'!D3,\"h\",'DATA LXM'!E3,\"min\",'DATA LXM'!F3,\"sec\")","v":"0h23min36sec"},null,null,1,null,22,20,20,null,null,"Troupes en attaque:45 806 563 Jeunes Soldates Naines, 37 315 470 Soldates Naines, 15 335 232 Naines d'Elites, 34 954 414 Jeunes Soldates, 29 395 848 Soldates, 1 Concierge, 1 Concierge d'élite, 1 Artilleuse, 2 500 000 Artilleuses d'élites, 48 963 324 Soldates d'élites, 15 487 644 Tanks, 36 682 800 Tanks d'élites, 1 Tueuse, 1 Tueuse d'élite.\n"]
["_Wolverine_",null,{"$f":"VLOOKUP(A6,'DATA LXM'!$A$35:$B$64,2)","v":573345}," ",36,173,{"$f":"ROUNDUP(SQRT((LXM!$L$1-LXM!E6)^2+(LXM!$N$1-LXM!F6)^2),0)","v":20},{"$f":"CONCATENATE('DATA LXM'!D4,\"h\",'DATA LXM'!E4,\"min\",'DATA LXM'!F4,\"sec\")","v":"0h42min21sec"},null,null,1]
["4midiable",null,{"$f":"VLOOKUP(A7,'DATA LXM'!$A$35:$B$64,2)","v":1940203}," ",40,161,{"$f":"ROUNDUP(SQRT((LXM!$L$1-LXM!E7)^2+(LXM!$N$1-LXM!F7)^2),0)","v":27},{"$f":"CONCATENATE('DATA LXM'!D5,\"h\",'DATA LXM'!E5,\"min\",'DATA LXM'!F5,\"sec\")","v":"0h56min16sec"},null,null,1]
["AB64",null,{"$f":"VLOOKUP(A8,'DATA LXM'!$A$35:$B$64,2)","v":399362427},"A PORTEE",22,14,{"$f":"ROUNDUP(SQRT((LXM!$L$1-LXM!E8)^2+(LXM!$N$1-LXM!F8)^2),0)","v":160},{"$f":"CONCATENATE('DATA LXM'!D6,\"h\",'DATA LXM'!E6,\"min\",'DATA LXM'!F6,\"sec\")","v":"4h38min31sec"},null,null,1]
["Allerdyce",null,{"$f":"VLOOKUP(A9,'DATA LXM'!$A$35:$B$64,2)","v":511366515},"A PORTEE",9,172,{"$f":"ROUNDUP(SQRT((LXM!$L$1-LXM!E9)^2+(LXM!$N$1-LXM!F9)^2),0)","v":8},{"$f":"CONCATENATE('DATA LXM'!D7,\"h\",'DATA LXM'!E7,\"min\",'DATA LXM'!F7,\"sec\")","v":"0h15min15sec"},null,null,24,21,24,20,21,null,null,"Troupes en attaque:94 224 605 Jeunes Soldates Naines, 11 046 489 Soldates Naines, 664 456 Naines d'Elites, 43 575 635 Jeunes Soldates, 17 890 090 Soldates, 849 455 Artilleuses, 2 090 917 Artilleuses d'élites, 38 233 482 Soldates d'élites, 6 908 318 Tanks, 19 531 489 Tanks d'élites, 4 269 710 Tueuses, 11 475 316 Tueuses d'élites.\n"]
["bubulle",null,{"$f":"VLOOKUP(A10,'DATA LXM'!$A$35:$B$64,2)","v":3255300}," ",4,225,{"$f":"ROUNDUP(SQRT((LXM!$L$1-LXM!E10)^2+(LXM!$N$1-LXM!F10)^2),0)","v":54},{"$f":"CONCATENATE('DATA LXM'!D8,\"h\",'DATA LXM'!E8,\"min\",'DATA LXM'!F8,\"sec\")","v":"1h47min50sec"},null,null,1]
{"$rows_left_out":23}
{"sheet":"BES","index":4,"n_rows":60,"n_cols":14,"rows_kept":60,"cut":false,"hidden":false,"merged":[]}
["Dernière MaJ",{"$f":"TODAY()","v":"2013-04-14"},null,"Mon tdc",{"$f":"LXM!E1","v":431842364},null,"VA",{"$f":"LXM!H1","v":25},null,"Pos perso:","x",{"$f":"LXM!L1","v":16},"y",{"$f":"LXM!N1","v":173}]
[]
[null,"MAP","TDC","A portée ?","x","y","Distance","Temps"]
["agecanonix",null,{"$f":"VLOOKUP(A4,'DATA BES'!$A$67:$B$124,2)","v":3461184525},{"$f":"IF(AND((C4<=(3*$E$1)),(C4>=(0.5*$E$1))),\"A PORTEE\",\" \")","v":" "},12,271,{"$f":"ROUNDUP(SQRT(($L$1-E4)^2+($N$1-F4)^2),0)","v":99},{"$f":"CONCATENATE('DATA BES'!D2,\"h\",'DATA BES'!E2,\"min\",'DATA BES'!F2,\"sec\")","v":"3h6min20sec"}]
["aubertignac",null,{"$f":"VLOOKUP(A5,'DATA BES'!$A$67:$B$124,2)","v":87905571},{"$f":"IF(AND((C5<=(3*$E$1)),(C5>=(0.5*$E$1))),\"A PORTEE\",\" \")","v":" "},6,52,{"$f":"ROUNDUP(SQRT(($L$1-E5)^2+($N$1-F5)^2),0)","v":122},{"$f":"CONCATENATE('DATA BES'!D3,\"h\",'DATA BES'!E3,\"min\",'DATA BES'!F3,\"sec\")","v":"3h43min29sec"}]
["Azkanith",null,{"$f":"VLOOKUP(A6,'DATA BES'!$A$67:$B$124,2)","v":3500000000},{"$f":"IF(AND((C6<=(3*$E$1)),(C6>=(0.5*$E$1))),\"A PORTEE\",\" \")","v":" "},28,61,{"$f":"ROUNDUP(SQRT(($L$1-E6)^2+($N$1-F6)^2),0)","v":113},{"$f":"CONCATENATE('DATA BES'!D4,\"h\",'DATA BES'!E4,\"min\",'DATA BES'!F4,\"sec\")","v":"3h29min48sec"}]
["Bactroban",null,{"$f":"VLOOKUP(A7,'DATA BES'!$A$67:$B$124,2)","v":2154874164}," ",20,115,59,{"$f":"CONCATENATE('DATA BES'!D5,\"h\",'DATA BES'!E5,\"min\",'DATA BES'!F5,\"sec\")","v":"1h56min41sec"}]
["ben57",null,{"$f":"VLOOKUP(A8,'DATA BES'!$A$67:$B$124,2)","v":149380852}," ",32,6,168,{"$f":"CONCATENATE('DATA BES'!D6,\"h\",'DATA BES'!E6,\"min\",'DATA BES'!F6,\"sec\")","v":"4h50min20sec"}]
["bib595",null,{"$f":"VLOOKUP(A9,'DATA BES'!$A$67:$B$124,2)","v":2905019}," ",12,237,65,{"$f":"CONCATENATE('DATA BES'!D7,\"h\",'DATA BES'!E7,\"min\",'DATA BES'!F7,\"sec\")","v":"2h7min39sec"}]
["bill",null,{"$f":"VLOOKUP(A10,'DATA BES'!$A$67:$B$124,2)","v":54154338}," ",19,112,62,{"$f":"CONCATENATE('DATA BES'!D8,\"h\",'DATA BES'!E8,\"min\",'DATA BES'!F8,\"sec\")","v":"2h2min5sec"}]
{"$rows_left_out":51}
{"sheet":"CC Page LXM","index":5,"n_rows":31,"n_cols":7,"rows_kept":31,"cut":false,"hidden":false,"merged":[]}
[]
[null,1,"Alpha -12-","Jericho",1839285687,162,283]
[null,2,"Alpha -12-","Matteo37",1045506653,154,290]
[null,3,"Alpha -13-","Fleau",1034979412,167,299]
[null,4,"Bravo -11-","crunchy",637917142,174,308]
[null,5,"Alpha -01- Officier chaine","Allerdyce",511366515,174,321]
[null,6,"Bravo -10-","AB64",399362427,184,318]
[null,7,"Bravo -08-","waylander",145222702,181,310]
[null,8,"Alpha -01-","mouche",140617522,171,297]
[null,9,"Alpha -01-","_diablo_",134710356,194,314]
{"$rows_left_out":22}
{"sheet":"CC Page BES","index":6,"n_rows":58,"n_cols":7,"rows_kept":58,"cut":false,"hidden":false,"merged":[]}
[]
[null,1,"Harvestkiller","Azkanith",3500000000,196,315]
[null,2,"Harvestkiller","spetsnaz",3500000000,177,313]
[null,3,"Harvestkiller","agecanonix",3461184525,143,273]
[null,4,"Harvestkiller","Bruxelles",3200000000,152,287]
[null,5,"Harvestkiller","svanhilde",2500000000,181,318]
[null,6,"Harvestkiller","Wolverine",2500000000,172,280]
[null,7,"Géokiller","Thunderbird",2202808830,183,314]
[null,8,"Harvestkiller","Bactroban",2154874164,133,256]
[null,9,"Relief Fund","vinkou",2046872542,169,304]
{"$rows_left_out":49}
{"sheet":"FLOOD","index":7,"n_rows":186,"n_cols":18,"rows_kept":186,"cut":false,"hidden":false,"merged":[[0,2,1,2],[0,3,1,3]]}
[null,null,"HEURE ACTUELLE",{"$f":"NOW()","v":41378.458855671299}]
[]
[null,"Choix 1ere cible :"]
[null,"Allerdyce",null,null,"Rockslide",{"$f":"B4","v":"Allerdyce"},null,"Prise","Limite","Precision",null,null,"Rockslide",{"$f":"B7","v":"_diablo_"},null,"Prise","Limite","Precision"]
[null,null,null,"Initial",{"$f":"LXM!E1","v":431842364},{"$f":"VLOOKUP(B4,'DATA LXM'!A35:B64,2)","v":511366515},null,null,{"$f":"IF(AND((F5<=(3*E5)),(F5>=(0.5*E5))),(((E5+F5)/3)+J5),\"HORS PORTEE\")","v":314403059.66666669},100,null,"Initial",{"$f":"E15","v":691686431.26666665},{"$f":"VLOOKUP(B7,'DATA LXM'!A35:B64,2)","v":134710356},null,null,{"$f":"IF(AND((N5<=(3*M5)),(N5>=(0.5*M5))),(((M5+N5)/3)+R5),\"HORS PORTEE\")","v":"HORS PORTEE"},100]
[null,"Choix 2eme cible",null,null,null,null,"-",{"$f":"IF(($I$5=\"HORS PORTEE\"),0,IF((F5=$I$5),(0.2*F5),IF(((0.8*F5)>$I$5),(0.2*F5),(F5-$I$5))))","v":102273303},{"$f":"H6","v":102273303},null,null,null,null,null,"-",{"$f":"IF(($Q$5=\"HORS PORTEE\"),0,IF((N5=$Q$5),(0.2*N5),IF(((0.8*N5)>$Q$5),(0.2*N5),(N5-$Q$5))))","v":0},{"$f":"P6","v":0}]
[null,"_diablo_",null,null,{"$f":"E5+H6","v":534115667},{"$f":"F5-H6","v":409093212},null,null,null,null,null,null,{"$f":"M5+P6","v":691686431.26666665},{"$f":"N5-P6","v":134710356}]
[null,null,null,null,null,null,"-",{"$f":"IF(($I$5=\"HORS PORTEE\"),0,IF((F7=$I$5),(0.2*F7),IF(((0.8*F7)>$I$5),(0.2*F7),(F7-$I$5))))","v":81818642.400000006},{"$f":"H8","v":81818642.400000006},null,null,null,null,null,"-",{"$f":"IF(($Q$5=\"HORS PORTEE\"),0,IF((N7=$Q$5),(0.2*N7),IF(((0.8*N7)>$Q$5),(0.2*N7),(N7-$Q$5))))","v":0},{"$f":"P8","v":0}]
[null,"Choix 3eme cible",null,null,{"$f":"E7+H8","v":615934309.39999998},{"$f":"F7-H8","v":327274569.60000002},null,null,null,null,null,null,{"$f":"M7+P8","v":691686431.26666665},{"$f":"N7-P8","v":134710356}]
[null,"Fleau",null,null,null,null,"-",{"$f":"IF((H6<>(F5*0.2)),0,(IF((F9=$I$5),(0.2*F9),IF(((0.8*F9)>$I$5),(0.2*F9),IF((H8=0),0,(F9-$I$5))))))","v":12871509.933333337},12871509.933333337,null,null,null,null,null,"-",{"$f":"IF((P6<>(N5*0.2)),0,(IF((N9=$Q$5),(0.2*N9),IF(((0.8*N9)>$Q$5),(0.2*N9),IF((P8=0),0,(N9-$Q$5))))))","v":0},{"$f":"P10","v":0}]
{"$rows_left_out":177}
{"sheet":"TRAQUE","index":8,"n_rows":214,"n_cols":30,"rows_kept":214,"cut":false,"hidden":false,"merged":[[1,14,2,14],[7,6,7,7],[7,8,7,9],[0,3,0,4],[0,9,0,11],[0,5,0,6]]}
[null,null,null,"Marge de lancement",null,"Temps loge ennemie",null,null,null,"Calcul de l'heure si absence de RC"]
[null,"Choisir un LXM","Heure dernier RC","minutes","secondes","minutes","secondes","VA",null,null,null,null,null,null,"Quantité sur sonde","Jsn","Sn","Ne","Js","S","C","Ce","A","Ae","Se","Tk","Tke","Tu","Tue","Temps Total"]
[null,"Allerdyce","17h30",1,30,1,null,{"$f":"VLOOKUP(B3,'DATA TRAQUE'!B2:D30,3)","v":24},null,"Heure de la sonde","Nombre d'evo de tdp","Soit Tdp Tueuse",null,null,null,15356,0,0,0,0,0,0,0,0,0,4568,25,0,0]
[null,null,null,null,null,null,null,null,null,"17h40",85,{"$f":"'DATA TRAQUE'!Q14*0.9^K4","v":0.35347920141860961},null,null,"Temps correspondant",{"$f":"TIME('DATA TRAQUE'!P19,'DATA TRAQUE'!Q19,'DATA TRAQUE'!R19)","v":"00:09:55"},{"$f":"TIME('DATA TRAQUE'!P20,'DATA TRAQUE'!Q20,'DATA TRAQUE'!R20)","v":"00:00:00"},{"$f":"TIME('DATA TRAQUE'!P21,'DATA TRAQUE'!Q21,'DATA TRAQUE'!R21)","v":"00:00:00"},{"$f":"TIME('DATA TRAQUE'!P22,'DATA TRAQUE'!Q22,'DATA TRAQUE'!R22)","v":"00:00:00"},{"$f":"TIME('DATA TRAQUE'!P23,'DATA TRAQUE'!Q23,'DATA TRAQUE'!R23)","v":"00:00:00"},{"$f":"TIME('DATA TRAQUE'!P24,'DATA TRAQUE'!Q24,'DATA TRAQUE'!R24)","v":"00:00:00"},{"$f":"TIME('DATA TRAQUE'!P25,'DATA TRAQUE'!Q25,'DATA TRAQUE'!R25)","v":"00:00:00"},{"$f":"TIME('DATA TRAQUE'!P26,'DATA TRAQUE'!Q26,'DATA TRAQUE'!R26)","v":"00:00:00"},{"$f":"TIME('DATA TRAQUE'!P27,'DATA TRAQUE'!Q27,'DATA TRAQUE'!R27)","v":"00:00:00"},{"$f":"TIME('DATA TRAQUE'!P28,'DATA TRAQUE'!Q28,'DATA TRAQUE'!R28)","v":"00:00:00"},{"$f":"TIME('DATA TRAQUE'!P29,'DATA TRAQUE'!Q29,'DATA TRAQUE'!R29)","v":"00:18:17"},{"$f":"TIME('DATA TRAQUE'!P30,'DATA TRAQUE'!Q30,'DATA TRAQUE'!R30)","v":"00:00:06"},{"$f":"TIME('DATA TRAQUE'!P31,'DATA TRAQUE'!Q31,'DATA TRAQUE'!R31)","v":"00:00:00"},{"$f":"TIME('DATA TRAQUE'!P32,'DATA TRAQUE'!Q32,'DATA TRAQUE'!R32)","v":"00:00:00"},{"$f":"'DATA TRAQUE'!P34","v":"00:28:18"}]
[null,"TDC","x","y",null,null,null,null,null,"Heure de départ"]
[null,{"$f":"VLOOKUP(B3,'DATA TRAQUE'!B2:D30,2)","v":511366515},{"$f":"VLOOKUP(B3,'DATA TRAQUE'!B2:F30,4)","v":9},{"$f":"VLOOKUP(B3,'DATA TRAQUE'!B2:F30,5)","v":172},null,null,null,null,null,{"$f":"'DATA TRAQUE'!M6-'DATA TRAQUE'!P34","v":"17:11:42"}]
[]
[null,null,null,null,null,null,"DOME",null,"LOGE"]
[null,"Joueur","TDC","Distance","Temps","A portée ?","Heure d'arrivée","Lancer à partir de ","Heure d'arrivée2","Lancer à partir de 2"]
[null,{"$f":"'DATA TRAQUE'!B41","v":"_Angel_"},{"$f":"'DATA TRAQUE'!C41","v":45216292},{"$f":"SQRT(($C$6-'DATA TRAQUE'!D41)^2+(TRAQUE!$D$6-'DATA TRAQUE'!E41)^2)","v":31.016124838541646},{"$f":"CONCATENATE('DATA TRAQUE'!G41,\"h\",'DATA TRAQUE'!H41,\"min\",'DATA TRAQUE'!I41,\"s\")","v":"1h11min51s"},{"$f":"IF(AND((C10<=(3*$B$6)),(C10>=(0.5*$B$6))),\"A PORTEE\",\" \")","v":" "},{"$f":"IF(F10=\"A PORTEE\",'DATA TRAQUE'!$M$2+TIME(0,$D$3,$E$3)+TIME('DATA TRAQUE'!G41,'DATA TRAQUE'!H41,'DATA TRAQUE'!I41),\" \")","v":" "},{"$f":"IF(F10=\"A PORTEE\",G10-VLOOKUP($B$3,'DATA TRAQUE'!$B$41:$L$126,11),\"\")","v":""},{"$f":"IF(F10=\"A PORTEE\",'DATA TRAQUE'!$M$2+TIME(0,$D$3,$E$3)+2*TIME('DATA TRAQUE'!G41,'DATA TRAQUE'!H41,'DATA TRAQUE'!I41)+TIME(0,$F$3,$G$3),\" \")","v":" "},{"$f":"IF(F10=\"A PORTEE\",I10-VLOOKUP($B$3,'DATA TRAQUE'!$B$41:$L$126,11),\"\")","v":""}]
{"$rows_left_out":205}
{"sheet":"DATA BES","index":9,"n_rows":123,"n_cols":14,"rows_kept":123,"cut":false,"hidden":false,"merged":[]}
[null,"Distance","Temps (s)","heures","minutes","secondes"]
["agecanonix",{"$f":"SQRT((BES!$L$1-BES!E4)^2+(BES!$N$1-BES!F4)^2)","v":98.081598681913832},{"$f":"24*3600*(1-EXP(-B2/350))*7.375*(0.9^LXM!$H$1)","v":11179.600174950123},{"$f":"ROUNDDOWN(C2/(60*60),0)","v":3},{"$f":"ROUNDDOWN(((C2-D2*60*60)/60),0)","v":6},{"$f":"ROUNDUP((C2-D2*60*60-E2*60),0)","v":20},null,null,null,null,null,{"$f":"BES!D4","v":" "},{"$f":"BES!A4","v":"agecanonix"},{"$f":"BES!C4","v":3461184525}]
["aubertignac",{"$f":"SQRT((BES!$L$1-BES!E5)^2+(BES!$N$1-BES!F5)^2)","v":121.41251994749142},{"$f":"24*3600*(1-EXP(-B3/350))*7.375*(0.9^LXM!$H$1)","v":13408.569336591723},{"$f":"ROUNDDOWN(C3/(60*60),0)","v":3},{"$f":"ROUNDDOWN(((C3-D3*60*60)/60),0)","v":43},{"$f":"ROUNDUP((C3-D3*60*60-E3*60),0)","v":29},null,null,null,null,null,{"$f":"BES!D5","v":" "},{"$f":"BES!A5","v":"aubertignac"},{"$f":"BES!C5","v":87905571}]
["Azkanith",{"$f":"SQRT((BES!$L$1-BES!E6)^2+(BES!$N$1-BES!F6)^2)","v":112.64102272262978},{"$f":"24*3600*(1-EXP(-B4/350))*7.375*(0.9^LXM!$H$1)","v":12587.945941018934},3,29,48,null,"Pour temps",null,null,null,{"$f":"BES!D6","v":" "},{"$f":"BES!A6","v":"Azkanith"},{"$f":"BES!C6","v":3500000000}]
["Bactroban",{"$f":"SQRT((BES!$L$1-BES!E7)^2+(BES!$N$1-BES!F7)^2)","v":58.137767414994535},{"$f":"24*3600*(1-EXP(-B5/350))*7.375*(0.9^LXM!$H$1)","v":7000.9683032987787},1,56,41,null,null,null,null,null,{"$f":"BES!D7","v":" "},{"$f":"BES!A7","v":"Bactroban"},{"$f":"BES!C7","v":2154874164}]
["ben57",{"$f":"SQRT((BES!$L$1-BES!E8)^2+(BES!$N$1-BES!F8)^2)","v":167.76471619503309},{"$f":"24*3600*(1-EXP(-B6/350))*7.375*(0.9^LXM!$H$1)","v":17419.513051631115},4,50,20,null,null,null,null,null,{"$f":"BES!D8","v":" "},{"$f":"BES!A8","v":"ben57"},{"$f":"BES!C8","v":149380852}]
["bib595",{"$f":"SQRT((BES!$L$1-BES!E9)^2+(BES!$N$1-BES!F9)^2)","v":64.124878167525594},{"$f":"24*3600*(1-EXP(-B7/350))*7.375*(0.9^LXM!$H$1)","v":7658.0793543996369},2,7,39,null,null,null,null,null,{"$f":"BES!D9","v":" "},{"$f":"BES!A9","v":"bib595"},{"$f":"BES!C9","v":2905019}]
["bill",{"$f":"SQRT((BES!$L$1-BES!E10)^2+(BES!$N$1-BES!F10)^2)","v":61.073725938409879},{"$f":"24*3600*(1-EXP(-B8/350))*7.375*(0.9^LXM!$H$1)","v":7324.6069461038587},2,2,5,null,null,null,null,null,{"$f":"BES!D10","v":" "},{"$f":"BES!A10","v":"bill"},{"$f":"BES!C10","v":54154338}]
["Bruxelles",{"$f":"SQRT((BES!$L$1-BES!E11)^2+(BES!$N$1-BES!F11)^2)","v":119.64113005150027},{"$f":"24*3600*(1-EXP(-B9/350))*7.375*(0.9^LXM!$H$1)","v":13244.498869710833},3,40,45,null,null,null,null,null,{"$f":"BES!D11","v":" "},{"$f":"BES!A11","v":"Bruxelles"},{"$f":"BES!C11","v":3200000000}]
["Chryom",{"$f":"SQRT((BES!$L$1-BES!E12)^2+(BES!$N$1-BES!F12)^2)","v":115.21284650593439},{"$f":"24*3600*(1-EXP(-B10/350))*7.375*(0.9^LXM!$H$1)","v":12830.6893180979},3,33,51,null,null,null,null,null,{"$f":"BES!D12","v":" "},{"$f":"BES!A12","v":"Chryom"},{"$f":"BES!C12","v":9996200}]
{"$rows_left_out":114}
{"sheet":"DATA LXM","index":10,"n_rows":64,"n_cols":14,"rows_kept":64,"cut":false,"hidden":false,"merged":[]}
[null,"Distance","Temps (s)","heures","minutes","secondes"]
["_Angel_",{"$f":"SQRT((LXM!$L$1-LXM!E4)^2+(LXM!$N$1-LXM!F4)^2)","v":24},{"$f":"24*3600*(1-EXP(-'DATA LXM'!B2/350))*7.375*(0.9^LXM!$H$1)","v":3031.6334263160279},{"$f":"ROUNDDOWN(C2/(60*60),0)","v":0},{"$f":"ROUNDDOWN(((C2-D2*60*60)/60),0)","v":50},{"$f":"ROUNDUP((C2-D2*60*60-E2*60),0)","v":32}]
["_diablo_",{"$f":"SQRT((LXM!$L$1-LXM!E5)^2+(LXM!$N$1-LXM!F5)^2)","v":11},{"$f":"24*3600*(1-EXP(-'DATA LXM'!B3/350))*7.375*(0.9^LXM!$H$1)","v":1415.3256915471411},0,23,36,null,null,null,null,null,{"$f":"LXM!D11","v":" "},{"$f":"LXM!A11","v":"creamy"},{"$f":"LXM!C11","v":4979692}]
["_Wolverine_",{"$f":"SQRT((LXM!$L$1-LXM!E6)^2+(LXM!$N$1-LXM!F6)^2)","v":20},{"$f":"24*3600*(1-EXP(-'DATA LXM'!B4/350))*7.375*(0.9^LXM!$H$1)","v":2540.6867736472241},0,42,21,null,null,null,null,null,{"$f":"LXM!D17","v":" "},{"$f":"LXM!A17","v":"Formidabilis"},{"$f":"LXM!C17","v":215020}]
["4midiable",{"$f":"SQRT((LXM!$L$1-LXM!E7)^2+(LXM!$N$1-LXM!F7)^2)","v":26.832815729997478},{"$f":"24*3600*(1-EXP(-'DATA LXM'!B5/350))*7.375*(0.9^LXM!$H$1)","v":3375.9454896650723},0,56,16,null,null,null,null,null,{"$f":"LXM!D22","v":" "},{"$f":"LXM!A22","v":"maxbo"},{"$f":"LXM!C22","v":474073}]
["AB64",{"$f":"SQRT((LXM!$L$1-LXM!E8)^2+(LXM!$N$1-LXM!F8)^2)","v":159.11316727411344},{"$f":"24*3600*(1-EXP(-'DATA LXM'!B6/350))*7.375*(0.9^LXM!$H$1)","v":16710.631650794156},4,38,31,null,null,null,null,null,{"$f":"LXM!D25","v":" "},{"$f":"LXM!A25","v":"Norrin-Radd"},{"$f":"LXM!C25","v":32853830}]
["Allerdyce",{"$f":"SQRT((LXM!$L$1-LXM!E9)^2+(LXM!$N$1-LXM!F9)^2)","v":7.0710678118654755},{"$f":"24*3600*(1-EXP(-'DATA LXM'!B7/350))*7.375*(0.9^LXM!$H$1)","v":914.90459776542934},0,15,15,null,null,null,null,null,{"$f":"LXM!D27","v":" "},{"$f":"LXM!A27","v":"sergioo"},{"$f":"LXM!C27","v":29711962}]
["bubulle",{"$f":"SQRT((LXM!$L$1-LXM!E10)^2+(LXM!$N$1-LXM!F10)^2)","v":53.366656256505337},{"$f":"24*3600*(1-EXP(-'DATA LXM'!B8/350))*7.375*(0.9^LXM!$H$1)","v":6469.2107040518058},1,47,50,null,null,null,null,null,{"$f":"LXM!D28","v":" "},{"$f":"LXM!A28","v":"shub"},{"$f":"LXM!C28","v":728876}]
["creamy",{"$f":"SQRT((LXM!$L$1-LXM!E11)^2+(LXM!$N$1-LXM!F11)^2)","v":23.194827009486403},{"$f":"24*3600*(1-EXP(-'DATA LXM'!B9/350))*7.375*(0.9^LXM!$H$1)","v":2933.2597038233503},{"$f":"ROUNDDOWN(C9/(60*60),0)","v":0},{"$f":"ROUNDDOWN(((C9-D9*60*60)/60),0)","v":48},{"$f":"ROUNDUP((C9-D9*60*60-E9*60),0)","v":54},null,null,null,null,null,{"$f":"LXM!D29","v":" "},{"$f":"LXM!A29","v":"Slipstream"},{"$f":"LXM!C29","v":104115}]
["crunchy",{"$f":"SQRT((LXM!$L$1-LXM!E12)^2+(LXM!$N$1-LXM!F12)^2)","v":137.18600511714013},{"$f":"24*3600*(1-EXP(-'DATA LXM'!B10/350))*7.375*(0.9^LXM!$H$1)","v":14833.504152777195},4,7,14,null,null,null,null,null,{"$f":"LXM!D30","v":" "},{"$f":"LXM!A30","v":"waylander"},{"$f":"LXM!C30","v":145222702}]
{"$rows_left_out":55}
{"sheet":"DATA COMMON","index":11,"n_rows":87,"n_cols":6,"rows_kept":87,"cut":false,"hidden":false,"merged":[]}
[null,"Distance","Temps (s)","heures","minutes","secondes"]
[{"$f":"'DATA LXM'!A2","v":"_Angel_"},{"$f":"'DATA LXM'!B2","v":24},{"$f":"'DATA LXM'!C2","v":3031.6334263160279},{"$f":"'DATA LXM'!D2","v":0},{"$f":"'DATA LXM'!E2","v":50},{"$f":"'DATA LXM'!F2","v":32}]
[{"$f":"'DATA LXM'!A3","v":"_diablo_"},{"$f":"'DATA LXM'!B3","v":11},{"$f":"'DATA LXM'!C3","v":1415.3256915471411},{"$f":"'DATA LXM'!D3","v":0},{"$f":"'DATA LXM'!E3","v":23},{"$f":"'DATA LXM'!F3","v":36}]
[{"$f":"'DATA LXM'!A4","v":"_Wolverine_"},{"$f":"'DATA LXM'!B4","v":20},{"$f":"'DATA LXM'!C4","v":2540.6867736472241},{"$f":"'DATA LXM'!D4","v":0},{"$f":"'DATA LXM'!E4","v":42},{"$f":"'DATA LXM'!F4","v":21}]
[{"$f":"'DATA LXM'!A5","v":"4midiable"},{"$f":"'DATA LXM'!B5","v":26.832815729997478},{"$f":"'DATA LXM'!C5","v":3375.9454896650723},{"$f":"'DATA LXM'!D5","v":0},{"$f":"'DATA LXM'!E5","v":56},{"$f":"'DATA LXM'!F5","v":16}]
[{"$f":"'DATA LXM'!A6","v":"AB64"},{"$f":"'DATA LXM'!B6","v":159.11316727411344},{"$f":"'DATA LXM'!C6","v":16710.631650794156},{"$f":"'DATA LXM'!D6","v":4},{"$f":"'DATA LXM'!E6","v":38},{"$f":"'DATA LXM'!F6","v":31}]
[{"$f":"'DATA BES'!A2","v":"agecanonix"},{"$f":"'DATA BES'!B2","v":98.081598681913832},{"$f":"'DATA BES'!C2","v":11179.600174950123},{"$f":"'DATA BES'!D2","v":3},{"$f":"'DATA BES'!E2","v":6},{"$f":"'DATA BES'!F2","v":20}]
[{"$f":"'DATA LXM'!A7","v":"Allerdyce"},{"$f":"'DATA LXM'!B7","v":7.0710678118654755},{"$f":"'DATA LXM'!C7","v":914.90459776542934},{"$f":"'DATA LXM'!D7","v":0},{"$f":"'DATA LXM'!E7","v":15},{"$f":"'DATA LXM'!F7","v":15}]
[{"$f":"'DATA BES'!A3","v":"aubertignac"},{"$f":"'DATA BES'!B3","v":121.41251994749142},{"$f":"'DATA BES'!C3","v":13408.569336591723},{"$f":"'DATA BES'!D3","v":3},{"$f":"'DATA BES'!E3","v":43},{"$f":"'DATA BES'!F3","v":29}]
[{"$f":"'DATA BES'!A4","v":"Azkanith"},{"$f":"'DATA BES'!B4","v":112.64102272262978},{"$f":"'DATA BES'!C4","v":12587.945941018934},{"$f":"'DATA BES'!D4","v":3},{"$f":"'DATA BES'!E4","v":29},{"$f":"'DATA BES'!F4","v":48}]
{"$rows_left_out":78}
{"sheet":"DATA TRAQUE","index":12,"n_rows":126,"n_cols":18,"rows_kept":126,"cut":false,"hidden":false,"merged":[]}
[null,null,"TDC","VA","x","y",null,null,null,null,null,null,"Heure",null,null,"TDP Basique"]
[null,{"$f":"'DATA LXM'!A2","v":"_Angel_"},{"$f":"'DATA LXM'!E36","v":45216292},{"$f":"'DATA LXM'!F36","v":24},{"$f":"'DATA LXM'!C36","v":40},{"$f":"'DATA LXM'!D36","v":173},null,null,null,null,null,null,{"$f":"REPLACE(TRAQUE!C3,3,1,\":\")","v":"17:30"},null,null,"JSN",300]
[null,{"$f":"'DATA LXM'!A3","v":"_diablo_"},{"$f":"'DATA LXM'!E37","v":134710356},{"$f":"'DATA LXM'!F37","v":1},{"$f":"'DATA LXM'!C37","v":5},{"$f":"'DATA LXM'!D37","v":173},null,null,null,null,null,null,null,null,null,"SN",450]
[null,{"$f":"'DATA LXM'!A4","v":"_Wolverine_"},{"$f":"'DATA LXM'!E38","v":573345},{"$f":"'DATA LXM'!F38","v":1},{"$f":"'DATA LXM'!C38","v":36},{"$f":"'DATA LXM'!D38","v":173},null,null,null,null,null,null,null,null,null,"NE",570]
[null,{"$f":"'DATA LXM'!A5","v":"4midiable"},{"$f":"'DATA LXM'!E39","v":1940203},{"$f":"'DATA LXM'!F39","v":1},{"$f":"'DATA LXM'!C39","v":40},{"$f":"'DATA LXM'!D39","v":161},null,null,null,null,null,null,"Heure",null,null,"JS",740]
[null,{"$f":"'DATA LXM'!A6","v":"AB64"},{"$f":"'DATA LXM'!E40","v":399362427},{"$f":"'DATA LXM'!F40","v":1},{"$f":"'DATA LXM'!C40","v":22},{"$f":"'DATA LXM'!D40","v":14},null,null,null,null,null,null,{"$f":"REPLACE(TRAQUE!J4,3,1,\":\")","v":"17:40"},null,null,"S",1000]
[null,{"$f":"'DATA LXM'!A7","v":"Allerdyce"},{"$f":"'DATA LXM'!E41","v":511366515},{"$f":"'DATA LXM'!F41","v":24},{"$f":"'DATA LXM'!C41","v":9},{"$f":"'DATA LXM'!D41","v":172},null,null,null,null,null,null,null,null,null,"C",1410]
[null,{"$f":"'DATA LXM'!A8","v":"bubulle"},{"$f":"'DATA LXM'!E42","v":3255300},{"$f":"'DATA LXM'!F42","v":1},{"$f":"'DATA LXM'!C42","v":4},{"$f":"'DATA LXM'!D42","v":225},null,null,null,null,null,null,null,null,null,"CE",1410]
[null,{"$f":"'DATA LXM'!A9","v":"creamy"},{"$f":"'DATA LXM'!E43","v":4979692},{"$f":"'DATA LXM'!F43","v":1},{"$f":"'DATA LXM'!C43","v":39},{"$f":"'DATA LXM'!D43","v":176},null,null,null,null,null,null,null,null,null,"A",1440]
[null,{"$f":"'DATA LXM'!A10","v":"crunchy"},{"$f":"'DATA LXM'!E44","v":637917142},{"$f":"'DATA LXM'!F44","v":1},{"$f":"'DATA LXM'!C44","v":34},{"$f":"'DATA LXM'!D44","v":37},null,null,null,null,null,null,null,null,null,"AE",1520]
{"$rows_left_out":116}