{"text_format":"1","workbook":"xlsx","n_sheets":3,"sheets":["Calendar","Data","ChritCal"],"not_rendered":{"charts":0,"images":0,"macros":1,"external_links":0,"defined_names":73,"comments":0,"pivot_tables":0},"unopened":[],"bounds":{"document_bytes":16777216,"sheet_cells":100000,"rows_first":2000,"rows_last":500,"rows_between":2000,"halvings":0,"cell_chars":16384,"cell_head_chars":4096},"cells_cut":0,"cells_raw":0,"read":"whole","date_system":"1904"}

{"sheet":"Calendar","index":0,"n_rows":140,"n_cols":35,"rows_kept":140,"cut":false,"hidden":false,"merged":[[0,1,0,5],[33,1,33,5],[67,1,67,5],[101,1,101,5],[106,36,107,36],[4,36,5,36],[38,36,39,36],[72,36,73,36],[33,8,33,9],[33,20,33,21],[33,32,33,33],[67,8,67,9],[67,20,67,21],[67,32,67,33],[101,8,101,9],[101,20,101,21],[101,32,101,33],[135,8,135,9],[135,20,135,21],[135,32,135,33],[139,15,140,17],[139,18,140,19]]}
[null,{"$f":"theYear","v":2013}]
[null,{"$f":"Month01","v":"JANVIER"},null,null,null,null,null,"Mat","Midi","Soir","Total",null,null,{"$f":"Month02","v":"FEVRIER"},null,null,null,null,null,"Mat","Midi","Soir","Total",null,null,{"$f":"Month03","v":"MARS"},null,null,null,null,null,"Mat","Midi","Soir","Total"]
[{"$f":"Date2JDN(theYear,1,1)","v":2456293.5},{"$f":"INDEX(TheDays,MOD(A3+0.5,7)+1)","v":"Ma"},{"$f":"JDN2Date(A3,\"D\")","v":1},1,"Nouvel An",null,null,null,null,null,{"$f":"SUM(H3,I3,J3)","v":0},null,{"$f":"LOOKUP(31,C3:C33,January)+1","v":2456324.5},{"$f":"INDEX(TheDays,MOD(M3+0.5,7)+1)","v":"Ve"},{"$f":"JDN2Date(_Feb01,\"D\")","v":1},{"$f":"_Feb01-_Jan01+1","v":32},null,null,null,null,null,null,{"$f":"SUM(T3,U3,V3)","v":0},null,{"$f":"LOOKUP(FebDays,O3:O31,February)+1","v":2456352.5},{"$f":"INDEX(TheDays,MOD(_Mar01+0.5,7)+1)","v":"Ve"},{"$f":"JDN2Date(_Mar01,\"D\")","v":1},{"$f":"_Mar01-_Jan01+1","v":60},null,null,null,null,null,null,{"$f":"SUM(AF3,AG3,AH3)","v":0}]
[{"$f":"A3+1","v":2456294.5},{"$f":"IF(C4=\"\",\"\",INDEX(TheDays,MOD(A4+0.5,7)+1))","v":"Me"},{"$f":"IF(OR(C3=31,C3=\"\",JDN2Date(A4,\"M\")<>1),\"\",JDN2Date(A4,\"D\"))","v":2},{"$f":"IF(C4=\"\",\"\",D3+1)","v":2},null,null,null,null,null,null,0,null,{"$f":"_Feb01+1","v":2456325.5},{"$f":"IF(O4=\"\",\"\",INDEX(TheDays,MOD(M4+0.5,7)+1))","v":"Sa"},{"$f":"IF(OR(O3=FebDays,O3=\"\",JDN2Date(M4,\"M\")<>2),\"\",JDN2Date(M4,\"D\"))","v":2},{"$f":"IF(O4=\"\",\"\",P3+1)","v":33},null,null,null,null,null,null,0,null,{"$f":"_Mar01+1","v":2456353.5},{"$f":"IF(AA4=\"\",\"\",INDEX(TheDays,MOD(Y4+0.5,7)+1))","v":"Sa"},{"$f":"IF(OR(AA3=31,AA3=\"\",JDN2Date(Y4,\"M\")<>3),\"\",JDN2Date(Y4,\"D\"))","v":2},{"$f":"IF(AA4=\"\",\"\",AB3+1)","v":61},null,null,null,null,null,null,0]
[{"$f":"A4+1","v":2456295.5},{"$f":"IF(C5=\"\",\"\",INDEX(TheDays,MOD(A5+0.5,7)+1))","v":"Je"},{"$f":"IF(OR(C4=31,C4=\"\",JDN2Date(A5,\"M\")<>1),\"\",JDN2Date(A5,\"D\"))","v":3},{"$f":"IF(C5=\"\",\"\",D4+1)","v":3},null,null,null,null,null,null,0,null,{"$f":"M4+1","v":2456326.5},{"$f":"IF(O5=\"\",\"\",INDEX(TheDays,MOD(M5+0.5,7)+1))","v":"Di"},{"$f":"IF(OR(O4=FebDays,O4=\"\",JDN2Date(M5,\"M\")<>2),\"\",JDN2Date(M5,\"D\"))","v":3},{"$f":"IF(O5=\"\",\"\",P4+1)","v":34},null,null,null,null,null,null,0,null,{"$f":"Y4+1","v":2456354.5},"Di",{"$f":"IF(OR(AA4=31,AA4=\"\",JDN2Date(Y5,\"M\")<>3),\"\",JDN2Date(Y5,\"D\"))","v":3},{"$f":"IF(AA5=\"\",\"\",AB4+1)","v":62},null,null,null,null,null,null,0]
[2456296.5,"Ve",4,4,null,null,null,null,null,null,0,null,{"$f":"M5+1","v":2456327.5},"Lu",4,35,null,null,5,null,null,null,0,null,{"$f":"Y5+1","v":2456355.5},"Lu",4,63,null,null,9,null,null,null,0]
[2456297.5,"Sa",5,5,null,null,null,null,null,null,0,null,2456328.5,"Ma",5,36,null,null,null,null,null,null,0,null,2456356.5,"Ma",5,64,null,null,null,null,null,null,0]
[2456298.5,"Di",6,6,null,null,null,null,null,null,0,null,2456329.5,"Me",6,37,null,null,null,null,null,null,0,null,2456357.5,"Me",6,65,null,null,null,null,null,null,0]
[2456299.5,"Lu",7,7,null,null,1,null,null,null,0,null,2456330.5,"Je",7,38,null,null,null,null,null,null,0,null,2456358.5,"Je",7,66,null,null,null,null,null,null,0]
[2456300.5,"Ma",8,8,null,null,null,null,null,null,0,null,2456331.5,"Ve",8,39,null,null,null,null,null,null,0,null,2456359.5,"Ve",8,67,null,null,null,null,null,null,0]
[2456301.5,"Me",9,9,null,null,null,null,null,null,0,null,2456332.5,"Sa",9,40,null,null,null,null,null,null,0,null,2456360.5,"Sa",9,68,null,null,null,null,null,null,0]
[2456302.5,"Je",10,10,null,null,null,null,null,null,0,null,2456333.5,"Di",10,41,null,null,null,null,null,null,0,null,2456361.5,"Di",10,69,null,null,null,null,null,null,0]
[2456303.5,"Ve",11,11,null,null,null,null,null,null,0,null,2456334.5,"Lu",11,42,null,null,6,null,null,null,0,null,2456362.5,"Lu",11,70,null,null,10,null,null,null,0]
[2456304.5,"Sa",12,12,null,null,null,null,null,null,0,null,2456335.5,"Ma",12,43,null,null,null,null,null,null,0,null,2456363.5,"Ma",12,71,null,null,null,null,null,null,0]
[2456305.5,"Di",13,13,null,null,null,null,null,null,0,null,2456336.5,"Me",13,44,null,null,null,null,null,null,0,null,2456364.5,"Me",13,72,null,null,null,null,null,null,0]
[2456306.5,"Lu",14,14,null,null,2,null,null,null,0,null,2456337.5,"Je",14,45,null,null,null,null,null,null,0,null,2456365.5,"Je",14,73,null,null,null,null,null,null,0]
[2456307.5,"Ma",15,15,null,null,null,null,null,null,0,null,2456338.5,"Ve",15,46,null,null,null,null,null,null,0,null,2456366.5,"Ve",15,74,null,null,null,null,null,null,0]
[2456308.5,"Me",16,16,null,null,null,null,null,null,0,null,2456339.5,"Sa",16,47,null,null,null,null,null,null,0,null,2456367.5,"Sa",16,75,null,null,null,null,null,null,0]
[2456309.5,"Je",17,17,null,null,null,null,null,null,0,null,2456340.5,"Di",17,48,null,null,null,null,null,null,0,null,2456368.5,"Di",17,76,null,null,null,null,null,null,0]
[2456310.5,"Ve",18,18,null,null,null,null,null,null,0,null,2456341.5,"Lu",18,49,null,null,7,null,null,null,0,null,2456369.5,"Lu",18,77,null,null,11,null,null,null,0]
[2456311.5,"Sa",19,19,null,null,null,null,null,null,0,null,2456342.5,"Ma",19,50,null,null,null,null,null,null,0,null,2456370.5,"Ma",19,78,null,null,null,null,null,null,0]
[2456312.5,"Di",20,20,null,null,null,null,null,null,0,null,2456343.5,"Me",20,51,null,null,null,null,null,null,0,null,2456371.5,"Me",20,79,null,null,null,null,null,null,0]
[2456313.5,"Lu",21,21,null,null,3,null,null,null,0,null,2456344.5,"Je",21,52,null,null,null,null,null,null,0,null,2456372.5,"Je",21,80,null,null,null,null,null,null,0]
[2456314.5,"Ma",22,22,null,null,null,null,null,null,0,null,2456345.5,"Ve",22,53,null,null,null,null,null,null,0,null,2456373.5,"Ve",22,81,null,null,null,null,null,null,0]
[2456315.5,"Me",23,23,null,null,null,null,null,null,0,null,2456346.5,"Sa",23,54,null,null,null,null,null,null,0,null,2456374.5,"Sa",23,82,null,null,null,null,null,null,0]
[2456316.5,"Je",24,24,null,null,null,null,null,null,0,null,2456347.5,"Di",24,55,null,null,null,null,null,null,0,null,2456375.5,"Di",24,83,null,null,null,null,null,null,0]
[2456317.5,"Ve",25,25,null,null,null,null,null,null,0,null,2456348.5,"Lu",25,56,null,null,8,null,null,null,0,null,2456376.5,"Lu",25,84,null,null,12,null,null,null,0]
[2456318.5,"Sa",26,26,null,null,null,null,null,null,0,null,2456349.5,"Ma",26,57,null,null,null,null,null,null,0,null,2456377.5,"Ma",26,85,null,null,null,null,null,null,0]
[2456319.5,"Di",27,27,null,null,null,null,null,null,0,null,2456350.5,"Me",27,58,null,null,null,null,null,null,0,null,2456378.5,"Me",27,86,null,null,null,null,null,null,0]
[2456320.5,"Lu",28,28,null,null,4,null,null,null,0,null,2456351.5,"Je",28,59,null,null,null,null,null,null,0,null,2456379.5,"Je",28,87,null,null,null,null,null,null,0]
[2456321.5,"Ma",29,29,null,null,null,null,null,null,0,null,2456352.5,"","","",null,null,null,null,null,null,0,null,2456380.5,"Ve",29,88,null,null,null,null,null,null,0]
[2456322.5,"Me",30,30,null,null,null,null,null,null,0,null,null,null,null,null,null,null,null,null,null,null,0,null,2456381.5,"Sa",30,89,null,null,null,null,null,null,0]
[{"$f":"A32+1","v":2456323.5},"Je",31,31,null,null,null,null,null,null,0,null,null,null,null,null,null,null,null,null,null,null,0,null,2456382.5,"Di",31,90,"Pâques",null,null,null,null,null,0]
[null,{"$f":"theYear","v":2013},null,null,null,null,null,null,"Total",null,{"$f":"SUM(K3:K33)","v":0},null,null,null,null,null,null,null,null,null,"Total",null,{"$f":"SUM(W3:W33)","v":0},null,null,null,null,null,null,null,null,null,"Total",null,{"$f":"SUM(AI3:AI33)","v":0}]
[]
[null,{"$f":"Month04","v":"AVRIL"},null,null,null,null,null,"Mat","Midi","Soir","Total",null,null,{"$f":"Month05","v":"MAI"},null,null,null,null,null,"Mat","Midi","Soir","Total",null,null,{"$f":"Month06","v":"JUIN"},null,null,null,null,null,"Mat","Midi","Soir","Total"]
[{"$f":"LOOKUP(31,AA3:AA33,March)+1","v":2456383.5},{"$f":"IF(C37=\"\",\"\",INDEX(TheDays,MOD(A37+0.5,7)+1))","v":"Lu"},{"$f":"JDN2Date(_Apr01,\"D\")","v":1},{"$f":"_Apr01-_Jan01+1","v":91},"Lundi de Pâques",null,13,null,null,null,{"$f":"SUM(H37,I37,J37)","v":0},null,{"$f":"LOOKUP(30,C37:C67,April)+1","v":2456413.5},{"$f":"IF(O37=\"\",\"\",INDEX(TheDays,MOD(M37+0.5,7)+1))","v":"Me"},{"$f":"JDN2Date(_May01,\"D\")","v":1},{"$f":"_May01-_Jan01+1","v":121},"Fête du travail",null,null,null,null,null,{"$f":"SUM(T37,U37,V37)","v":0},null,{"$f":"LOOKUP(31,O37:O67,May)+1","v":2456444.5},{"$f":"INDEX(TheDays,MOD(Y37+0.5,7)+1)","v":"Sa"},{"$f":"JDN2Date(_Jun01,\"D\")","v":1},{"$f":"_Jun01-_Jan01+1","v":152},null,null,null,null,null,null,{"$f":"SUM(AF37,AG37,AH37)","v":0}]
[{"$f":"_Apr01+1","v":2456384.5},{"$f":"IF(C38=\"\",\"\",INDEX(TheDays,MOD(A38+0.5,7)+1))","v":"Ma"},{"$f":"IF(OR(C37=30,C37=\"\",JDN2Date(A38,\"M\")<>4),\"\",JDN2Date(A38,\"D\"))","v":2},{"$f":"IF(C38=\"\",\"\",D37+1)","v":92},null,null,null,null,null,null,0,null,{"$f":"_May01+1","v":2456414.5},{"$f":"IF(O38=\"\",\"\",INDEX(TheDays,MOD(M38+0.5,7)+1))","v":"Je"},{"$f":"IF(OR(O37=31,O37=\"\",JDN2Date(M38,\"M\")<>5),\"\",JDN2Date(M38,\"D\"))","v":2},{"$f":"IF(O38=\"\",\"\",P37+1)","v":122},null,null,null,null,null,null,0,null,{"$f":"_Jun01+1","v":2456445.5},{"$f":"IF(AA38=\"\",\"\",INDEX(TheDays,MOD(Y38+0.5,7)+1))","v":"Di"},{"$f":"IF(OR(AA37=30,AA37=\"\",JDN2Date(Y38,\"M\")<>6),\"\",JDN2Date(Y38,\"D\"))","v":2},{"$f":"IF(AA38=\"\",\"\",AB37+1)","v":153},null,null,null,null,null,null,0]
[{"$f":"A38+1","v":2456385.5},{"$f":"IF(C39=\"\",\"\",INDEX(TheDays,MOD(A39+0.5,7)+1))","v":"Me"},{"$f":"IF(OR(C38=30,C38=\"\",JDN2Date(A39,\"M\")<>4),\"\",JDN2Date(A39,\"D\"))","v":3},93,null,null,null,null,null,null,0,null,{"$f":"M38+1","v":2456415.5},"Ve",{"$f":"IF(OR(O38=31,O38=\"\",JDN2Date(M39,\"M\")<>5),\"\",JDN2Date(M39,\"D\"))","v":3},123,null,null,null,null,null,null,0,null,{"$f":"Y38+1","v":2456446.5},"Lu",{"$f":"IF(OR(AA38=30,AA38=\"\",JDN2Date(Y39,\"M\")<>6),\"\",JDN2Date(Y39,\"D\"))","v":3},154,null,null,22,null,null,null,0]
[{"$f":"A39+1","v":2456386.5},"Je",4,94,null,null,null,null,null,null,0,null,{"$f":"M39+1","v":2456416.5},"Sa",4,124,null,null,null,null,null,null,0,null,{"$f":"Y39+1","v":2456447.5},"Ma",4,155,null,null,null,null,null,null,0]
[2456387.5,"Ve",5,95,null,null,null,null,null,null,0,null,2456417.5,"Di",5,125,null,null,null,null,null,null,0,null,2456448.5,"Me",5,156,null,null,null,null,null,null,0]
[2456388.5,"Sa",6,96,null,null,null,null,null,null,0,null,2456418.5,"Lu",6,126,null,null,18,null,null,null,0,null,2456449.5,"Je",6,157,null,null,null,null,null,null,0]
[2456389.5,"Di",7,97,null,null,null,null,null,null,0,null,2456419.5,"Ma",7,127,null,null,null,null,null,null,0,null,2456450.5,"Ve",7,158,null,null,null,null,null,null,0]
[2456390.5,"Lu",8,98,null,null,14,null,null,null,0,null,2456420.5,"Me",8,128,"Victoire 1945",null,null,null,null,null,0,null,2456451.5,"Sa",8,159,null,null,null,null,null,null,0]
[2456391.5,"Ma",9,99,null,null,null,null,null,null,0,null,2456421.5,"Je",9,129,"Ascension",null,null,null,null,null,0,null,2456452.5,"Di",9,160,null,null,null,null,null,null,0]
[2456392.5,"Me",10,100,null,null,null,null,null,null,0,null,2456422.5,"Ve",10,130,null,null,null,null,null,null,0,null,2456453.5,"Lu",10,161,null,null,23,null,null,null,0]
[2456393.5,"Je",11,101,null,null,null,null,null,null,0,null,2456423.5,"Sa",11,131,null,null,null,null,null,null,0,null,2456454.5,"Ma",11,162,null,null,null,null,null,null,0]
[2456394.5,"Ve",12,102,null,null,null,null,null,null,0,null,2456424.5,"Di",12,132,null,null,null,null,null,null,0,null,2456455.5,"Me",12,163,null,null,null,null,null,null,0]
[2456395.5,"Sa",13,103,null,null,null,null,null,null,0,null,2456425.5,"Lu",13,133,null,null,19,null,null,null,0,null,2456456.5,"Je",13,164,null,null,null,null,null,null,0]
[2456396.5,"Di",14,104,null,null,null,null,null,null,0,null,2456426.5,"Ma",14,134,null,null,null,null,null,null,0,null,2456457.5,"Ve",14,165,null,null,null,null,null,null,0]
[2456397.5,"Lu",15,105,null,null,15,null,null,null,0,null,2456427.5,"Me",15,135,null,null,null,null,null,null,0,null,2456458.5,"Sa",15,166,null,null,null,null,null,null,0]
[2456398.5,"Ma",16,106,null,null,null,null,null,null,0,null,2456428.5,"Je",16,136,null,null,null,null,null,null,0,null,2456459.5,"Di",16,167,null,null,null,null,null,null,0]
[2456399.5,"Me",17,107,null,null,null,null,null,null,0,null,2456429.5,"Ve",17,137,null,null,null,null,null,null,0,null,2456460.5,"Lu",17,168,null,null,24,null,null,null,0]
[2456400.5,"Je",18,108,null,null,null,null,null,null,0,null,2456430.5,"Sa",18,138,null,null,null,null,null,null,0,null,2456461.5,"Ma",18,169,null,null,null,null,null,null,0]
[2456401.5,"Ve",19,109,null,null,null,null,null,null,0,null,2456431.5,"Di",19,139,"Pentecôte",null,null,null,null,null,0,null,2456462.5,"Me",19,170,null,null,null,null,null,null,0]
[2456402.5,"Sa",20,110,null,null,null,null,null,null,0,null,2456432.5,"Lu",20,140,"Lundi de Pentecôte",null,20,null,null,null,0,null,2456463.5,"Je",20,171,null,null,null,null,null,null,0]
[2456403.5,"Di",21,111,null,null,null,null,null,null,0,null,2456433.5,"Ma",21,141,null,null,null,null,null,null,0,null,2456464.5,"Ve",21,172,null,null,null,null,null,null,0]
[2456404.5,"Lu",22,112,null,null,16,null,null,null,0,null,2456434.5,"Me",22,142,null,null,null,null,null,null,0,null,2456465.5,"Sa",22,173,null,null,null,null,null,null,0]
[2456405.5,"Ma",23,113,null,null,null,null,null,null,0,null,2456435.5,"Je",23,143,null,null,null,null,null,null,0,null,2456466.5,"Di",23,174,null,null,null,null,null,null,0]
[2456406.5,"Me",24,114,null,null,null,null,null,null,0,null,2456436.5,"Ve",24,144,null,null,null,null,null,null,0,null,2456467.5,"Lu",24,175,null,null,25,null,null,null,0]
[2456407.5,"Je",25,115,null,null,null,null,null,null,0,null,2456437.5,"Sa",25,145,null,null,null,null,null,null,0,null,2456468.5,"Ma",25,176,null,null,null,null,null,null,0]
[2456408.5,"Ve",26,116,null,null,null,null,null,null,0,null,2456438.5,"Di",26,146,null,null,null,null,null,null,0,null,2456469.5,"Me",26,177,null,null,null,null,null,null,0]
[2456409.5,"Sa",27,117,null,null,null,null,null,null,0,null,2456439.5,"Lu",27,147,null,null,21,null,null,null,0,null,2456470.5,"Je",27,178,null,null,null,null,null,null,0]
[2456410.5,"Di",28,118,null,null,null,null,null,null,0,null,2456440.5,"Ma",28,148,null,null,null,null,null,null,0,null,2456471.5,"Ve",28,179,null,null,null,null,null,null,0]
[2456411.5,"Lu",29,119,null,null,17,null,null,null,0,null,2456441.5,"Me",29,149,null,null,null,null,null,null,0,null,2456472.5,"Sa",29,180,null,null,null,null,null,null,0]
[2456412.5,"Ma",30,120,null,null,null,null,null,null,0,null,2456442.5,"Je",30,150,null,null,null,null,null,null,0,null,2456473.5,"Di",30,181,null,null,null,null,null,null,0]
[null,null,null,null,null,null,null,null,null,null,0,null,2456443.5,"Ve",31,151,null,null,null,null,null,null,0,null,null,null,null,null,null,null,null,null,null,null,0]
[null,{"$f":"theYear","v":2013},null,null,null,null,null,null,"Total",null,{"$f":"SUM(K37:K67)","v":0},null,null,null,null,null,null,null,null,null,"Total",null,{"$f":"SUM(W37:W67)","v":0},null,null,null,null,null,null,null,null,null,"Total",null,{"$f":"SUM(AI37:AI67)","v":0}]
[]
[null,{"$f":"Month07","v":"JUILLET"},null,null,null,null,null,"Mat","Midi","Soir","Total",null,null,{"$f":"Month08","v":"AOUT"},null,null,null,null,null,"Mat","Midi","Soir","Total",null,null,{"$f":"Month09","v":"SEPTEMBRE"},null,null,null,null,null,"Mat","Midi","Soir","Total"]
[{"$f":"LOOKUP(30,AA37:AA66,June)+1","v":2456474.5},{"$f":"INDEX(TheDays,MOD(A71+0.5,7)+1)","v":"Lu"},{"$f":"JDN2Date(_Jul01,\"D\")","v":1},{"$f":"_Jul01-_Jan01+1","v":182},null,null,26,null,null,null,{"$f":"SUM(H71,I71,J71)","v":0},null,{"$f":"LOOKUP(31,C71:C101,July)+1","v":2456505.5},{"$f":"INDEX(TheDays,MOD(M71+0.5,7)+1)","v":"Je"},{"$f":"JDN2Date(_Aug01,\"D\")","v":1},{"$f":"_Aug01-_Jan01+1","v":213},null,null,null,null,null,null,{"$f":"SUM(T71,U71,V71)","v":0},null,{"$f":"LOOKUP(31,O71:O101,August)+1","v":2456536.5},{"$f":"INDEX(TheDays,MOD(Y71+0.5,7)+1)","v":"Di"},{"$f":"JDN2Date(_Sep01,\"D\")","v":1},{"$f":"_Sep01-_Jan01+1","v":244},null,null,null,null,null,null,{"$f":"SUM(AF71,AG71,AH71)","v":0}]
[{"$f":"_Jul01+1","v":2456475.5},{"$f":"IF(C72=\"\",\"\",INDEX(TheDays,MOD(A72+0.5,7)+1))","v":"Ma"},{"$f":"IF(OR(C71=31,C71=\"\",JDN2Date(A72,\"M\")<>7),\"\",JDN2Date(A72,\"D\"))","v":2},{"$f":"IF(C72=\"\",\"\",D71+1)","v":183},null,null,null,null,null,null,0,null,{"$f":"_Aug01+1","v":2456506.5},{"$f":"IF(O72=\"\",\"\",INDEX(TheDays,MOD(M72+0.5,7)+1))","v":"Ve"},{"$f":"IF(OR(O71=31,O71=\"\",JDN2Date(M72,\"M\")<>8),\"\",JDN2Date(M72,\"D\"))","v":2},{"$f":"IF(O72=\"\",\"\",P71+1)","v":214},null,null,null,null,null,null,0,null,{"$f":"_Sep01+1","v":2456537.5},{"$f":"IF(AA72=\"\",\"\",INDEX(TheDays,MOD(Y72+0.5,7)+1))","v":"Lu"},{"$f":"IF(OR(AA71=30,AA71=\"\",JDN2Date(Y72,\"M\")<>9),\"\",JDN2Date(Y72,\"D\"))","v":2},{"$f":"IF(AA72=\"\",\"\",AB71+1)","v":245},null,null,35,null,null,null,0]
[{"$f":"A72+1","v":2456476.5},"Me",{"$f":"IF(OR(C72=31,C72=\"\",JDN2Date(A73,\"M\")<>7),\"\",JDN2Date(A73,\"D\"))","v":3},184,null,null,null,null,null,null,0,null,{"$f":"M72+1","v":2456507.5},"Sa",{"$f":"IF(OR(O72=31,O72=\"\",JDN2Date(M73,\"M\")<>8),\"\",JDN2Date(M73,\"D\"))","v":3},215,null,null,null,null,null,null,0,null,{"$f":"Y72+1","v":2456538.5},"Ma",{"$f":"IF(OR(AA72=30,AA72=\"\",JDN2Date(Y73,\"M\")<>9),\"\",JDN2Date(Y73,\"D\"))","v":3},{"$f":"IF(AA73=\"\",\"\",AB72+1)","v":246},null,null,null,null,null,null,0]
[2456477.5,"Je",4,185,null,null,null,null,null,null,0,null,{"$f":"M73+1","v":2456508.5},"Di",4,216,null,null,null,null,null,null,0,null,2456539.5,"Me",4,247,null,null,null,null,null,null,0]
[2456478.5,"Ve",5,186,null,null,null,null,null,null,0,null,2456509.5,"Lu",5,217,null,null,31,null,null,null,0,null,2456540.5,"Je",5,248,null,null,null,null,null,null,0]
[2456479.5,"Sa",6,187,null,null,null,null,null,null,0,null,2456510.5,"Ma",6,218,null,null,null,null,null,null,0,null,2456541.5,"Ve",6,249,null,null,null,null,null,null,0]
[2456480.5,"Di",7,188,null,null,null,null,null,null,0,null,2456511.5,"Me",7,219,null,null,null,null,null,null,0,null,2456542.5,"Sa",7,250,null,null,null,null,null,null,0]
[2456481.5,"Lu",8,189,null,null,27,null,null,null,0,null,2456512.5,"Je",8,220,null,null,null,null,null,null,0,null,2456543.5,"Di",8,251,null,null,null,null,null,null,0]
[2456482.5,"Ma",9,190,null,null,null,null,null,null,0,null,2456513.5,"Ve",9,221,null,null,null,null,null,null,0,null,2456544.5,"Lu",9,252,null,null,36,null,null,null,0]
[2456483.5,"Me",10,191,null,null,null,null,null,null,0,null,2456514.5,"Sa",10,222,null,null,null,null,null,null,0,null,2456545.5,"Ma",10,253,null,null,null,null,null,null,0]
[2456484.5,"Je",11,192,null,null,null,null,null,null,0,null,2456515.5,"Di",11,223,null,null,null,null,null,null,0,null,2456546.5,"Me",11,254,null,null,null,null,null,null,0]
[2456485.5,"Ve",12,193,null,null,null,null,null,null,0,null,2456516.5,"Lu",12,224,null,null,32,null,null,null,0,null,2456547.5,"Je",12,255,null,null,null,null,null,null,0]
[2456486.5,"Sa",13,194,null,null,null,null,null,null,0,null,2456517.5,"Ma",13,225,null,null,null,null,null,null,0,null,2456548.5,"Ve",13,256,null,null,null,null,null,null,0]
[2456487.5,"Di",14,195,"Fête Nationale",null,null,null,null,null,0,null,2456518.5,"Me",14,226,null,null,null,null,null,null,0,null,2456549.5,"Sa",14,257,null,null,null,null,null,null,0]
[2456488.5,"Lu",15,196,null,null,28,null,null,null,0,null,2456519.5,"Je",15,227,"Assomption",null,null,null,null,null,0,null,2456550.5,"Di",15,258,null,null,null,null,null,null,0]
[2456489.5,"Ma",16,197,null,null,null,null,null,null,0,null,2456520.5,"Ve",16,228,null,null,null,null,null,null,0,null,2456551.5,"Lu",16,259,null,null,37,null,null,null,0]
[2456490.5,"Me",17,198,null,null,null,null,null,null,0,null,2456521.5,"Sa",17,229,null,null,null,null,null,null,0,null,2456552.5,"Ma",17,260,null,null,null,null,null,null,0]
[2456491.5,"Je",18,199,null,null,null,null,null,null,0,null,2456522.5,"Di",18,230,null,null,null,null,null,null,0,null,2456553.5,"Me",18,261,null,null,null,null,null,null,0]
[2456492.5,"Ve",19,200,null,null,null,null,null,null,0,null,2456523.5,"Lu",19,231,null,null,33,null,null,null,0,null,2456554.5,"Je",19,262,null,null,null,null,null,null,0]
[2456493.5,"Sa",20,201,null,null,null,null,null,null,0,null,2456524.5,"Ma",20,232,null,null,null,null,null,null,0,null,2456555.5,"Ve",20,263,null,null,null,null,null,null,0]
[2456494.5,"Di",21,202,null,null,null,null,null,null,0,null,2456525.5,"Me",21,233,null,null,null,null,null,null,0,null,2456556.5,"Sa",21,264,null,null,null,null,null,null,0]
[2456495.5,"Lu",22,203,null,null,29,null,null,null,0,null,2456526.5,"Je",22,234,null,null,null,null,null,null,0,null,2456557.5,"Di",22,265,null,null,null,null,null,null,0]
[2456496.5,"Ma",23,204,null,null,null,null,null,null,0,null,2456527.5,"Ve",23,235,null,null,null,null,null,null,0,null,2456558.5,"Lu",23,266,null,null,38,null,null,null,0]
[2456497.5,"Me",24,205,null,null,null,null,null,null,0,null,2456528.5,"Sa",24,236,null,null,null,null,null,null,0,null,2456559.5,"Ma",24,267,null,null,null,null,null,null,0]
[2456498.5,"Je",25,206,null,null,null,null,null,null,0,null,2456529.5,"Di",25,237,null,null,null,null,null,null,0,null,2456560.5,"Me",25,268,null,null,null,null,null,null,0]
[2456499.5,"Ve",26,207,null,null,null,null,null,null,0,null,2456530.5,"Lu",26,238,null,null,34,null,null,null,0,null,2456561.5,"Je",26,269,null,null,null,null,null,null,0]
[2456500.5,"Sa",27,208,null,null,null,null,null,null,0,null,2456531.5,"Ma",27,239,null,null,null,null,null,null,0,null,2456562.5,"Ve",27,270,null,null,null,null,null,null,0]
[2456501.5,"Di",28,209,null,null,null,null,null,null,0,null,2456532.5,"Me",28,240,null,null,null,null,null,null,0,null,2456563.5,"Sa",28,271,null,null,null,null,null,null,0]
[2456502.5,"Lu",29,210,null,null,30,null,null,null,0,null,2456533.5,"Je",29,241,null,null,null,null,null,null,0,null,2456564.5,"Di",29,272,null,null,null,null,null,null,0]
[2456503.5,"Ma",30,211,null,null,null,null,null,null,0,null,2456534.5,"Ve",30,242,null,null,null,null,null,null,0,null,2456565.5,"Lu",30,273,null,null,39,null,null,null,0]
[2456504.5,"Me",31,212,null,null,null,null,null,null,0,null,2456535.5,"Sa",31,243,null,null,null,null,null,null,0,null,null,null,null,null,null,null,null,null,null,null,0]
[null,{"$f":"theYear","v":2013},null,null,null,null,null,null,"Total",null,{"$f":"SUM(K71:K101)","v":0},null,null,null,null,null,null,null,null,null,"Total",null,{"$f":"SUM(W71:W101)","v":0},null,null,null,null,null,null,null,null,null,"Total",null,{"$f":"SUM(AI71:AI101)","v":0}]
[]
[null,{"$f":"Month10","v":"OCTOBRE"},null,null,null,null,null,"Mat","Midi","Soir","Total",null,null,{"$f":"Month11","v":"NOVEMBRE"},null,null,null,null,null,"Mat","Midi","Soir","Total",null,null,{"$f":"Month12","v":"DECEMBRE"},null,null,null,null,null,"Mat","Midi","Soir","Total"]
[{"$f":"LOOKUP(30,AA71:AA100,September)+1","v":2456566.5},{"$f":"INDEX(TheDays,MOD(A105+0.5,7)+1)","v":"Ma"},{"$f":"JDN2Date(_Oct01,\"D\")","v":1},{"$f":"_Oct01-_Jan01+1","v":274},null,null,null,null,null,null,{"$f":"SUM(H105,I105,J105)","v":0},null,{"$f":"LOOKUP(31,C105:C135,October)+1","v":2456597.5},{"$f":"INDEX(TheDays,MOD(M105+0.5,7)+1)","v":"Ve"},{"$f":"JDN2Date(_Nov01,\"D\")","v":1},{"$f":"_Nov01-_Jan01+1","v":305},"Toussaint",null,null,null,null,null,{"$f":"SUM(T105,U105,V105)","v":0},null,{"$f":"LOOKUP(31,O105:O134,November)+1","v":2456627.5},{"$f":"INDEX(TheDays,MOD(Y105+0.5,7)+1)","v":"Di"},{"$f":"JDN2Date(_Dec01,\"D\")","v":1},{"$f":"_Dec01-_Jan01+1","v":335},null,null,null,null,null,null,{"$f":"SUM(AF105,AG105,AH105)","v":0}]
[{"$f":"_Oct01+1","v":2456567.5},{"$f":"IF(C106=\"\",\"\",INDEX(TheDays,MOD(A106+0.5,7)+1))","v":"Me"},{"$f":"IF(OR(C105=31,C105=\"\",JDN2Date(A106,\"M\")<>10),\"\",JDN2Date(A106,\"D\"))","v":2},{"$f":"IF(C106=\"\",\"\",D105+1)","v":275},null,null,null,null,null,null,0,null,{"$f":"_Nov01+1","v":2456598.5},{"$f":"IF(O106=\"\",\"\",INDEX(TheDays,MOD(M106+0.5,7)+1))","v":"Sa"},{"$f":"IF(OR(O105=31,O105=\"\",JDN2Date(M106,\"M\")<>11),\"\",JDN2Date(M106,\"D\"))","v":2},{"$f":"IF(O106=\"\",\"\",P105+1)","v":306},null,null,null,null,null,null,0,null,{"$f":"_Dec01+1","v":2456628.5},{"$f":"IF(AA106=\"\",\"\",INDEX(TheDays,MOD(Y106+0.5,7)+1))","v":"Lu"},{"$f":"IF(OR(AA105=30=_Dec01+1,AA105=\"\",JDN2Date(Y106,\"M\")<>12),\"\",JDN2Date(Y106,\"D\"))","v":2},{"$f":"IF(AA106=\"\",\"\",AB105+1)","v":336},null,null,48,null,null,null,0]
[{"$f":"A106+1","v":2456568.5},"Je",{"$f":"IF(OR(C106=31,C106=\"\",JDN2Date(A107,\"M\")<>10),\"\",JDN2Date(A107,\"D\"))","v":3},{"$f":"IF(C107=\"\",\"\",D106+1)","v":276},null,null,null,null,null,null,0,null,{"$f":"M106+1","v":2456599.5},"Di",{"$f":"IF(OR(O106=31,O106=\"\",JDN2Date(M107,\"M\")<>11),\"\",JDN2Date(M107,\"D\"))","v":3},307,null,null,null,null,null,null,0,null,{"$f":"Y106+1","v":2456629.5},"Ma",{"$f":"IF(OR(AA106=30=_Dec01+1,AA106=\"\",JDN2Date(Y107,\"M\")<>12),\"\",JDN2Date(Y107,\"D\"))","v":3},{"$f":"IF(AA107=\"\",\"\",AB106+1)","v":337},null,null,null,null,null,null,0]
[{"$f":"A107+1","v":2456569.5},"Ve",4,277,null,null,null,null,null,null,0,null,2456600.5,"Lu",4,308,null,null,44,null,null,null,0,null,2456630.5,"Me",4,338,null,null,null,null,null,null,0]
[2456570.5,"Sa",5,278,null,null,null,null,null,null,0,null,2456601.5,"Ma",5,309,null,null,null,null,null,null,0,null,2456631.5,"Je",5,339,null,null,null,null,null,null,0]
[2456571.5,"Di",6,279,null,null,null,null,null,null,0,null,2456602.5,"Me",6,310,null,null,null,null,null,null,0,null,2456632.5,"Ve",6,340,null,null,null,null,null,null,0]
[2456572.5,"Lu",7,280,null,null,40,null,null,null,0,null,2456603.5,"Je",7,311,null,null,null,null,null,null,0,null,2456633.5,"Sa",7,341,null,null,null,null,null,null,0]
[2456573.5,"Ma",8,281,null,null,null,null,null,null,0,null,2456604.5,"Ve",8,312,null,null,null,null,null,null,0,null,2456634.5,"Di",8,342,null,null,null,null,null,null,0]
[2456574.5,"Me",9,282,null,null,null,null,null,null,0,null,2456605.5,"Sa",9,313,null,null,null,null,null,null,0,null,2456635.5,"Lu",9,343,null,null,49,null,null,null,0]
[2456575.5,"Je",10,283,null,null,null,null,null,null,0,null,2456606.5,"Di",10,314,null,null,null,null,null,null,0,null,2456636.5,"Ma",10,344,null,null,null,null,null,null,0]
[2456576.5,"Ve",11,284,null,null,null,null,null,null,0,null,2456607.5,"Lu",11,315,"Victoire 1918",null,45,null,null,null,0,null,2456637.5,"Me",11,345,null,null,null,null,null,null,0]
[2456577.5,"Sa",12,285,null,null,null,null,null,null,0,null,2456608.5,"Ma",12,316,null,null,null,null,null,null,0,null,2456638.5,"Je",12,346,null,null,null,null,null,null,0]
[2456578.5,"Di",13,286,null,null,null,null,null,null,0,null,2456609.5,"Me",13,317,null,null,null,null,null,null,0,null,2456639.5,"Ve",13,347,null,null,null,null,null,null,0]
[2456579.5,"Lu",14,287,null,null,41,null,null,null,0,null,2456610.5,"Je",14,318,null,null,null,null,null,null,0,null,2456640.5,"Sa",14,348,null,null,null,null,null,null,0]
[2456580.5,"Ma",15,288,null,null,null,null,null,null,0,null,2456611.5,"Ve",15,319,null,null,null,null,null,null,0,null,2456641.5,"Di",15,349,null,null,null,null,null,null,0]
[2456581.5,"Me",16,289,null,null,null,null,null,null,0,null,2456612.5,"Sa",16,320,null,null,null,null,null,null,0,null,2456642.5,"Lu",16,350,null,null,50,null,null,null,0]
[2456582.5,"Je",17,290,null,null,null,null,null,null,0,null,2456613.5,"Di",17,321,null,null,null,null,null,null,0,null,2456643.5,"Ma",17,351,null,null,null,null,null,null,0]
[2456583.5,"Ve",18,291,null,null,null,null,null,null,0,null,2456614.5,"Lu",18,322,null,null,46,null,null,null,0,null,2456644.5,"Me",18,352,null,null,null,null,null,null,0]
[2456584.5,"Sa",19,292,null,null,null,null,null,null,0,null,2456615.5,"Ma",19,323,null,null,null,null,null,null,0,null,2456645.5,"Je",19,353,null,null,null,null,null,null,0]
[2456585.5,"Di",20,293,null,null,null,null,null,null,0,null,2456616.5,"Me",20,324,null,null,null,null,null,null,0,null,2456646.5,"Ve",20,354,null,null,null,null,null,null,0]
[2456586.5,"Lu",21,294,null,null,42,null,null,null,0,null,2456617.5,"Je",21,325,null,null,null,null,null,null,0,null,2456647.5,"Sa",21,355,null,null,null,null,null,null,0]
[2456587.5,"Ma",22,295,null,null,null,null,null,null,0,null,2456618.5,"Ve",22,326,null,null,null,null,null,null,0,null,2456648.5,"Di",22,356,null,null,null,null,null,null,0]
[2456588.5,"Me",23,296,null,null,null,null,null,null,0,null,2456619.5,"Sa",23,327,null,null,null,null,null,null,0,null,2456649.5,"Lu",23,357,null,null,51,null,null,null,0]
[2456589.5,"Je",24,297,null,null,null,null,null,null,0,null,2456620.5,"Di",24,328,null,null,null,null,null,null,0,null,2456650.5,"Ma",24,358,null,null,null,null,null,null,0]
[2456590.5,"Ve",25,298,null,null,null,null,null,null,0,null,2456621.5,"Lu",25,329,null,null,47,null,null,null,0,null,2456651.5,"Me",25,359,"Noël",null,null,null,null,null,0]
[2456591.5,"Sa",26,299,null,null,null,null,null,null,0,null,2456622.5,"Ma",26,330,null,null,null,null,null,null,0,null,2456652.5,"Je",26,360,null,null,null,null,null,null,0]
[2456592.5,"Di",27,300,null,null,null,null,null,null,0,null,2456623.5,"Me",27,331,null,null,null,null,null,null,0,null,2456653.5,"Ve",27,361,null,null,null,null,null,null,0]
[2456593.5,"Lu",28,301,null,null,43,null,null,null,0,null,2456624.5,"Je",28,332,null,null,null,null,null,null,0,null,2456654.5,"Sa",28,362,null,null,null,null,null,null,0]
[2456594.5,"Ma",29,302,null,null,null,null,null,null,0,null,2456625.5,"Ve",29,333,null,null,null,null,null,null,0,null,2456655.5,"Di",29,363,null,null,null,null,null,null,0]
[2456595.5,"Me",30,303,null,null,null,null,null,null,0,null,2456626.5,"Sa",30,334,null,null,null,null,null,null,0,null,2456656.5,"Lu",30,364,null,null,52,null,null,null,0]
[2456596.5,"Je",31,304,null,null,null,null,null,null,0,null,null,null,null,null,null,null,null,null,null,null,0,null,2456657.5,"Ma",31,365,null,null,null,null,null,null,0]
[null,null,null,null,null,null,null,null,"Total",null,{"$f":"SUM(K105:K135)","v":0},null,null,null,null,null,null,null,null,null,"Total",null,{"$f":"SUM(W105:W135)","v":0},null,null,null,null,null,null,null,null,null,"Total",null,{"$f":"SUM(AI105:AI135)","v":0}]
[]
[]
[]
[null,null,null,null,null,null,null,null,null,null,null,null,null,null,null,"TOTAL ANNEE",null,null,{"$f":"SUM(K34,W34,AI34,K68,W68,AI68,K102,W102,AI102,K136,W136,AI136)","v":0}]

{"sheet":"Data","index":1,"n_rows":54,"n_cols":6,"rows_kept":54,"cut":false,"hidden":false,"merged":[[3,1,3,2]]}
["V1.6","Country","France"]
[null,"The year to compute",2013]
[null,"This year is a leap year",{"$f":"LeapYear(theYear)","v":false},{"$f":"IF(ItsaLeapYear=FALSE(),28,29)","v":28}]
[null,"Julian to Gregorian"]
[null,"Year",1582]
[null,"Month",12,5]
[null,"Day",9]
[null,"LastJulian",2299226]
[null,"FirstGregorian",1582.1219999974128]
[null,"Greatest year",3267,1465001]
[null,"Lowest year",-4712,-4712]
[null,"Julian Easter",{"$f":"OrthodoxEaster(theYear)","v":2456417.5},{"$f":"JDN2Date(OrthEaster)","v":"2013-5-5"}]
[null,"Gregorian easter",{"$f":"GregorianEaster(theYear)","v":2456382.5},{"$f":"JDN2Date(GregEaster)","v":"2013-3-31"}]
[null,"1st month of the year","JANVIER"]
[null,"2nd month of the year","FEVRIER"]
[null,"3rd month of the year","MARS"]
[null,"4th month of the year","AVRIL"]
[null,"5th month of the year","MAI"]
[null,"6th month of the year","JUIN"]
[null,"7th month of the year","JUILLET"]
[null,"8th month of the year","AOUT"]
[null,"9th month of the year","SEPTEMBRE"]
[null,"10th month of the year","OCTOBRE"]
[null,"11th month of the year","NOVEMBRE"]
[null,"12th month of the year","DECEMBRE","Holiday ?","From","To"]
[0,"1st day of the week","Lu",{"$f":"FALSE()","v":false}]
[1,"2nd day of the week","Ma",{"$f":"FALSE()","v":false}]
[2,"3rd day of the week","Me",{"$f":"FALSE()","v":false}]
[3,"4th day of the week","Je",{"$f":"FALSE()","v":false}]
[4,"5th day of the week","Ve",{"$f":"FALSE()","v":false}]
[5,"6th day of the week","Sa",{"$f":"TRUE()","v":true},1937,{"$f":"YearMax","v":3267}]
[6,"7th day of the week","Di",{"$f":"TRUE()","v":true},{"$f":"YearMin","v":-4712},{"$f":"YearMax","v":3267}]
[0,"Dummy entry",null,{"$f":"FALSE()","v":false}]
[{"$f":"Date2JDN(theYear,1,1)","v":2456293.5},"Nouvel An","Nouvel An",{"$f":"TRUE()","v":true},1810,{"$f":"YearMax","v":3267}]
[{"$f":"Date2JDN(theYear,5,1)","v":2456413.5},"Fête du travail","Fête du travail",{"$f":"TRUE()","v":true},1947,3267]
[{"$f":"Date2JDN(theYear,5,8)","v":2456420.5},"Victoire 1945","Victoire 1945",{"$f":"TRUE()","v":true},1982,3267]
[{"$f":"Date2JDN(theYear,7,14)","v":2456487.5},"Fête Nationale","Fête Nationale",{"$f":"TRUE()","v":true},1880,3267]
[{"$f":"Date2JDN(theYear,8,15)","v":2456519.5},"Assomption","Assomption",{"$f":"TRUE()","v":true},1802,3267]
[{"$f":"Date2JDN(theYear,11,1)","v":2456597.5},"Toussaint","Toussaint",{"$f":"TRUE()","v":true},1802,3267]
[{"$f":"Date2JDN(theYear,11,11)","v":2456607.5},"Victoire 1918","Victoire 1918",{"$f":"TRUE()","v":true},1924,3267]
[{"$f":"Date2JDN(theYear,12,25)","v":2456651.5},"Noël","Noël",{"$f":"TRUE()","v":true},1802,3267]
[{"$f":"IF(LastJulian>OrthEaster,OrthEaster,GregEaster)","v":2456382.5},"Pâques","Pâques",{"$f":"TRUE()","v":true},325,3267]
[{"$f":"GregEaster+1","v":2456383.5},"Lundi de Pâques","Lundi de Pâques",{"$f":"TRUE()","v":true},1886,3267]
[{"$f":"GregEaster+39","v":2456421.5},"Ascension","Ascension",{"$f":"TRUE()","v":true},1802,3267]
[{"$f":"GregEaster+49","v":2456431.5},"Pentecôte","Pentecôte",{"$f":"TRUE()","v":true},325,3267]
[{"$f":"GregEaster+50","v":2456432.5},"Lundi de Pentecôte","Lundi de Pentecôte",{"$f":"TRUE()","v":true},1886,3267]
[0,"Dummy entry",null,{"$f":"FALSE()","v":false}]
[0,"Dummy entry",null,{"$f":"FALSE()","v":false}]
[{"$f":"Date2JDN(theYear,1,21)","v":2456313.5},"Scaliger's date of death","Mort de Joseph Justus Scaliger",{"$f":"TRUE()","v":true},1540,1609]
[{"$f":"Date2JDN(theYear,8,5)","v":2456509.5},"Scaliger's date of birth","Naissance de Joseph Justus Scaliger",{"$f":"TRUE()","v":true},1540,1609]
[0,"Dummy entry",null,{"$f":"FALSE()","v":false}]
[null,"New Year","Nouvelle année"]
[null,{"$f":"\"Enter a year between \"&YearMin&\" and \"&YearMax","v":"Enter a year between -4712 and 3267"},{"$f":"\"Entrez une année entre \"&YearMin&\" et \"&YearMax","v":"Entrez une année entre -4712 et 3267"}]
[null,"Cancel","Annuler"]

{"sheet":"ChritCal","index":2,"n_rows":27,"n_cols":3,"rows_kept":27,"cut":false,"hidden":false,"merged":[[0,0,0,2]]}
["Fêtes chrétiennes (calendrier grégorien)"]
["Mardi Gras",{"$f":"GregEaster-47","v":2456335.5},"Pâques - 47"]
["Cendres",{"$f":"GregEaster-46","v":2456336.5},"Pâques - 46"]
["1er Dimanche du Carême",{"$f":"GregEaster-42","v":2456340.5},"Pâques - 42"]
["Tridium Pascal Jeudi",{"$f":"GregEaster-3","v":2456379.5},"Pâques - 3"]
["Tridium Pascal Vendredi",{"$f":"GregEaster-2","v":2456380.5},"Pâques - 2"]
["Tridium Pascal Samedi",{"$f":"GregEaster-1","v":2456381.5},"Pâques - 1"]
["Pâques",{"$f":"GregEaster","v":2456382.5},"Pâques"]
["Ascension",{"$f":"GregEaster+39","v":2456421.5},"Pâques + 39"]
["Pentecôte",{"$f":"GregEaster+49","v":2456431.5},"Pâques + 49"]
["Trinité",{"$f":"GregEaster+56","v":2456438.5},"Pâques + 56"]
["Fête-Dieu",{"$f":"GregEaster+63","v":2456445.5},"Pâques + 63"]
["Sacré-Cœur",{"$f":"GregEaster+68","v":2456450.5},"Pâques + 68"]
["Marie, Mère de Dieu",{"$f":"Date2JDN(theYear,1,1)","v":2456293.5},"1er janvier"]
["Epiphanie",{"$f":"Date2JDN(theYear,1,6)","v":2456298.5},"6 janvier …"]
[null,{"$f":"Date2JDN(theYear,1,2)+6-MOD(Date2JDN(theYear,1,2)+0.5,7)","v":2456298.5},"… ou dimanche entre 2 et 6 janvier"]
["St Joseph",{"$f":"Date2JDN(theYear,3,19)-(MOD(Date2JDN(theYear,3,19)+0.5,7)=6)","v":2456370.5},"19 mars (ou 18 si 19 = dimanche)"]
["Annonciation",{"$f":"IF(GregEaster<Date2JDN(theYear,4,2),GregEaster+15,Date2JDN(theYear,3,25)+6-MOD(Date2JDN(theYear,3,25)+0.5,7))","v":2456397.5},"25 (ou 24 si 25 = dimanche) mars ou 2e Lundi après Pâques si Pâques est antérieur au 2 avril"]
["St Jean Baptiste",{"$f":"Date2JDN(theYear,6,24)","v":2456467.5},"24 juin"]
["SS Pierre et Paul",{"$f":"Date2JDN(theYear,6,29)","v":2456472.5},"29 juin"]
["Assomption de Notre-Dame",{"$f":"Date2JDN(theYear,8,15)","v":2456519.5},"15août"]
["Toussaint",{"$f":"Date2JDN(theYear,11,1)","v":2456597.5},"1er novembre"]
["Fidèles Défunts",{"$f":"Date2JDN(theYear,11,2)","v":2456598.5},"2 novembre"]
["Christ-Roi",{"$f":"Date2JDN(theYear,11,20)+6-MOD(Date2JDN(theYear,11,20)+0.5,7)","v":2456620.5},"Dimanche entre 20 et 26 novembre"]
["1er Dimanche de l'Avent",{"$f":"Date2JDN(theYear,11,27)+6-MOD(Date2JDN(theYear,11,27)+0.5,7)","v":2456627.5},"Dimanche entre 27 novembre et 3 décembre"]
["Immaculée conception",{"$f":"Date2JDN(theYear,12,8)","v":2456634.5},"8 décembre"]
["Noël",{"$f":"Date2JDN(theYear,12,24)","v":2456650.5},"24 décembre"]