{"text_format":"1","workbook":"xlsx","n_sheets":6,"sheets":["Armée","Auto sur sonde","Manuel","Multiplicateurs vie","Révisions","Data"],"not_rendered":{"charts":0,"images":0,"macros":0,"external_links":0,"defined_names":0,"comments":0,"pivot_tables":0},"unopened":[],"bounds":{"document_bytes":16777216,"sheet_cells":100000,"rows_first":2000,"rows_last":500,"rows_between":2000,"halvings":0,"cell_chars":16384,"cell_head_chars":4096},"cells_cut":0,"cells_raw":0,"read":"whole","date_system":"1900"}

{"sheet":"Armée","index":0,"n_rows":98,"n_cols":30,"rows_kept":98,"cut":false,"hidden":false,"merged":[[71,8,71,9],[16,25,16,26],[65,8,65,9],[66,8,66,9],[67,8,67,9],[68,6,68,9],[69,8,69,9],[70,8,70,9],[58,17,59,21],[59,6,59,8],[60,6,60,7],[61,6,61,8],[62,6,62,8],[64,8,64,9],[53,7,53,9],[53,17,54,21],[54,7,54,9],[55,7,55,9],[56,7,56,9],[56,17,57,21],[57,7,57,9],[48,7,48,9],[48,17,49,21],[49,7,49,9],[50,7,50,9],[50,17,50,21],[51,7,51,9],[51,17,52,21],[52,7,52,9],[43,17,44,21],[44,7,44,9],[45,7,45,9],[46,7,46,9],[46,17,47,21],[47,7,47,9],[40,2,40,4],[41,2,41,4],[41,7,41,9],[41,10,41,11],[41,17,42,21],[42,7,42,9],[37,17,37,18],[37,20,37,21],[38,3,38,4],[38,6,38,9],[38,16,39,16],[38,17,39,18],[38,20,39,21],[39,3,39,4],[39,6,39,9],[34,3,34,4],[34,6,36,15],[34,17,34,18],[34,20,34,21],[35,3,35,4],[35,17,35,18],[35,20,35,21],[36,3,36,4],[32,3,32,4],[32,6,32,15],[32,17,32,18],[32,20,32,21],[33,3,33,4],[33,17,33,18],[33,20,33,21],[29,3,29,4],[30,3,30,4],[31,3,31,4],[31,6,31,15],[31,17,31,18],[31,20,31,21],[26,3,26,4],[26,11,26,13],[24,25,24,28],[27,3,27,4],[25,25,25,28],[28,3,28,4],[28,8,28,10],[28,11,29,13],[23,3,23,4],[23,11,23,13],[24,3,24,4],[22,25,23,28],[25,3,25,4],[25,8,25,10],[25,11,25,13],[16,7,16,11],[17,7,17,11],[18,7,18,11],[18,25,19,28],[22,2,22,4],[22,8,22,10],[22,11,22,13],[22,17,22,18],[22,20,22,21],[20,25,21,28],[13,7,13,11],[13,25,13,26],[14,7,14,11],[14,25,14,26],[15,7,15,11],[15,25,15,26],[10,7,10,11],[10,25,10,26],[11,7,11,11],[11,25,11,26],[12,7,12,11],[12,25,12,26],[7,7,7,11],[7,25,7,26],[8,7,8,11],[8,25,8,26],[9,7,9,11],[9,25,9,26],[2,4,2,21],[2,25,2,28],[3,25,3,28],[4,7,4,11],[4,17,18,21],[4,25,4,26],[5,7,5,11],[5,25,5,26],[6,7,6,11],[6,25,6,26]]}
[]
[]
[null,null,"DATE :",null,"2013-11-20",null,null,null,null,null,null,null,null,null,null,null,null,null,null,null,null,null,null,null,null,"tableau de calcul perso"]
[]
[null,null,"Prévision de ponte : \n(notez si dessous)",null,"pourcentage de votre armée sur 100% JSN\n(à titre d'indication)",null,"Actuellement j'ai : \n(notez si dessous)","Je lance une ponte de : \n(notez si dessous)",null,null,null,null,null,"dénomination :",null,"TOTAL FINAL \nAPRES PONTE",null,"\n\nidéal de ponte \n(selon i-sork)\n\n\n-Début de serveur-\n\nChasseur :\nSur 100% de JSN\n80 à 90% de JS\n20 à 30% d'ARTI\n\n",null,null,null,null,null,null,null,"calcul perso :",null,"sur","soit"]
[null,null,100000,null,{"$f":"100","v":100},"%",289694,0,null,null,null,null,null,"jeunes Soldate naines",null,{"$f":"SUM(G6:H6)","v":289694},null,null,null,null,null,null,null,null,null,"JSN =",null,1,{"$f":"P6","v":289694}]
[null,null,0,null,{"$f":"P7*100/P6","v":5.2558906984611351},"%",15226,0,null,null,null,null,null,"Soldates Naines",null,15226,null,null,null,null,null,null,null,null,null,"vous devez pondre"]
[null,null,0,null,{"$f":"P8*100/P6","v":1.172271431234337},"%",3396,0,null,null,null,null,null,"Naines d'Elites",null,3396,null,null,null,null,null,null,null,null,null,{"$f":"AC8-Z23","v":119057.60000000001},null,0.9,{"$f":"AC6*90/100","v":260724.6}]
[null,null,103543,null,{"$f":"P9*100/P6","v":48.902290002554416},"%",141667,0,null,null,null,null,null,"Jeunes Soldates",null,141667,null,null,null,null,null,null,null,null,null,{"$f":"AC9-Z23","v":90088.200000000012},null,0.8,{"$f":"AC6*80/100","v":231755.2}]
[null,null,0,null,{"$f":"G10*100/P6","v":4.2323969429812145},"%",12261,0,null,null,null,null,null,"Soldates",null,12261,null,null,null,null,null,null,null,null,null,{"$f":"AC10-Z23","v":61118.799999999988},null,0.7,{"$f":"AC6*70/100","v":202785.8}]
[null,null,0,null,{"$f":"P11*100/P6","v":0},"%",0,0,null,null,null,null,null,"Concierges",null,0,null,null,null,null,null,null,null,null,null,{"$f":"AC11-Z23","v":32149.399999999994},null,0.6,{"$f":"AC6*60/100","v":173816.4}]
[null,null,0,null,{"$f":"P12*100/P6","v":0},"%",0,0,null,null,null,null,null,"Concierges d'élites",null,0,null,null,null,null,null,null,null,null,null,{"$f":"AC12-Z23","v":3180},null,0.5,{"$f":"AC6*50/100","v":144847}]
[null,null,58141,null,{"$f":"P13*100/P6","v":12.749314794231154},"%",36934,0,null,null,null,null,null,"Artilleuses",null,36934,null,null,null,null,null,null,null,null,null,{"$f":"AC13-Z23","v":-25789.399999999994},null,0.4,{"$f":"AC6*40/100","v":115877.6}]
[null,null,0,null,{"$f":"P14*100/P6","v":2.678343355402597},"%",7759,0,null,null,null,null,null,"Artilleuses d'élites",null,7759,null,null,null,null,null,null,null,null,null,{"$f":"AC14-Z23","v":-54758.8},null,0.3,{"$f":"AC6*30/100","v":86908.2}]
[null,null,0,null,{"$f":"P15*100/P6","v":0.93754099152899262},"%",2716,0,null,null,null,null,null,"Soldates d'élites",null,{"$f":"SUM(G15:H15)","v":2716},null,null,null,null,null,null,null,null,null,{"$f":"AC15-Z23","v":-83728.2},null,0.2,{"$f":"AC6*20/100","v":57938.8}]
[null,null,0,null,{"$f":"P16*100/P6","v":0},"%",0,0,null,null,null,null,null,"Tanks ",null,0,null,null,null,null,null,null,null,null,null,{"$f":"AC16-Z23","v":-112697.60000000001},null,0.1,{"$f":"AC6*10/100","v":28969.4}]
[null,null,0,null,{"$f":"P17*100/P6","v":0},"%",0,0,null,null,null,null,null,"Tanks d'élites",null,{"$f":"SUM(G17:H17)","v":0}]
[null,null,0,null,{"$f":"P18*100/P6","v":0},"%",0,0,null,null,null,null,null,"Tueuses ",null,0]
[null,null,0,null,{"$f":"P19*100/P6","v":0},"%",0,0,null,null,null,null,null,"Tueuses d'élites",null,0,null,null,null,null,null,null,null,null,null,"Selectionnez dans la liste déroulante du dessous le type de fourmis que vous souhaitez créer"]
[]
[null,null,null,null,null,null,null,null,null,null,null,null,null,null,null,null,null,null,null,null,null,null,null,null,null,"Jeunes Soldates",null,null,null,"<="]
[null,null,null,null,null,null,null,null,null,null,null,null,null,null,null,null,null,null,null,null,null,null,null,null,null,null,null,null,null,"<="]
[null,null,"mon ancienne armée sauvegarde ",null,null,null,"FDF brut",null,"bonus AR",null,null,"ARME NIVEAU\n (notez si dessous)",null,null,null,"TOTAL DE FDF",null,"diff : fdf/vie",null,null,"diff : fdf/def ",null,null,null,null,{"$f":"IF(Z21=\"\",\"\",VLOOKUP(Z21,N6:P19,3,0))","v":141667}]
[null,null,162315,"jeunes Soldate naines",null,null,{"$f":"(P6*3)+(P7*5)+(P8*7)+(P9*10)+(P10*15)+(P11*1)+(P12*1)+(P13*30)+(P14*35)+(P15*24)+(P16*55)+(P17*80)+(P18*50)+(P19*55)","v":4014338},null,"(+",{"$f":"P24-G24","v":4817205.5999999996},")",12,null,null,null,{"$f":"G24*(10+L24)/10","v":8831543.5999999996},null,{"$f":"((P24-P27)/P27)*100","v":-20.602948918590805},"%",null,{"$f":"((P24-P30)/P30)*100","v":40.191620990652929},"%"]
[null,null,40074,"Soldates Naines"]
[null,null,8467,"Naines d'Elites",null,null,"VIE brut",null,"bonus BOU",null,null,"BOUCLIER NIVEAU \n(notez si dessous)",null,null,null,"TOTAL DE VIE \nen attaque ",null,"diff : vie/fdf",null,null,"diff : vie/def"]
[null,null,106309,"Jeunes Soldates",null,null,{"$f":"(P6*8)+(P7*10)+(P8*13)+(P9*16)+(P10*20)+(P11*30)+(P12*40)+(P13*10)+(P14*12)+(P15*27)+(P16*35)+(P17*50)+(P18*50)+(P19*55)","v":5561632},null,"(+",{"$f":"P27-G27","v":5561632},")",10,null,null,null,{"$f":"G27*(10+L27)/10","v":11123264},null,{"$f":"((P27-P24)/P24)*100","v":25.949262142577211},"%",null,{"$f":"((P27-P30)/P30)*100","v":76.57031222344574},"%"]
[null,null,20054,"Soldates"]
[null,null,0,"Concierges",null,null,"DEFENSE brut",null,"bonus AR",null,null,"EXE",null,null,null,"TOTAL DEFENSE",null,"diff : def/fdf",null,null,"diff : def/ vie"]
[null,null,0,"Concierges d'élites",null,null,{"$f":"(P6*2)+(P7*4)+(P8*6)+(P9*9)+(P10*14)+(P11*25)+(P12*35)+(P13*15)+(P14*18)+(P15*23)+(P16*1)+(P17*1)+(P18*50)+(P19*55)","v":2863465},null,"(+",{"$f":"P30-G30","v":3436158},")",null,null,null,null,{"$f":"G30*(10+L24)/10","v":6299623},null,{"$f":"((P30-P24)/P24)*100","v":-28.669060751735405},"%",null,{"$f":"((P30-P27)/P27)*100","v":-43.365337728206399},"%"]
[null,null,46785,"Artilleuses"]
[null,null,15582,"Artilleuses d'élites",null,null,"TOTAL DE FOURMIS",null,null,null,null,null,null,null,null,null,null,"DOME \n(notez si dessous)",null,null,"LOGE \n(notez si dessous)"]
[null,null,5678,"Soldates d'élites",null,null,{"$f":"SUM(P6:P19)","v":509653},null,null,null,null,null,null,null,null,null,null,10,null,null,11]
[null,null,0,"Tanks ",null,null,null,null,null,null,null,null,null,null,null,"i-sork 2013"]
[null,null,0,"Tanks d'élites",null,null,"RESUME \n(si vous devez envoyer ces informations copiez/collez la zone blanche et envoyez par mp -ATTENTION REVELER SON ARMEE COMPORTE UN RISQUE restez vigilant-)",null,null,null,null,null,null,null,null,null,null,"Bonus de bouclier ",null,null,"Bonus de bouclier"]
[null,null,0,"Tueuses ",null,null,null,null,null,null,null,null,null,null,null,null,"+",{"$f":"R39-P27","v":3336979.2000000011},null,"+",{"$f":"U39-P27","v":10845182.399999999}]
[null,null,0,"Tueuses d'élites"]
[null,null,null,null,null,null,"date :",null,null,{"$f":"E3","v":"2013-11-20"},null,null,null,null,null,null,null,"TOTAL DE VIE \nEN DOME",null,null,"TOTAL DE VIE \nEN LOGE"]
[null,null,"fdf notez ici","vie notez ici",null,null,"Vous avez actuellement un total de fourmis de :",null,null,null,null,null,null,null,null,null,null,{"$f":"G27*(1+0.1*L27+0.1+0.05*R33)","v":14460243.200000001},null,null,{"$f":"G27*(1+0.1*L27+0.3+0.15*U33)","v":21968446.399999999}]
[null,null,0,0,null,null,{"$f":"G33","v":509653}]
[null,null,"def notez ici",null,null,null,"Vous avez actuellement :"]
[null,null,0,null,null,null,{"$f":"R44","v":421472},"ouvrières",null,null,null,null,null,null,null,null,null,"NOMBRE D'OUVRIERES \n(notez si dessous)"]
[null,null,null,null,null,null,"Avec  un nombre total de :"]
[null,null,null,null,null,null,null,null,null,null,null,null,null,null,null,null,null,421472]
[null,null,null,null,null,null,{"$f":"P6","v":289694},"jeunes Soldate naines--",null,null,"soit",{"$f":"E6","v":100},"%"," ------- selon le ratio 100% JSN"]
[null,null,null,null,null,null,{"$f":"P7","v":15226},"Soldates Naines---------",null,null,"soit",{"$f":"E7","v":5.2558906984611351},"%"," ------- selon le ratio 100% JSN"]
[null,null,null,null,null,null,3396,"Naines d'Elites----------",null,null,"soit",1.172271431234337,"%"," ------- selon le ratio 100% JSN",null,null,null,"VOTRE VA"]
[null,null,null,null,null,null,141667,"Jeunes Soldates---------",null,null,"soit",48.902290002554416,"%"," ------- selon le ratio 100% JSN"]
[null,null,null,null,null,null,12261,"Soldates------------------",null,null,"soit",4.2323969429812145,"%"," ------- selon le ratio 100% JSN",null,null,null,14]
[null,null,null,null,null,null,0,"Concierges---------------",null,null,"soit",0,"%"," ------- selon le ratio 100% JSN"]
[null,null,null,null,null,null,0,"Concierges d'élites-----",null,null,"soit",0,"%"," ------- selon le ratio 100% JSN"]
[null,null,null,null,null,null,36934,"Artilleuses----------------",null,null,"soit",12.749314794231154,"%"," ------- selon le ratio 100% JSN",null,null,null,"VOTRE VC"]
[null,null,null,null,null,null,7759,"Artilleuses d'élites------",null,null,"soit",2.678343355402597,"%"," ------- selon le ratio 100% JSN"]
[null,null,null,null,null,null,2716,"Soldates d'élites--------",null,null,"soit",0.93754099152899262,"%"," ------- selon le ratio 100% JSN",null,null,null,10]
[null,null,null,null,null,null,0,"Tanks ---------------------",null,null,"soit",0,"%"," ------- selon le ratio 100% JSN"]
[null,null,null,null,null,null,0,"Tanks d'élites------------",null,null,"soit",0,"%"," ------- selon le ratio 100% JSN"]
[null,null,null,null,null,null,0,"Tueuses ------------------",null,null,"soit",0,"%"," ------- selon le ratio 100% JSN",null,null,null,"VOTRE TDP"]
[null,null,null,null,null,null,0,"Tueuses d'élites---------",null,null,"soit",0,"%"," ------- selon le ratio 100% JSN"]
[null,null,null,null,null,null,null,null,null,null,null,null,null,null,null,null,null,0.34]
[null,null,null,null,null,null,"Vous avez une arme de niveau :",null,null,{"$f":"L24","v":12}]
[null,null,null,null,null,null,"Vous avez un bouclier de niveau :",null,null,{"$f":"L27","v":10}]
[null,null,null,null,null,null,"Vous avez un Dôme de niveau :",null,null,{"$f":"R33","v":10}]
[null,null,null,null,null,null,"Vous avez une Loge Impèriale de niveau :",null,null,{"$f":"U33","v":11}]
[]
[null,null,null,null,null,null,"Vous avez une bonus de vie en Dôme de  :",null,{"$f":"R36","v":3336979.2000000011}]
[null,null,null,null,null,null,"soit un total de vie en dôme de  :",null,{"$f":"R39","v":14460243.200000001}]
[null,null,null,null,null,null,"Vous avez un bonus de vie en Loge de :",null,{"$f":"U36","v":10845182.399999999}]
[null,null,null,null,null,null,"soit un total de vie en loge de :",null,{"$f":"U39","v":21968446.399999999}]
[]
[null,null,null,null,null,null,"Vous avez une force de frappe brut de : ",null,{"$f":"G24","v":4014338}]
[null,null,null,null,null,null,"Vous avez une vie brut de :",null,{"$f":"G27","v":5561632}]
[null,null,null,null,null,null,"Vous avez une force de défense brut de : ",null,{"$f":"G30","v":2863465}]
[]
[null,null,null,null,null,null,"A cela s'ajoute :"]
[]
[null,null,null,null,null,null,"Le bonus d'arme en force de frappe de :",null,null,{"$f":"J24","v":4817205.5999999996}]
[null,null,null,null,null,null,"Le bonus d'arme en défense de :",null,null,{"$f":"J30","v":3436158}]
[null,null,null,null,null,null,"Le bonus de bouclier en vie de :",null,null,{"$f":"J27","v":5561632}]
[]
[null,null,null,null,null,null,"Soit :"]
[]
[null,null,null,null,null,null,"Une force de frappe totale de :",null,null,{"$f":"P24","v":8831543.5999999996}]
[null,null,null,null,null,null,"Ce qui représente :",null,null,{"$f":"R24","v":-20.602948918590805},"%","de différence, entre, la force de frappe et la vie"]
[null,null,null,null,null,null,"Aussi :",null,null,{"$f":"U24","v":40.191620990652929},"%","de différence, entre, la force de frappe et la force de défense"]
[]
[null,null,null,null,null,null,"Une vie totale de :",null,null,{"$f":"P27","v":11123264}]
[null,null,null,null,null,null,"Ce qui représente :",null,null,{"$f":"R27","v":25.949262142577211},"%","de différence, entre, la vie et la force de frappe"]
[null,null,null,null,null,null,"Aussi :",null,null,{"$f":"U27","v":76.57031222344574},"%","de différence, entre, la vie et la force de défense"]
[]
[]
[null,null,null,null,null,null,"Une force de défense totale de :",null,null,{"$f":"P30","v":6299623}]
[null,null,null,null,null,null,"Ce qui représente :",null,null,{"$f":"R30","v":-28.669060751735405},"%","de différence, entre la force de défense et la force de frappe"]
[null,null,null,null,null,null,"Aussi :",null,null,{"$f":"U30","v":-43.365337728206399},"%","de différence, entre la force de défense et la vie"]
[]
[null,null,null,null,null,null,"Votre niveau de vitesse d'Attaque est de :",null,null,{"$f":"R49","v":14}]
[null,null,null,null,null,null,"votre niveau de Vitesse de Chasse est de :",null,null,{"$f":"R54","v":10}]
[]
[null,null,null,null,null,null,"Votre temps de ponte est d'actuellement :",null,null,{"$f":"R59","v":0.34},"pour 1 ouvrière"]

{"sheet":"Auto sur sonde","index":1,"n_rows":54,"n_cols":18,"rows_kept":54,"cut":false,"hidden":false,"merged":[[7,17,7,21],[0,1,0,11],[13,8,13,9],[4,1,4,11],[12,8,12,9],[15,8,15,10],[17,8,17,10],[14,8,14,9],[15,11,15,12],[30,6,30,7],[18,8,18,9],[25,6,25,7],[1,1,1,4],[3,1,3,11],[5,1,5,4],[8,8,8,11],[19,8,19,10],[26,1,26,2],[25,1,25,2],[25,4,25,5],[16,8,16,9],[5,13,5,16],[21,8,21,10],[7,8,7,11],[27,3,27,5],[27,6,27,7],[29,1,29,2],[29,6,29,7],[26,4,26,5],[26,6,26,7],[42,2,42,3],[42,4,42,5],[43,2,43,3],[35,6,38,6],[38,2,38,3],[38,4,38,5],[39,2,39,3],[39,4,39,5],[43,4,43,5],[44,2,44,3],[44,4,44,5],[44,7,44,9],[43,7,43,10],[39,7,39,10],[40,2,40,3],[40,4,40,5],[40,7,40,9],[41,2,41,3],[41,4,41,5],[45,2,45,3],[45,4,45,5],[51,2,51,3],[51,4,51,5],[46,2,46,3],[46,4,46,5],[47,2,47,3],[47,4,47,5],[48,2,48,3],[48,4,48,5],[52,2,52,3],[52,4,52,5],[53,2,53,3],[53,4,53,5],[49,2,49,3],[49,4,49,5],[50,2,50,3],[50,4,50,5]]}
[null,"ANALYSE  RC de sonde et CALCUL D'OPTI XP"]
[null,"Rapport de sonde :"]
[]
[null,"Fourmizzz 08/02/2013 18h57 Rapport de combat\n \n\nVous attaquez la fourmilière de xxxx\n\nTroupes en attaque:1 000 Jeunes Soldates Naines.\nTroupes en défense:76 238 411 Jeunes Soldates Naines, 157 Soldates Naines, 7 000 755 Concierges, 2 000 000 Tanks.\n\nVous infligez 3 000(+6 600) dégâts et tuez 311 ennemies.\nL’ennemie inflige 329 496 325(+658 992 650) dégâts à vos fourmis et en tue 1 000.\n\nVous avez infiltré l’ennemi. Les informations sont bien rentrées... mais pas vos soldates !\n"]
[null,"Supprimez le contenu de la cellule, puis copier un RC de sonde, qui a échoué (vous n'avez pas tué tous les ennemis^^) dans la cellule (et non sur la cellule -> double clic pour avoir le curseur texte)"]
[null,"Ennemi :",null,null,null,null,null,null,null,null,null,null,null,"Extraction des données du RC :"]
[]
[null,"Type d'unité","Nb unité","Att HB","Def HB","Vie HB","Modifier nb unité",null,"Mode d'emploi :",null,null,null,null,"Nb unité","Nb tué","Position","Suivant","Texte à Analyser"]
[null,"Jeune Soldate Naine",{"$f":"IF(G9>0,G9,N9-O9)","v":76238100},{"$f":"Data!C5*$N9","v":228715233},{"$f":"Data!D5*$N9","v":152476822},{"$f":"Data!E5*$N9","v":609907288},null,null,null,null,null,null,null,{"$f":"IF((P9>0),VALUE(SUBSTITUTE(MID(R9,1,(P9-1)),\" \",\"\")),0)","v":76238411},{"$f":"MIN(Q$26-0,N9)","v":311},{"$f":"IF(ISERROR(SEARCH(Data!F5,R9)),IF(ISERROR(SEARCH(Data!G5,R9)),0,SEARCH(Data!G5,R9)),SEARCH(Data!F5,R9))","v":12},{"$f":"IF(ISERROR(SEARCH(\",\",R9,P9)),IF(ISERROR(SEARCH(\".\",R9,P9)),0,(SEARCH(\".\",R9,P9)+2)),(SEARCH(\",\",R9,P9)+2))","v":36},{"$f":"MID(B4,(SEARCH(\"Troupes en défense\",B4)+19),SEARCH(\".\",MID(B4,(SEARCH(\"Troupes en défense\",B4)+19),1000)))","v":"76 238 411 Jeunes Soldates Naines, 157 Soldates Naines, 7 000 755 Concierges, 2 000 000 Tanks."}]
[null,"Soldate Naine",null,{"$f":"Data!C6*$N10","v":785},{"$f":"Data!D6*$N10","v":628},{"$f":"Data!E6*$N10","v":1570},null,null,"1/ Copier le RC de la sonde",null,null,null,null,{"$f":"IF((P10>0),VALUE(SUBSTITUTE(MID(R10,1,(P10-1)),\" \",\"\")),0)","v":157},{"$f":"MIN(Q$26-SUM(O$9:O9),N10)","v":0},{"$f":"IF(ISERROR(SEARCH(Data!F6,R10)),IF(ISERROR(SEARCH(Data!G6,R10)),0,SEARCH(Data!G6,R10)),SEARCH(Data!F6,R10))","v":5},22,{"$f":"IF(((P9+Q9)>0),MID(R9,Q9,5000),R9)","v":"157 Soldates Naines, 7 000 755 Concierges, 2 000 000 Tanks."}]
[null,"Naine d'Elite",{"$f":"IF(G11>0,G11,N11-O11)","v":0},{"$f":"Data!C7*$N11","v":0},{"$f":"Data!D7*$N11","v":0},{"$f":"Data!E7*$N11","v":0},null,null,"2/ Renseigner \"Mon niveau\" Armes et Bouclier",null,null,null,null,0,{"$f":"MIN(Q$26-SUM(O$9:O10),N11)","v":0},{"$f":"IF(ISERROR(SEARCH(Data!F7,R11)),IF(ISERROR(SEARCH(Data!G7,R11)),0,SEARCH(Data!G7,R11)),SEARCH(Data!F7,R11))","v":0},0,"7 000 755 Concierges, 2 000 000 Tanks."]
[null,"Jeune Soldate",0,{"$f":"Data!C8*$N12","v":0},{"$f":"Data!D8*$N12","v":0},{"$f":"Data!E8*$N12","v":0},null,null,"3/ Saisir les unités à envoyer",null,null,null,null,0,{"$f":"MIN(Q$26-SUM(O$9:O11),N12)","v":0},{"$f":"IF(ISERROR(SEARCH(Data!F8,R12)),IF(ISERROR(SEARCH(Data!G8,R12)),0,SEARCH(Data!G8,R12)),SEARCH(Data!F8,R12))","v":0},0,"7 000 755 Concierges, 2 000 000 Tanks."]
[null,"Soldate",0,{"$f":"Data!C9*$N13","v":0},{"$f":"Data!D9*$N13","v":0},{"$f":"Data!E9*$N13","v":0},null,null,null,null,null,null,null,0,{"$f":"MIN(Q$26-SUM(O$9:O12),N13)","v":0},{"$f":"IF(ISERROR(SEARCH(Data!F9,R13)),IF(ISERROR(SEARCH(Data!G9,R13)),0,SEARCH(Data!G9,R13)),SEARCH(Data!F9,R13))","v":0},0,"7 000 755 Concierges, 2 000 000 Tanks."]
[null,"Concierge",7000755,{"$f":"Data!C10*$N14","v":7000755},{"$f":"Data!D10*$N14","v":175018875},{"$f":"Data!E10*$N14","v":210022650},0,null,"Légende",null,null,null,null,7000755,{"$f":"MIN(Q$26-SUM(O$9:O13),N14)","v":0},{"$f":"IF(ISERROR(SEARCH(Data!F10,R14)),IF(ISERROR(SEARCH(Data!G10,R14)),0,SEARCH(Data!G10,R14)),SEARCH(Data!F10,R14))","v":11},23,"7 000 755 Concierges, 2 000 000 Tanks."]
[null,"Concierge d'élite",0,{"$f":"Data!C11*$N15","v":0},{"$f":"Data!D11*$N15","v":0},{"$f":"Data!E11*$N15","v":0},null,null,null,null,null,null,null,0,{"$f":"MIN(Q$26-SUM(O$9:O14),N15)","v":0},{"$f":"IF(ISERROR(SEARCH(Data!F11,R15)),IF(ISERROR(SEARCH(Data!G11,R15)),0,SEARCH(Data!G11,R15)),SEARCH(Data!F11,R15))","v":0},0,"2 000 000 Tanks."]
[null,"Artilleuse",0,{"$f":"Data!C12*$N16","v":0},{"$f":"Data!D12*$N16","v":0},{"$f":"Data!E12*$N16","v":0},null,null,"cellule à renseigner",null,null," (les seules à modifier)",null,0,{"$f":"MIN(Q$26-SUM(O$9:O15),N16)","v":0},{"$f":"IF(ISERROR(SEARCH(Data!F12,R16)),IF(ISERROR(SEARCH(Data!G12,R16)),0,SEARCH(Data!G12,R16)),SEARCH(Data!F12,R16))","v":0},0,"2 000 000 Tanks."]
[null,"Artilleuse d'élite",0,{"$f":"Data!C13*$N17","v":0},{"$f":"Data!D13*$N17","v":0},{"$f":"Data!E13*$N17","v":0},null,null,null,null,null,null,null,0,{"$f":"MIN(Q$26-SUM(O$9:O16),N17)","v":0},{"$f":"IF(ISERROR(SEARCH(Data!F13,R17)),IF(ISERROR(SEARCH(Data!G13,R17)),0,SEARCH(Data!G13,R17)),SEARCH(Data!F13,R17))","v":0},0,"2 000 000 Tanks."]
[null,"Soldate d'élite",0,{"$f":"Data!C14*$N18","v":0},{"$f":"Data!D14*$N18","v":0},{"$f":"Data!E14*$N18","v":0},null,null,"résultat de calcul",null,null,null,null,0,{"$f":"MIN(Q$26-SUM(O$9:O17),N18)","v":0},{"$f":"IF(ISERROR(SEARCH(Data!F14,R18)),IF(ISERROR(SEARCH(Data!G14,R18)),0,SEARCH(Data!G14,R18)),SEARCH(Data!F14,R18))","v":0},0,"2 000 000 Tanks."]
[null,"Tank",2000000,{"$f":"Data!C15*$N19","v":110000000},{"$f":"Data!D15*$N19","v":2000000},{"$f":"Data!E15*$N19","v":70000000},null,null,null,null,null,null,null,2000000,{"$f":"MIN(Q$26-SUM(O$9:O18),N19)","v":0},{"$f":"IF(ISERROR(SEARCH(Data!F15,R19)),IF(ISERROR(SEARCH(Data!G15,R19)),0,SEARCH(Data!G15,R19)),SEARCH(Data!F15,R19))","v":11},18,"2 000 000 Tanks."]
[null,"Tank d'élite",0,{"$f":"Data!C16*$N20","v":0},{"$f":"Data!D16*$N20","v":0},{"$f":"Data!E16*$N20","v":0},null,null,"Titre",null,null,null,null,0,{"$f":"MIN(Q$26-SUM(O$9:O19),N20)","v":0},{"$f":"IF(ISERROR(SEARCH(Data!F16,R20)),IF(ISERROR(SEARCH(Data!G16,R20)),0,SEARCH(Data!G16,R20)),SEARCH(Data!F16,R20))","v":0},0,""]
[null,"Tueuse",0,{"$f":"Data!C17*$N21","v":0},{"$f":"Data!D17*$N21","v":0},{"$f":"Data!E17*$N21","v":0},null,null,null,null,null,null,null,0,{"$f":"MIN(Q$26-SUM(O$9:O20),N21)","v":0},{"$f":"IF(ISERROR(SEARCH(Data!F17,R21)),IF(ISERROR(SEARCH(Data!G17,R21)),0,SEARCH(Data!G17,R21)),SEARCH(Data!F17,R21))","v":0},0,""]
[null,"Tueuse d'élite",0,{"$f":"Data!C18*$N22","v":0},{"$f":"Data!D18*$N22","v":0},{"$f":"Data!E18*$N22","v":0},null,null,"Titre ou résultat de calcul",null,null,null,null,0,{"$f":"MIN(Q$26-SUM(O$9:O21),N22)","v":0},{"$f":"IF(ISERROR(SEARCH(Data!F18,R22)),IF(ISERROR(SEARCH(Data!G18,R22)),0,SEARCH(Data!G18,R22)),SEARCH(Data!F18,R22))","v":0},0,""]
[null,"TOTAUX :",{"$f":"SUM(N9:N22)","v":85239323},{"$f":"SUM(D9:D22)","v":345716773},{"$f":"SUM(E9:E22)","v":329496325},{"$f":"SUM(F9:F22)","v":889931508}]
[null,null,null,null,null,null,null,null,null,null,null,null,null,null,null,null,"Valeur","Extraction du texte"]
[null,null,null,null,null,null,null,null,null,null,null,null,null,null,null,"Dégâts sonde :",{"$f":"VALUE(SUBSTITUTE(MID(R25,1,(SEARCH(\"(\",R25)-1)),\" \",\"\")+VALUE(SUBSTITUTE(MID(R25,(SEARCH(\"(\",R25)+2),((SEARCH(\")\",R25)-SEARCH(\"(\",R25))-2)),\" \",\"\")))","v":9600},{"$f":"MID(B4,(SEARCH(\"Vous infligez\",B4)+14),((SEARCH(\"dégâts\",B4)-SEARCH(\"Vous infligez\",B4))-14))","v":"3 000(+6 600) "}]
[null,"Multiplicateur vie ennemi : ",null,{"$f":"ROUND(((Q25/SUMPRODUCT(O9:O22,Data!E5:E18))*20),0)/20","v":3.85},"Vie HB x 3 : ",null,{"$f":"F23*3","v":2669794524},null,null,null,null,null,null,null,null,"Pertes ennemi :",{"$f":"R26","v":311},{"$f":"VALUE(SUBSTITUTE(MID(B4,(SEARCH(\"dégâts\",B4)+14),((SEARCH(\"ennemies.\",B4)-SEARCH(\"dégâts\",B4))-14)),\" \",\"\"))","v":311}]
[null,{"$f":"CONCATENATE(\"(\",MID(MID(B4,(SEARCH(\"Vous attaquez\",B4)+14),100),1,(SEARCH(\"de\",MID(B4,(SEARCH(\"Vous attaquez\",B4)+14),100))-2)),\")    \")","v":"(la fourmilière)    "},null,null,"Vie AB lieu de la sonde : ",null,{"$f":"F23*D26","v":3426236305.8000002}]
[null,null,null,"FdF AB nécessaire pour réplique 10% : ",null,null,{"$f":"MAX(G26:H27)","v":3426236305.8000002},null,null,null,null,null,null,null,null,null,"Valeur","Extraction du texte"]
[null,null,null,null,null,null,null,null,null,null,null,null,null,null,null,"Dégâts def AB :",{"$f":"VALUE(SUBSTITUTE(MID(R29,1,(SEARCH(\"(\",R29)-1)),\" \",\"\")) + VALUE(SUBSTITUTE(MID(R29,(SEARCH(\"(\",R29)+2),((SEARCH(\")\",R29)-SEARCH(\"(\",R29))-2)),\" \",\"\"))","v":988488975},{"$f":"MID(B4,(SEARCH(\" inflige \",B4)+9),((SEARCH(\"dégâts à vos\",B4)-SEARCH(\" inflige \",B4))-10))","v":"329 496 325(+658 992 650)"}]
[null,"Armes de l'ennemi : ",null,{"$f":"ROUND((((Q29-Q30)/Q30)*10),0)","v":20},null,"Défense AB : ",{"$f":"E23*(1+(D30/10))","v":988488975},null,null,null,null,null,null,null,null,"Dégâts def HB :",{"$f":"VALUE(SUBSTITUTE(MID(R29,1,(SEARCH(\"(\",R29)-1)),\" \",\"\"))","v":329496325}]
[null,null,null,null,null,"Réplique 10% : ",{"$f":"G30/10","v":98848897.5}]
[]
[]
[null,"Calcul attaque à lancer :"]
[]
[null,"Mon niveau Armes :",22,null,null,null,"Nb unité à ajouter pour compléter la FdF nécessaire"]
[null,"Mon niveau Bouclier :",22]
[]
[null,"Type d'unité","Nb unité envoyées",null,"Att AB"]
[null,"Jeune Soldate Naine",4000000,null,{"$f":"(Data!C5*$C40)*(1+(C$36/10))","v":38400000},null,{"$f":"IF((H$45>E$54),((H$45-E$54)/(Data!C5*(1+('Auto sur sonde'!C$36/10)))),\"FdF suffisante\")","v":"FdF suffisante"},"JSN nécessaires en cas de réplique à 10% :"]
[null,"Soldate Naine",null,null,{"$f":"(Data!C6*$C41)*(1+(C$36/10))","v":0},null,{"$f":"IF((H$45>E$54),((H$45-E$54)/(Data!C6*(1+('Auto sur sonde'!C$36/10)))),\"FdF suffisante\")","v":"FdF suffisante"},{"$f":"ROUNDUP((G31/(Data!E5*(1+(C37/10)))),0)","v":3861286},null,null,{"$f":"IF((C40>H41),\"OK\",\"Alerte !\")","v":"OK"}]
[null,"Naine d'Elite",null,null,{"$f":"(Data!C7*$C42)*(1+(C$36/10))","v":0},null,{"$f":"IF((H$45>E$54),((H$45-E$54)/(Data!C7*(1+('Auto sur sonde'!C$36/10)))),\"FdF suffisante\")","v":"FdF suffisante"}]
[null,"Jeune Soldate",null,null,{"$f":"(Data!C8*$C43)*(1+(C$36/10))","v":0},null,{"$f":"IF((H$45>E$54),((H$45-E$54)/(Data!C8*(1+('Auto sur sonde'!C$36/10)))),\"FdF suffisante\")","v":"FdF suffisante"}]
[null,"Soldate",31000000,null,{"$f":"(Data!C9*$C44)*(1+(C$36/10))","v":1488000000},null,{"$f":"IF((H$45>E$54),((H$45-E$54)/(Data!C9*(1+('Auto sur sonde'!C$36/10)))),\"FdF suffisante\")","v":"FdF suffisante"},"FdF AB nécessaire pour réplique 10% :"]
[null,"Concierge",null,null,{"$f":"(Data!C10*$C45)*(1+(C$36/10))","v":0},null,{"$f":"IF((H$45>E$54),((H$45-E$54)/(Data!C10*(1+('Auto sur sonde'!C$36/10)))),\"FdF suffisante\")","v":"FdF suffisante"},{"$f":"G28","v":3426236305.8000002},null,null,{"$f":"IF((E54>H45),\"OK\",\"Alerte !\")","v":"OK"}]
[null,"Concierge d'élite",null,null,{"$f":"(Data!C11*$C46)*(1+(C$36/10))","v":0},null,{"$f":"IF((H$45>E$54),((H$45-E$54)/(Data!C11*(1+('Auto sur sonde'!C$36/10)))),\"FdF suffisante\")","v":"FdF suffisante"}]
[null,"Artilleuse",null,null,{"$f":"(Data!C12*$C47)*(1+(C$36/10))","v":0},null,{"$f":"IF((H$45>E$54),((H$45-E$54)/(Data!C12*(1+('Auto sur sonde'!C$36/10)))),\"FdF suffisante\")","v":"FdF suffisante"}]
[null,"Artilleuse d'élite",null,null,{"$f":"(Data!C13*$C48)*(1+(C$36/10))","v":0},null,{"$f":"IF((H$45>E$54),((H$45-E$54)/(Data!C13*(1+('Auto sur sonde'!C$36/10)))),\"FdF suffisante\")","v":"FdF suffisante"}]
[null,"Soldate d'élite",null,null,{"$f":"(Data!C14*$C49)*(1+(C$36/10))","v":0},null,{"$f":"IF((H$45>E$54),((H$45-E$54)/(Data!C14*(1+('Auto sur sonde'!C$36/10)))),\"FdF suffisante\")","v":"FdF suffisante"}]
[null,"Tank",11000000,null,{"$f":"(Data!C15*$C50)*(1+(C$36/10))","v":1936000000},null,{"$f":"IF((H$45>E$54),((H$45-E$54)/(Data!C15*(1+('Auto sur sonde'!C$36/10)))),\"FdF suffisante\")","v":"FdF suffisante"}]
[null,"Tank d'élite",null,null,{"$f":"(Data!C16*$C51)*(1+(C$36/10))","v":0},null,{"$f":"IF((H$45>E$54),((H$45-E$54)/(Data!C16*(1+('Auto sur sonde'!C$36/10)))),\"FdF suffisante\")","v":"FdF suffisante"}]
[null,"Tueuse",null,null,{"$f":"(Data!C17*$C52)*(1+(C$36/10))","v":0},null,{"$f":"IF((H$45>E$54),((H$45-E$54)/(Data!C17*(1+('Auto sur sonde'!C$36/10)))),\"FdF suffisante\")","v":"FdF suffisante"}]
[null,"Tueuse d'élite",null,null,{"$f":"(Data!C18*$C53)*(1+(C$36/10))","v":0},null,{"$f":"IF((H$45>E$54),((H$45-E$54)/(Data!C18*(1+('Auto sur sonde'!C$36/10)))),\"FdF suffisante\")","v":"FdF suffisante"}]
[null,"TOTAUX :",{"$f":"SUM(C40:C53)","v":46000000},null,{"$f":"SUM(E40:E53)","v":3462400000}]

{"sheet":"Manuel","index":2,"n_rows":57,"n_cols":17,"rows_kept":57,"cut":false,"hidden":false,"merged":[[27,4,27,5],[56,2,56,3],[56,4,56,5],[30,6,30,7],[26,8,26,9],[27,8,27,9],[53,2,53,3],[53,4,53,5],[55,2,55,3],[55,4,55,5],[24,8,24,11],[26,10,26,11],[27,6,27,7],[28,4,28,7],[25,8,25,11],[52,2,52,3],[52,4,52,5],[48,2,48,3],[48,4,48,5],[46,4,46,5],[54,2,54,3],[54,4,54,5],[49,2,49,3],[49,4,49,5],[50,2,50,3],[50,4,50,5],[51,2,51,3],[51,4,51,5],[47,2,47,3],[47,4,47,5],[46,9,46,11],[45,9,45,12],[46,2,46,3],[45,2,45,3],[45,4,45,5],[43,9,43,12],[43,2,43,3],[43,4,43,5],[44,9,44,11],[41,2,41,3],[41,4,41,5],[42,2,42,3],[42,4,42,5],[44,2,44,3],[44,4,44,5],[29,1,29,2],[28,1,28,2],[24,4,24,5],[32,1,32,2],[29,6,29,7],[26,4,26,5],[26,6,26,7],[26,1,26,2],[25,1,25,2],[24,1,24,2],[5,14,5,16],[24,6,24,7],[12,8,12,12],[13,8,13,12],[19,8,19,10],[16,11,16,12],[11,8,11,12],[16,8,16,10],[17,8,17,10],[15,8,15,9],[10,8,10,12],[9,8,9,12],[1,1,1,4],[4,1,4,11],[5,1,5,4],[8,8,8,11],[3,1,3,11],[7,8,7,11],[0,1,0,11],[50,9,50,11],[51,9,51,12],[52,9,52,11],[38,6,40,7],[14,8,14,9],[42,9,42,12],[48,9,48,12],[49,9,49,12],[18,8,18,10],[27,10,27,11],[7,16,7,20],[8,16,8,20],[9,16,9,20],[10,16,10,20],[11,16,11,20],[12,16,12,20],[19,16,19,20],[20,16,20,20],[21,16,21,20],[13,16,13,20],[14,16,14,20],[15,16,15,20],[16,16,16,20],[17,16,17,20],[18,16,18,20]]}
[null,"Petit tableur pour calculer une opti d'Xp..."]
[null,"Import d'armée :"]
[]
[null,"76 238 411 Jeunes Soldates Naines, 157 Soldates Naines, 7 000 755 Concierges, 2 000 000 Tanks."]
[null,"Supprimez le contenu de la cellule, puis copier une armée, unités séparées par des virgules ou points."]
[null,"Ennemi :",null,null,null,null,null,null,null,null,null,null,null,null,"Extraction des données armée :"]
[]
[null,"Type d'unité","Nb unité","Nb unité","Att HB","Def HB","Vie HB",null,"Mode d'emploi :",null,null,null,null,null,"Position","Suivant","Texte à Analyser"]
[null,"Jeune Soldate Naine",76238100,{"$f":"IF(C9=0,IF((O9>0),VALUE(SUBSTITUTE(MID(Q9,1,(O9-1)),\" \",\"\")),0),C9)","v":76238100},{"$f":"Data!C5*$D9","v":228714300},{"$f":"Data!D5*$D9","v":152476200},{"$f":"Data!E5*$D9","v":609904800},null,null,null,null,null,null,null,{"$f":"IF(ISERROR(SEARCH(Data!F5,Q9)),IF(ISERROR(SEARCH(Data!G5,Q9)),0,SEARCH(Data!G5,Q9)),SEARCH(Data!F5,Q9))","v":12},{"$f":"IF(ISERROR(SEARCH(\",\",Q9,O9)),IF(ISERROR(SEARCH(\".\",Q9,O9)),0,(SEARCH(\".\",Q9,O9)+2)),(SEARCH(\",\",Q9,O9)+2))","v":36},{"$f":"B4","v":"76 238 411 Jeunes Soldates Naines, 157 Soldates Naines, 7 000 755 Concierges, 2 000 000 Tanks."}]
[null,"Soldate Naine",null,{"$f":"IF(C10=0,IF((O10>0),VALUE(SUBSTITUTE(MID(Q10,1,(O10-1)),\" \",\"\")),0),C10)","v":157},{"$f":"Data!C6*$D10","v":785},{"$f":"Data!D6*$D10","v":628},{"$f":"Data!E6*$D10","v":1570},null,"1/ Copier l'armée ou remplir le nombre d'unité",null,null,null,null,null,{"$f":"IF(ISERROR(SEARCH(Data!F6,Q10)),IF(ISERROR(SEARCH(Data!G6,Q10)),0,SEARCH(Data!G6,Q10)),SEARCH(Data!F6,Q10))","v":5},22,{"$f":"IF(((O9+P9)>0),MID(Q9,P9,5000),Q9)","v":"157 Soldates Naines, 7 000 755 Concierges, 2 000 000 Tanks."}]
[null,"Naine d'Elite",null,0,{"$f":"Data!C7*$D11","v":0},{"$f":"Data!D7*$D11","v":0},{"$f":"Data!E7*$D11","v":0},null,"    (les valeurs saisies ont la priorité sur les valeurs importées).",null,null,null,null,null,{"$f":"IF(ISERROR(SEARCH(Data!F7,Q11)),IF(ISERROR(SEARCH(Data!G7,Q11)),0,SEARCH(Data!G7,Q11)),SEARCH(Data!F7,Q11))","v":0},0,"7 000 755 Concierges, 2 000 000 Tanks."]
[null,"Jeune Soldate",null,0,{"$f":"Data!C8*$D12","v":0},{"$f":"Data!D8*$D12","v":0},{"$f":"Data!E8*$D12","v":0},null,"2/ Saisir armes, bouclier dome ou loge de l'ennemi",null,null,null,null,null,{"$f":"IF(ISERROR(SEARCH(Data!F8,Q12)),IF(ISERROR(SEARCH(Data!G8,Q12)),0,SEARCH(Data!G8,Q12)),SEARCH(Data!F8,Q12))","v":0},0,"7 000 755 Concierges, 2 000 000 Tanks."]
[null,"Soldate",null,0,{"$f":"Data!C9*$D13","v":0},{"$f":"Data!D9*$D13","v":0},{"$f":"Data!E9*$D13","v":0},null,"3/ Saisir vos niveaux d'arme et bouclier",null,null,null,null,null,{"$f":"IF(ISERROR(SEARCH(Data!F9,Q13)),IF(ISERROR(SEARCH(Data!G9,Q13)),0,SEARCH(Data!G9,Q13)),SEARCH(Data!F9,Q13))","v":0},0,"7 000 755 Concierges, 2 000 000 Tanks."]
[null,"Concierge",null,7000755,{"$f":"Data!C10*$D14","v":7000755},{"$f":"Data!D10*$D14","v":175018875},{"$f":"Data!E10*$D14","v":210022650},null,"4/ Saisir vos unité à envoyer",null,null,null,null,null,{"$f":"IF(ISERROR(SEARCH(Data!F10,Q14)),IF(ISERROR(SEARCH(Data!G10,Q14)),0,SEARCH(Data!G10,Q14)),SEARCH(Data!F10,Q14))","v":11},23,"7 000 755 Concierges, 2 000 000 Tanks."]
[null,"Concierge d'élite",null,0,{"$f":"Data!C11*$D15","v":0},{"$f":"Data!D11*$D15","v":0},{"$f":"Data!E11*$D15","v":0},null,null,null,null,null,null,null,{"$f":"IF(ISERROR(SEARCH(Data!F11,Q15)),IF(ISERROR(SEARCH(Data!G11,Q15)),0,SEARCH(Data!G11,Q15)),SEARCH(Data!F11,Q15))","v":0},0,"2 000 000 Tanks."]
[null,"Artilleuse",null,0,{"$f":"Data!C12*$D16","v":0},{"$f":"Data!D12*$D16","v":0},{"$f":"Data!E12*$D16","v":0},null,"Légende :",null,null,null,null,null,{"$f":"IF(ISERROR(SEARCH(Data!F12,Q16)),IF(ISERROR(SEARCH(Data!G12,Q16)),0,SEARCH(Data!G12,Q16)),SEARCH(Data!F12,Q16))","v":0},0,"2 000 000 Tanks."]
[null,"Artilleuse d'élite",null,0,{"$f":"Data!C13*$D17","v":0},{"$f":"Data!D13*$D17","v":0},{"$f":"Data!E13*$D17","v":0},null,"cellule à renseigner",null,null," (les seules à modifier)",null,null,{"$f":"IF(ISERROR(SEARCH(Data!F13,Q17)),IF(ISERROR(SEARCH(Data!G13,Q17)),0,SEARCH(Data!G13,Q17)),SEARCH(Data!F13,Q17))","v":0},0,"2 000 000 Tanks."]
[null,"Soldate d'élite",null,0,{"$f":"Data!C14*$D18","v":0},{"$f":"Data!D14*$D18","v":0},{"$f":"Data!E14*$D18","v":0},null,"résultat de calcul",null,null,null,null,null,{"$f":"IF(ISERROR(SEARCH(Data!F14,Q18)),IF(ISERROR(SEARCH(Data!G14,Q18)),0,SEARCH(Data!G14,Q18)),SEARCH(Data!F14,Q18))","v":0},0,"2 000 000 Tanks."]
[null,"Tank",null,2000000,{"$f":"Data!C15*$D19","v":110000000},{"$f":"Data!D15*$D19","v":2000000},{"$f":"Data!E15*$D19","v":70000000},null,"Titre",null,null,null,null,null,{"$f":"IF(ISERROR(SEARCH(Data!F15,Q19)),IF(ISERROR(SEARCH(Data!G15,Q19)),0,SEARCH(Data!G15,Q19)),SEARCH(Data!F15,Q19))","v":11},18,"2 000 000 Tanks."]
[null,"Tank d'élite",null,0,{"$f":"Data!C16*$D20","v":0},{"$f":"Data!D16*$D20","v":0},{"$f":"Data!E16*$D20","v":0},null,"Titre ou résultat de calcul",null,null,null,null,null,{"$f":"IF(ISERROR(SEARCH(Data!F16,Q20)),IF(ISERROR(SEARCH(Data!G16,Q20)),0,SEARCH(Data!G16,Q20)),SEARCH(Data!F16,Q20))","v":0},0,""]
[null,"Tueuse",null,0,{"$f":"Data!C17*$D21","v":0},{"$f":"Data!D17*$D21","v":0},{"$f":"Data!E17*$D21","v":0},null,null,null,null,null,null,null,{"$f":"IF(ISERROR(SEARCH(Data!F17,Q21)),IF(ISERROR(SEARCH(Data!G17,Q21)),0,SEARCH(Data!G17,Q21)),SEARCH(Data!F17,Q21))","v":0},0,""]
[null,"Tueuse d'élite",null,0,{"$f":"Data!C18*$D22","v":0},{"$f":"Data!D18*$D22","v":0},{"$f":"Data!E18*$D22","v":0},null,null,null,null,null,null,null,{"$f":"IF(ISERROR(SEARCH(Data!F18,Q22)),IF(ISERROR(SEARCH(Data!G18,Q22)),0,SEARCH(Data!G18,Q22)),SEARCH(Data!F18,Q22))","v":0},0,""]
[null,"TOTAUX :",{"$f":"SUM(C9:C22)","v":76238100},{"$f":"SUM(D9:D22)","v":85239012},{"$f":"SUM(E9:E22)","v":345715840},{"$f":"SUM(F9:F22)","v":329495703},{"$f":"SUM(G9:G22)","v":889929020}]
[]
[null,"Armes : ",null,20,"Vie HB x 3 : ",null,{"$f":"G23*3","v":2669787060},null,"FdF AB nécessaire pour une réplique à 10%"]
[null,"Bouclier : ",null,20]
[null,"Dôme : ",null,15,"Vie AB Dome : ",null,{"$f":"G23*D29","v":3426226727},null,"En dôme : ",null,{"$f":"MAX(G25,G27)","v":3426226727}]
[null,null,"Loge : ",18,"Vie AB Loge : ",null,{"$f":"G23*D30","v":5339574120},null,"En loge : ",null,{"$f":"MAX(G25,G28)","v":5339574120}]
[null,"Multiplicateur vie Dome : ",null,{"$f":"1+D26/10+0.1+0.05*D27","v":3.85}]
[null,"Multiplicateur vie Loge : ",null,{"$f":"1+D26/10+0.3+0.15*D28","v":6},null,"Défense AB : ",{"$f":"F23*(1+D25/10)","v":988487109}]
[null,null,null,"FdF AB nécessaire pour réplique 10% : ",null,"Réplique 10% : ",{"$f":"G30/10","v":98848710.900000006}]
[]
[]
[]
[]
[]
[null,"Calcul attaque à lancer :"]
[]
[null,"Mon niveau Armes :",22,null,null,null,"Nb unité à ajouter pour compléter la FdF nécessaire"]
[null,"Mon niveau Bouclier :",22]
[]
[null,"Type d'unité","Nb unité envoyées",null,"Att AB",null,"Dôme","Loge"]
[null,"Jeune Soldate Naine",4000000,null,{"$f":"(Data!C5*$C43)*(1+(C$39/10))","v":38400000},null,{"$f":"IF((J$47>E$57),((J$47-E$57)/(Data!C5*(1+(Manuel!C$39/10)))),\"FdF suffisante\")","v":"FdF suffisante"},{"$f":"IF((J$53>E$57),((J$53-E$57)/(Data!C5*(1+(C$39/10)))),\"FdF suffisante\")","v":195538970.83333331},null,"Dôme"]
[null,"Soldate Naine",null,null,{"$f":"(Data!C6*$C44)*(1+(C$39/10))","v":0},null,{"$f":"IF((J$47>E$57),((J$47-E$57)/(Data!C6*(1+(Manuel!C$39/10)))),\"FdF suffisante\")","v":"FdF suffisante"},{"$f":"IF((J$53>E$57),((J$53-E$57)/(Data!C6*(1+(C$39/10)))),\"FdF suffisante\")","v":117323382.5},null,"JSN nécessaires en cas de réplique à 10% :"]
[null,"Naine d'Elite",null,null,{"$f":"(Data!C7*$C45)*(1+(C$39/10))","v":0},null,{"$f":"IF((J$47>E$57),((J$47-E$57)/(Data!C7*(1+(Manuel!C$39/10)))),\"FdF suffisante\")","v":"FdF suffisante"},{"$f":"IF((J$53>E$57),((J$53-E$57)/(Data!C7*(1+(C$39/10)))),\"FdF suffisante\")","v":83802416.071428567},null,{"$f":"ROUNDUP((G31/(Data!E5*(1+(C40/10)))),0)","v":3861278},null,null,{"$f":"IF((C43>J45),\"OK\",\"Alerte !\")","v":"OK"}]
[null,"Jeune Soldate",null,null,{"$f":"(Data!C8*$C46)*(1+(C$39/10))","v":0},null,{"$f":"IF((J$47>E$57),((J$47-E$57)/(Data!C8*(1+(Manuel!C$39/10)))),\"FdF suffisante\")","v":"FdF suffisante"},{"$f":"IF((J$53>E$57),((J$53-E$57)/(Data!C8*(1+(C$39/10)))),\"FdF suffisante\")","v":58661691.25},null,"FdF AB nécessaire pour réplique 10% :"]
[null,"Soldate",31000000,null,{"$f":"(Data!C9*$C47)*(1+(C$39/10))","v":1488000000},null,{"$f":"IF((J$47>E$57),((J$47-E$57)/(Data!C9*(1+(Manuel!C$39/10)))),\"FdF suffisante\")","v":"FdF suffisante"},{"$f":"IF((J$53>E$57),((J$53-E$57)/(Data!C9*(1+(C$39/10)))),\"FdF suffisante\")","v":39107794.166666664},null,{"$f":"K27","v":3426226727},null,null,{"$f":"IF((E57>J47),\"OK\",\"Alerte !\")","v":"OK"}]
[null,"Concierge",null,null,{"$f":"(Data!C10*$C48)*(1+(C$39/10))","v":0},null,{"$f":"IF((J$47>E$57),((J$47-E$57)/(Data!C10*(1+(Manuel!C$39/10)))),\"FdF suffisante\")","v":"FdF suffisante"},{"$f":"IF((J$53>E$57),((J$53-E$57)/(Data!C10*(1+(C$39/10)))),\"FdF suffisante\")","v":586616912.5}]
[null,"Concierge d'élite",null,null,{"$f":"(Data!C11*$C49)*(1+(C$39/10))","v":0},null,{"$f":"IF((J$47>E$57),((J$47-E$57)/(Data!C11*(1+(Manuel!C$39/10)))),\"FdF suffisante\")","v":"FdF suffisante"},{"$f":"IF((J$53>E$57),((J$53-E$57)/(Data!C11*(1+(C$39/10)))),\"FdF suffisante\")","v":586616912.5},null,"Loge"]
[null,"Artilleuse",null,null,{"$f":"(Data!C12*$C50)*(1+(C$39/10))","v":0},null,{"$f":"IF((J$47>E$57),((J$47-E$57)/(Data!C12*(1+(Manuel!C$39/10)))),\"FdF suffisante\")","v":"FdF suffisante"},{"$f":"IF((J$53>E$57),((J$53-E$57)/(Data!C12*(1+(C$39/10)))),\"FdF suffisante\")","v":19553897.083333332},null,"JSN nécessaires en cas de réplique à 10% :"]
[null,"Artilleuse d'élite",null,null,{"$f":"(Data!C13*$C51)*(1+(C$39/10))","v":0},null,{"$f":"IF((J$47>E$57),((J$47-E$57)/(Data!C13*(1+(Manuel!C$39/10)))),\"FdF suffisante\")","v":"FdF suffisante"},{"$f":"IF((J$53>E$57),((J$53-E$57)/(Data!C13*(1+(C$39/10)))),\"FdF suffisante\")","v":16760483.214285715},null,{"$f":"ROUNDUP((G31/(Data!E5*(1+(C40/10)))),0)","v":3861278},null,null,{"$f":"IF((C43>J51),\"OK\",\"Alerte !\")","v":"OK"}]
[null,"Soldate d'élite",null,null,{"$f":"(Data!C14*$C52)*(1+(C$39/10))","v":0},null,{"$f":"IF((J$47>E$57),((J$47-E$57)/(Data!C14*(1+(Manuel!C$39/10)))),\"FdF suffisante\")","v":"FdF suffisante"},{"$f":"IF((J$53>E$57),((J$53-E$57)/(Data!C14*(1+(C$39/10)))),\"FdF suffisante\")","v":24442371.354166664},null,"FdF AB nécessaire pour réplique 10% :"]
[null,"Tank",11000000,null,{"$f":"(Data!C15*$C53)*(1+(C$39/10))","v":1936000000},null,{"$f":"IF((J$47>E$57),((J$47-E$57)/(Data!C15*(1+(Manuel!C$39/10)))),\"FdF suffisante\")","v":"FdF suffisante"},{"$f":"IF((J$53>E$57),((J$53-E$57)/(Data!C15*(1+(C$39/10)))),\"FdF suffisante\")","v":10665762.045454545},null,{"$f":"K28","v":5339574120},null,null,{"$f":"IF((E65>J53),\"OK\",\"Alerte !\")","v":"Alerte !"}]
[null,"Tank d'élite",null,null,{"$f":"(Data!C16*$C54)*(1+(C$39/10))","v":0},null,{"$f":"IF((J$47>E$57),((J$47-E$57)/(Data!C16*(1+(Manuel!C$39/10)))),\"FdF suffisante\")","v":"FdF suffisante"},{"$f":"IF((J$53>E$57),((J$53-E$57)/(Data!C16*(1+(C$39/10)))),\"FdF suffisante\")","v":7332711.40625}]
[null,"Tueuse",null,null,{"$f":"(Data!C17*$C55)*(1+(C$39/10))","v":0},null,{"$f":"IF((J$47>E$57),((J$47-E$57)/(Data!C17*(1+(Manuel!C$39/10)))),\"FdF suffisante\")","v":"FdF suffisante"},{"$f":"IF((J$53>E$57),((J$53-E$57)/(Data!C17*(1+(C$39/10)))),\"FdF suffisante\")","v":11732338.25}]
[null,"Tueuse d'élite",null,null,{"$f":"(Data!C18*$C56)*(1+(C$39/10))","v":0},null,{"$f":"IF((J$47>E$57),((J$47-E$57)/(Data!C18*(1+(Manuel!C$39/10)))),\"FdF suffisante\")","v":"FdF suffisante"},{"$f":"IF((J$53>E$57),((J$53-E$57)/(Data!C18*(1+(C$39/10)))),\"FdF suffisante\")","v":10665762.045454545}]
[null,"TOTAUX :",{"$f":"SUM(C43:C56)","v":46000000},null,{"$f":"SUM(E43:E56)","v":3462400000}]

{"sheet":"Multiplicateurs vie","index":3,"n_rows":116,"n_cols":53,"rows_kept":116,"cut":false,"hidden":false,"merged":[[9,2,9,52],[63,2,63,52],[0,1,0,20],[1,1,1,4],[1,5,1,8],[4,1,4,2],[1,9,1,26],[3,1,3,2],[6,1,6,2],[7,1,7,2]]}
[null,"Combinaisons bouclier/dôme et bouclier/loge (plus bas dans la page) => multiplicateur de vie"]
[null,"Multiplicateur :",null,null,null,2.5,null,null,null," Saisissez ici le multiplicateur de vie trouvé sur une sonde pour voir les combinaison bouclier/dôme ou bouclier/loge possibles\n (selon le lieu de la sonde)."]
[]
[null,"Bouclier :",null,{"$f":"ROUND(($F$2-1-0.1-D5*0.05)*100,0)/10","v":14},{"$f":"D4-1","v":13},{"$f":"E4-1","v":12},11,10,9,8,7,6,5,4,3,2,1,0,-1,-2,-3,-4,-5,-6,-7,-8,-9,-10,-11,-12,-13,-14,-15,-16,-17,-18,-19,-20,-21,-22,-23,-24,-25,-26,-27,-28,-29,-30,-31,-32,-33,-34,-35]
[null,"Dôme :",null,{"$f":"IF(ROUND($F$2*10,0)/10=$F$2,0,1)","v":0},{"$f":"($F$2-1-0.1*E4-0.1)/0.05","v":1.9999999999999989},3.999999999999996,5.9999999999999982,8,10,11.999999999999998,13.999999999999998,15.999999999999998,18,20,21.999999999999996,23.999999999999996,25.999999999999996,27.999999999999996,30,31.999999999999996,34,35.999999999999993,37.999999999999993,40,42,43.999999999999993,45.999999999999993,47.999999999999993,50,52,53.999999999999993,56,57.999999999999993,60,62,63.999999999999993,{"$f":"($F$2-1-0.1*AK4-0.1)/0.05","v":66},68,70,72,74,76,78,79.999999999999986,82,84.000000000000014,86.000000000000014,88,90,92,94.000000000000014,96.000000000000014,98]
[]
[null,"Bouclier :",null,{"$f":"ROUND(($F$2-1-0.3-D8*0.15)*100,0)/10","v":12},{"$f":"D7-3","v":9},{"$f":"E7-3","v":6},3,0,-3,-6,-9,-12,-15,-18,-21,-24,-27,-30,-33,-36,-39,-42,-45,-48,-51,-54,-57,-60,-63,-66,-69,-72,-75,-78,-81,-84,-87,-90,-93,-96,-99,-102,-105,-108,-111,-114,-117,-120,-123,-126,-129,-132,-135]
[null,"Loge :",null,{"$f":"IF(ROUND($F$2*10,0)/10=$F$2,0,1)","v":0},{"$f":"($F$2-1-0.1*E7-0.3)/0.15","v":2},{"$f":"($F$2-1-0.1*F7-0.3)/0.15","v":3.9999999999999991},6,8,10,12,14.000000000000002,16.000000000000004,18.000000000000004,20,22.000000000000004,24.000000000000004,26.000000000000004,28.000000000000004,30.000000000000007,32,34.000000000000007,36.000000000000007,38,40.000000000000007,42.000000000000007,44.000000000000007,46.000000000000007,48,50.000000000000007,52.000000000000014,54,55.999999999999993,58,60,61.999999999999993,64,66,68,70,72.000000000000014,74,76,78,80,82.000000000000014,84,86,88,90,92.000000000000014,94,96,98]
[]
[null,null,"Dôme"]
[null,"Bouclier",0,1,2,3,4,5,6,7,8,9,10,11,12,13,14,15,16,17,18,19,20,21,22,23,24,25,26,27,28,29,30,31,32,33,34,35,36,37,38,39,40,41,42,43,44,45,46,47,48,49,50]
[null,0,{"$f":"1+$B12*0.1+0.1+C$11*0.05","v":1.1000000000000001},{"$f":"1+$B12*0.1+0.1+D$11*0.05","v":1.1500000000000001},1.2000000000000002,1.25,1.3,1.35,1.4000000000000001,1.4500000000000002,1.5,1.55,1.6,1.6500000000000001,1.7000000000000002,1.75,1.8000000000000003,1.85,1.9000000000000001,1.9500000000000002,2,2.0500000000000003,2.1,2.1500000000000004,2.2000000000000002,2.25,2.3000000000000003,2.35,2.4000000000000004,2.4500000000000002,2.5,2.5500000000000003,2.6,2.6500000000000004,2.7,2.75,2.8000000000000003,2.85,2.9000000000000004,2.95,3,3.0500000000000003,3.1,3.1500000000000004,3.2,3.25,3.3000000000000003,3.35,3.4000000000000004,3.45,3.5000000000000004,3.5500000000000003,{"$f":"1+$B12*0.1+0.1+BA$11*0.05","v":3.6}]
[null,1,1.2000000000000002,{"$f":"1+$B13*0.1+0.1+D$11*0.05","v":1.2500000000000002},1.3000000000000003,1.35,1.4000000000000001,1.4500000000000002,1.5000000000000002,1.5500000000000003,1.6,1.6500000000000001,1.7000000000000002,1.7500000000000002,1.8000000000000003,1.85,1.9000000000000004,1.9500000000000002,2,2.0500000000000003,2.1,2.1500000000000004,2.2000000000000002,2.25,2.3000000000000003,2.3500000000000005,2.4000000000000004,2.4500000000000002,2.5,2.5500000000000003,2.6000000000000005,2.6500000000000004,2.7,2.75,2.8000000000000003,2.8500000000000005,2.9000000000000004,2.95,3,3.0500000000000003,3.1000000000000005,3.1500000000000004,3.2,3.2500000000000004,3.3000000000000003,3.35,3.4000000000000004,3.45,3.5000000000000004,3.5500000000000003,3.6000000000000005,3.6500000000000004,3.7]
[null,2,1.3,1.35,1.4000000000000001,1.4500000000000002,1.5,1.55,1.6,1.6500000000000001,1.7000000000000002,1.75,1.8,1.85,1.9000000000000001,1.9500000000000002,2,2.0499999999999998,2.1,2.1500000000000004,2.2000000000000002,2.25,2.2999999999999998,2.35,2.4000000000000004,2.4500000000000002,2.5,2.5499999999999998,2.6,2.6500000000000004,2.7,2.75,2.8,2.85,2.9000000000000004,2.95,3,3.05,3.1,3.1500000000000004,3.2,3.25,3.3,3.3500000000000005,3.4000000000000004,3.45,3.5,3.55,3.6000000000000005,3.6500000000000004,3.7,3.75,3.8]
[null,3,1.4000000000000001,1.4500000000000002,1.5000000000000002,1.5500000000000003,1.6,1.6500000000000001,1.7000000000000002,1.7500000000000002,1.8000000000000003,1.85,1.9000000000000001,1.9500000000000002,2,2.0500000000000003,2.1,2.1500000000000004,2.2000000000000002,2.25,2.3000000000000003,2.35,2.4000000000000004,2.4500000000000002,2.5,2.5500000000000003,2.6000000000000005,2.6500000000000004,2.7,2.75,2.8000000000000003,2.8500000000000005,2.9000000000000004,2.95,3,3.0500000000000003,3.1000000000000005,3.1500000000000004,3.2,3.25,3.3000000000000003,3.3500000000000005,3.4000000000000004,3.45,3.5,3.55,3.6000000000000005,3.6500000000000004,3.7,3.75,3.8000000000000007,3.8500000000000005,3.9000000000000004]
[null,4,1.5,1.55,1.6,1.65,1.7,1.75,1.8,1.85,1.9,1.95,2,2.0499999999999998,2.1,2.15,2.2000000000000002,2.25,2.2999999999999998,2.35,2.4,2.4500000000000002,2.5,2.5499999999999998,2.6,2.6500000000000004,2.7,2.75,2.8,2.85,2.9000000000000004,2.95,3,3.05,3.1,3.1500000000000004,3.2,3.25,3.3,3.35,3.4000000000000004,3.45,3.5,3.5500000000000003,3.6,3.65,3.7,3.75,3.8000000000000003,3.85,3.9000000000000004,3.95,4]
[null,5,1.6,1.6500000000000001,1.7000000000000002,1.75,1.8,1.85,1.9000000000000001,1.9500000000000002,2,2.0500000000000003,2.1,2.1500000000000004,2.2000000000000002,2.25,2.3000000000000003,2.35,2.4000000000000004,2.4500000000000002,2.5,2.5500000000000003,2.6,2.6500000000000004,2.7,2.75,2.8000000000000003,2.85,{"$f":"1+$B17*0.1+0.1+AC$11*0.05","v":2.9000000000000004},2.95,3,3.0500000000000003,3.1,3.1500000000000004,3.2,3.25,3.3000000000000003,3.35,3.4000000000000004,3.45,3.5,3.5500000000000003,3.6,3.6500000000000004,3.7,3.75,3.8000000000000003,3.85,3.9000000000000004,3.95,4,4.0500000000000007,4.0999999999999996]
[null,6,1.7000000000000002,1.7500000000000002,1.8000000000000003,1.85,1.9000000000000001,1.9500000000000002,2,2.0500000000000003,2.1,2.1500000000000004,2.2000000000000002,2.25,2.3000000000000003,2.35,2.4000000000000004,2.4500000000000002,2.5,2.5500000000000003,2.6,2.6500000000000004,2.7,2.75,2.8000000000000003,2.8500000000000005,2.9000000000000004,2.95,3,3.0500000000000003,3.1000000000000005,3.1500000000000004,3.2,3.25,3.3000000000000003,3.3500000000000005,3.4000000000000004,3.45,3.5,3.5500000000000003,3.6000000000000005,3.6500000000000004,3.7,3.7500000000000004,3.8000000000000003,3.85,3.9000000000000004,3.95,4,4.0500000000000007,4.1000000000000005,4.1500000000000004,4.2]
[null,7,1.8000000000000003,1.8500000000000003,1.9000000000000004,1.9500000000000002,2.0000000000000004,2.0500000000000003,2.1000000000000005,2.1500000000000004,2.2000000000000002,2.2500000000000004,2.3000000000000003,2.3500000000000005,2.4000000000000004,2.4500000000000002,2.5000000000000004,2.5500000000000003,2.6000000000000005,2.6500000000000004,2.7,2.7500000000000004,2.8000000000000003,2.8500000000000005,2.9000000000000004,2.95,3.0000000000000004,3.0500000000000003,3.1000000000000005,3.1500000000000004,3.2,3.2500000000000004,3.3000000000000003,3.3500000000000005,3.4000000000000004,3.45,3.5000000000000004,3.5500000000000003,3.6000000000000005,3.6500000000000004,3.7,3.7500000000000004,3.8000000000000003,3.8500000000000005,3.9000000000000004,3.95,4,4.0500000000000007,4.1000000000000005,4.1500000000000004,4.2000000000000011,4.25,4.3000000000000007]
[null,8,1.9000000000000001,1.9500000000000002,2,2.0500000000000003,2.1,2.1500000000000004,2.2000000000000002,2.25,2.3000000000000003,2.35,2.4000000000000004,2.4500000000000002,2.5,2.5500000000000003,2.6,2.6500000000000004,2.7,2.75,2.8000000000000003,2.85,2.9000000000000004,2.95,3,3.0500000000000003,3.1000000000000005,3.1500000000000004,3.2,3.25,3.3000000000000003,3.3500000000000005,3.4000000000000004,3.45,3.5,3.5500000000000003,3.6000000000000005,3.6500000000000004,3.7,3.75,3.8000000000000003,3.8500000000000005,3.9000000000000004,3.95,4,4.05,4.1000000000000005,4.1500000000000004,4.2,4.25,4.3000000000000007,4.3500000000000005,4.4000000000000004]
[null,9,2,2.0499999999999998,2.1,2.15,2.2000000000000002,2.25,2.2999999999999998,2.35,2.4,2.4500000000000002,2.5,2.5499999999999998,2.6,2.65,2.7,2.75,2.8,2.85,2.9,2.95,3,3.05,3.1,3.1500000000000004,3.2,3.25,3.3,3.35,3.4000000000000004,3.45,3.5,3.55,3.6,3.6500000000000004,3.7,3.75,3.8,3.85,3.9000000000000004,3.95,4,4.0500000000000007,4.0999999999999996,4.1500000000000004,4.2,4.25,4.3000000000000007,4.3499999999999996,4.4000000000000004,4.45,4.5]
[null,10,2.1,2.15,2.2000000000000002,2.25,2.3000000000000003,2.35,2.4000000000000004,2.4500000000000002,2.5,2.5500000000000003,2.6,2.6500000000000004,2.7,2.75,2.8000000000000003,2.85,2.9000000000000004,2.95,3,3.0500000000000003,3.1,3.1500000000000004,3.2,3.25,3.3000000000000003,3.35,3.4000000000000004,3.45,3.5,3.5500000000000003,3.6,3.6500000000000004,3.7,3.75,3.8000000000000003,3.85,{"$f":"1+$B22*0.1+0.1+AM$11*0.05","v":3.9000000000000004},3.95,4,4.0500000000000007,4.0999999999999996,4.1500000000000004,4.2,4.25,4.3000000000000007,4.3499999999999996,4.4000000000000004,4.45,4.5,4.5500000000000007,4.5999999999999996]
[null,11,2.2000000000000002,2.25,2.3000000000000003,2.35,2.4000000000000004,2.4500000000000002,2.5,2.5500000000000003,2.6,2.6500000000000004,2.7,2.75,2.8000000000000003,2.85,2.9000000000000004,2.95,3,3.0500000000000003,3.1,3.1500000000000004,3.2,3.25,3.3000000000000003,3.3500000000000005,3.4000000000000004,3.45,3.5,3.5500000000000003,3.6000000000000005,3.6500000000000004,3.7,3.75,3.8000000000000003,3.8500000000000005,3.9000000000000004,3.95,4,4.0500000000000007,4.1000000000000005,4.1500000000000004,4.2,4.25,4.3000000000000007,4.3499999999999996,4.4000000000000004,4.45,4.5,4.5500000000000007,4.6000000000000005,4.6500000000000004,4.7]
[null,12,2.3000000000000003,2.35,2.4000000000000004,2.4500000000000002,2.5000000000000004,2.5500000000000003,2.6000000000000005,2.6500000000000004,2.7,2.7500000000000004,2.8000000000000003,2.8500000000000005,2.9000000000000004,2.95,3.0000000000000004,3.0500000000000003,3.1000000000000005,3.1500000000000004,3.2,3.2500000000000004,3.3000000000000003,3.3500000000000005,3.4000000000000004,3.45,3.5000000000000004,3.5500000000000003,3.6000000000000005,3.6500000000000004,3.7,3.7500000000000004,3.8000000000000003,3.8500000000000005,3.9000000000000004,3.95,4,4.0500000000000007,4.1000000000000005,4.1500000000000004,4.2,4.25,4.3000000000000007,4.3500000000000005,4.4000000000000004,4.45,4.5,4.5500000000000007,4.6000000000000005,4.6500000000000004,4.7000000000000011,4.75,4.8000000000000007]
[null,13,2.4,2.4499999999999997,2.5,2.5499999999999998,2.6,2.65,2.7,2.75,2.8,2.85,2.9,2.95,3,3.05,3.1,3.15,3.2,3.25,3.3,3.35,3.4,3.45,3.5,3.55,3.6,3.65,3.7,3.75,3.8,3.85,3.9,3.95,4,4.05,4.0999999999999996,4.1500000000000004,4.2,4.25,4.3,4.3499999999999996,4.4000000000000004,4.45,4.5,4.55,4.5999999999999996,4.6500000000000004,4.7,4.75,4.8000000000000007,4.8499999999999996,4.9000000000000004]
[null,14,2.5000000000000004,2.5500000000000003,2.6000000000000005,2.6500000000000004,2.7000000000000006,2.7500000000000004,2.8000000000000007,2.8500000000000005,2.9000000000000004,2.9500000000000006,3.0000000000000004,3.0500000000000007,3.1000000000000005,3.1500000000000004,3.2000000000000006,3.2500000000000004,3.3000000000000007,3.3500000000000005,3.4000000000000004,3.4500000000000006,3.5000000000000004,3.5500000000000007,3.6000000000000005,3.6500000000000004,3.7000000000000006,3.7500000000000004,3.8000000000000007,3.8500000000000005,3.9000000000000004,3.9500000000000006,4,4.0500000000000007,4.1000000000000005,4.1500000000000004,4.2000000000000011,4.25,4.3000000000000007,4.3500000000000005,4.4000000000000004,4.4500000000000011,4.5,4.5500000000000007,4.6000000000000005,4.6500000000000004,4.7000000000000011,4.75,4.8000000000000007,4.8500000000000005,4.9000000000000004,4.9500000000000011,5]
[null,15,2.6,2.65,2.7,2.75,2.8000000000000003,2.85,2.9000000000000004,2.95,3,3.0500000000000003,3.1,3.1500000000000004,3.2,3.25,3.3000000000000003,3.35,3.4000000000000004,3.45,3.5,3.5500000000000003,3.6,3.6500000000000004,3.7,3.75,3.8000000000000003,3.85,3.9000000000000004,3.95,4,4.0500000000000007,4.0999999999999996,4.1500000000000004,4.2,4.25,4.3000000000000007,4.3499999999999996,4.4000000000000004,4.45,4.5,4.5500000000000007,4.5999999999999996,4.6500000000000004,4.7,4.75,4.8000000000000007,4.8499999999999996,{"$f":"1+$B27*0.1+0.1+AW$11*0.05","v":4.9000000000000004},4.95,5,5.0500000000000007,5.0999999999999996]
[null,16,2.7,2.75,2.8000000000000003,2.85,2.9000000000000004,2.95,3,3.0500000000000003,3.1,3.1500000000000004,3.2,3.25,3.3000000000000003,3.35,3.4000000000000004,3.45,3.5,3.5500000000000003,3.6,3.6500000000000004,3.7,3.75,3.8000000000000003,3.8500000000000005,3.9000000000000004,3.95,4,4.0500000000000007,4.1000000000000005,4.1500000000000004,4.2,4.25,4.3000000000000007,4.3500000000000005,4.4000000000000004,4.45,4.5,4.5500000000000007,4.6000000000000005,4.6500000000000004,4.7,4.75,4.8000000000000007,4.8499999999999996,4.9000000000000004,4.95,5,5.0500000000000007,5.1000000000000005,5.15,5.2]
[null,17,2.8000000000000003,2.85,2.9000000000000004,2.95,3.0000000000000004,3.0500000000000003,3.1000000000000005,3.1500000000000004,3.2,3.2500000000000004,3.3000000000000003,3.3500000000000005,3.4000000000000004,3.45,3.5000000000000004,3.5500000000000003,3.6000000000000005,3.6500000000000004,3.7,3.7500000000000004,3.8000000000000003,3.8500000000000005,3.9000000000000004,3.95,4,4.0500000000000007,4.1000000000000005,4.1500000000000004,4.2,4.25,4.3000000000000007,4.3500000000000005,4.4000000000000004,4.45,4.5,4.5500000000000007,4.6000000000000005,4.6500000000000004,4.7,4.75,4.8000000000000007,4.8500000000000005,4.9000000000000004,4.95,5,5.0500000000000007,5.1000000000000005,5.15,5.2000000000000011,5.25,5.3000000000000007]
[null,18,2.9,2.9499999999999997,3,3.05,3.1,3.15,3.2,3.25,3.3,3.35,3.4,3.45,3.5,3.55,3.6,3.65,3.7,3.75,3.8,3.85,3.9,3.95,4,4.05,4.0999999999999996,4.1500000000000004,4.2,4.25,4.3,4.3499999999999996,4.4000000000000004,4.45,4.5,4.55,4.5999999999999996,4.6500000000000004,4.7,4.75,4.8,4.8499999999999996,4.9000000000000004,4.95,5,5.05,5.0999999999999996,5.15,5.2,5.25,5.3000000000000007,5.35,5.4]
[null,19,3.0000000000000004,3.0500000000000003,3.1000000000000005,3.1500000000000004,3.2000000000000006,3.2500000000000004,3.3000000000000007,3.3500000000000005,3.4000000000000004,3.4500000000000006,3.5000000000000004,3.5500000000000007,3.6000000000000005,3.6500000000000004,3.7000000000000006,3.7500000000000004,3.8000000000000007,3.8500000000000005,3.9000000000000004,3.9500000000000006,4,4.0500000000000007,4.1000000000000005,4.1500000000000004,4.2000000000000011,4.25,4.3000000000000007,4.3500000000000005,4.4000000000000004,4.4500000000000011,4.5,4.5500000000000007,4.6000000000000005,4.6500000000000004,4.7000000000000011,4.75,4.8000000000000007,4.8500000000000005,4.9000000000000004,4.9500000000000011,5,5.0500000000000007,5.1000000000000005,5.15,5.2000000000000011,5.25,5.3000000000000007,5.3500000000000005,5.4,5.4500000000000011,5.5]
[null,20,3.1,3.15,3.2,3.25,3.3000000000000003,3.35,3.4000000000000004,3.45,3.5,3.5500000000000003,3.6,3.6500000000000004,3.7,3.75,3.8000000000000003,3.85,3.9000000000000004,3.95,4,4.05,4.0999999999999996,4.1500000000000004,4.2,4.25,4.3000000000000007,4.3499999999999996,4.4000000000000004,4.45,4.5,4.5500000000000007,4.5999999999999996,4.6500000000000004,4.7,4.75,4.8000000000000007,4.8499999999999996,4.9000000000000004,4.95,5,5.0500000000000007,5.0999999999999996,5.15,5.2,5.25,5.3000000000000007,5.35,5.4,5.45,5.5,5.5500000000000007,5.6]
[null,21,3.2,3.25,3.3000000000000003,3.35,3.4000000000000004,3.45,3.5,{"$f":"1+$B33*0.1+0.1+J$11*0.05","v":3.5500000000000003},3.6,3.6500000000000004,3.7,3.75,3.8000000000000003,3.85,3.9000000000000004,3.95,4,4.0500000000000007,4.1000000000000005,4.1500000000000004,4.2,4.25,4.3000000000000007,4.3500000000000005,4.4000000000000004,4.45,4.5,4.5500000000000007,4.6000000000000005,4.6500000000000004,4.7,4.75,4.8000000000000007,4.8500000000000005,4.9000000000000004,4.95,5,5.0500000000000007,5.1000000000000005,5.15,5.2,5.25,5.3000000000000007,5.35,5.4,5.45,5.5,5.5500000000000007,5.6000000000000005,5.65,5.7]
[null,22,3.3000000000000003,3.35,3.4000000000000004,3.45,3.5000000000000004,3.5500000000000003,3.6000000000000005,3.6500000000000004,3.7,3.7500000000000004,3.8000000000000003,3.8500000000000005,3.9000000000000004,3.95,4,4.0500000000000007,4.1000000000000005,4.1500000000000004,4.2,4.25,4.3000000000000007,4.3500000000000005,4.4000000000000004,4.45,4.5,4.5500000000000007,4.6000000000000005,4.6500000000000004,4.7,4.75,4.8000000000000007,4.8500000000000005,4.9000000000000004,4.95,5,5.0500000000000007,5.1000000000000005,5.15,5.2,5.25,5.3000000000000007,5.3500000000000005,5.4,5.45,5.5,5.5500000000000007,5.6000000000000005,5.65,5.7000000000000011,5.75,5.8000000000000007]
[null,23,3.4000000000000004,3.45,3.5000000000000004,3.5500000000000003,3.6000000000000005,3.6500000000000004,3.7,3.7500000000000004,3.8000000000000003,3.8500000000000005,3.9000000000000004,3.95,4,4.0500000000000007,4.1000000000000005,4.1500000000000004,4.2,4.25,4.3000000000000007,4.3500000000000005,4.4000000000000004,4.45,4.5,4.5500000000000007,4.6000000000000005,4.6500000000000004,4.7,4.75,4.8000000000000007,4.8500000000000005,4.9000000000000004,4.95,5,5.0500000000000007,5.1000000000000005,5.15,5.2,5.25,5.3000000000000007,5.3500000000000005,5.4,5.4500000000000011,5.5,5.5500000000000007,5.6000000000000005,5.65,5.7000000000000011,5.75,5.8000000000000007,5.8500000000000005,5.9]
[null,24,3.5000000000000004,3.5500000000000003,3.6000000000000005,3.6500000000000004,3.7000000000000006,3.7500000000000004,3.8000000000000007,3.8500000000000005,3.9000000000000004,3.9500000000000006,4,4.0500000000000007,4.1000000000000005,4.1500000000000004,4.2,4.25,4.3000000000000007,4.3500000000000005,4.4000000000000004,4.45,4.5,4.5500000000000007,4.6000000000000005,4.6500000000000004,4.7000000000000011,4.75,4.8000000000000007,4.8500000000000005,4.9000000000000004,4.9500000000000011,5,5.0500000000000007,5.1000000000000005,5.15,5.2000000000000011,5.25,5.3000000000000007,5.3500000000000005,5.4,5.4500000000000011,5.5,5.5500000000000007,5.6000000000000005,5.65,5.7000000000000011,5.75,5.8000000000000007,5.8500000000000005,5.9,5.9500000000000011,6]
[null,25,3.6,3.65,3.7,3.75,3.8000000000000003,3.85,3.9000000000000004,3.95,4,4.05,4.0999999999999996,4.1500000000000004,4.2,4.25,4.3,4.3499999999999996,4.4000000000000004,4.45,4.5,4.55,4.5999999999999996,4.6500000000000004,4.7,4.75,4.8000000000000007,4.8499999999999996,4.9000000000000004,4.95,5,5.0500000000000007,5.0999999999999996,5.15,5.2,5.25,5.3000000000000007,5.35,5.4,5.45,5.5,5.5500000000000007,5.6,5.65,5.7,5.75,5.8000000000000007,5.85,5.9,5.95,6,6.0500000000000007,6.1]
[null,26,3.7,3.75,3.8000000000000003,3.85,3.9000000000000004,3.95,4,4.05,4.1000000000000005,4.1500000000000004,4.2,4.25,4.3000000000000007,4.3500000000000005,4.4000000000000004,4.45,4.5,{"$f":"1+$B38*0.1+0.1+T$11*0.05","v":4.5500000000000007},4.6000000000000005,4.6500000000000004,4.7,4.75,4.8000000000000007,4.8500000000000005,4.9000000000000004,4.95,5,5.0500000000000007,5.1000000000000005,5.15,5.2,5.25,5.3000000000000007,5.3500000000000005,5.4,5.45,5.5,5.5500000000000007,5.6000000000000005,5.65,5.7,5.75,5.8000000000000007,5.85,5.9,5.95,6,6.0500000000000007,6.1000000000000005,6.15,6.2]
[null,27,3.8000000000000003,3.85,3.9000000000000004,3.95,4,4.0500000000000007,4.1000000000000005,4.1500000000000004,4.2,4.25,4.3000000000000007,4.3500000000000005,4.4000000000000004,4.45,4.5,4.5500000000000007,4.6000000000000005,4.6500000000000004,4.7,4.75,4.8000000000000007,4.8500000000000005,4.9000000000000004,4.95,5,5.0500000000000007,5.1000000000000005,5.15,5.2,5.25,5.3000000000000007,5.3500000000000005,5.4,5.45,5.5,5.5500000000000007,5.6000000000000005,5.65,5.7,5.75,5.8000000000000007,5.8500000000000005,5.9,5.95,6,6.0500000000000007,6.1000000000000005,6.15,6.2000000000000011,6.25,6.3000000000000007]
[null,28,3.9000000000000004,3.95,4,4.0500000000000007,4.1000000000000005,4.1500000000000004,4.2,4.25,4.3000000000000007,4.3500000000000005,4.4000000000000004,4.45,4.5,4.5500000000000007,4.6000000000000005,4.6500000000000004,4.7,4.75,4.8000000000000007,4.8500000000000005,4.9000000000000004,4.95,5,5.0500000000000007,5.1000000000000005,5.15,5.2,5.25,5.3000000000000007,5.3500000000000005,5.4,5.45,5.5,5.5500000000000007,5.6000000000000005,5.65,5.7,5.75,5.8000000000000007,5.8500000000000005,5.9,5.9500000000000011,6,6.0500000000000007,6.1000000000000005,6.15,6.2000000000000011,6.25,6.3000000000000007,6.3500000000000005,6.4]
[null,29,4,4.05,4.0999999999999996,4.1500000000000004,4.2,4.25,4.3,4.3499999999999996,4.4000000000000004,4.45,4.5,4.55,4.5999999999999996,4.6500000000000004,4.7,4.75,4.8,4.8499999999999996,4.9000000000000004,4.95,5,5.05,5.0999999999999996,5.15,5.2,5.25,5.3,5.35,5.4,5.45,5.5,5.55,5.6,5.65,5.7,5.75,5.8,5.85,5.9,5.95,6,6.0500000000000007,6.1,6.15,6.2,6.25,6.3000000000000007,6.35,6.4,6.45,6.5]
[null,30,4.0999999999999996,4.1499999999999995,4.1999999999999993,4.25,4.3,4.3499999999999996,4.3999999999999995,4.4499999999999993,4.5,4.55,4.5999999999999996,4.6499999999999995,4.6999999999999993,4.75,4.8,4.8499999999999996,4.8999999999999995,4.9499999999999993,5,5.05,5.0999999999999996,5.1499999999999995,5.1999999999999993,5.25,5.3,5.35,5.3999999999999995,5.4499999999999993,5.5,5.55,5.6,5.6499999999999995,5.6999999999999993,5.75,5.8,5.85,5.8999999999999995,5.9499999999999993,6,6.05,6.1,6.15,6.1999999999999993,6.25,6.3,6.35,6.4,6.4499999999999993,6.5,6.55,6.6]
[null,31,4.1999999999999993,4.2499999999999991,4.2999999999999989,4.3499999999999996,4.3999999999999995,4.4499999999999993,4.4999999999999991,4.5499999999999989,4.5999999999999996,4.6499999999999995,4.6999999999999993,4.7499999999999991,4.7999999999999989,4.8499999999999996,4.8999999999999995,4.9499999999999993,4.9999999999999991,5.0499999999999989,5.0999999999999996,5.1499999999999995,5.1999999999999993,5.2499999999999991,5.2999999999999989,5.35,5.3999999999999995,5.4499999999999993,5.4999999999999991,{"$f":"1+$B43*0.1+0.1+AD$11*0.05","v":5.5499999999999989},5.6,5.6499999999999995,5.6999999999999993,5.7499999999999991,5.7999999999999989,5.85,5.8999999999999995,5.9499999999999993,5.9999999999999991,6.0499999999999989,6.1,6.1499999999999995,6.1999999999999993,6.25,6.2999999999999989,6.35,6.3999999999999995,6.4499999999999993,6.5,6.5499999999999989,6.6,6.6499999999999995,6.6999999999999993]
[null,32,{"$f":"1+$B44*0.1+0.1+C$11*0.05","v":4.3},4.3499999999999996,4.3999999999999995,4.45,4.5,4.55,4.5999999999999996,4.6499999999999995,4.7,4.75,4.8,4.8499999999999996,4.9000000000000004,4.95,5,5.05,5.0999999999999996,5.15,5.2,5.25,5.3,5.35,5.4,5.45,5.5,5.55,5.6,5.65,5.7,5.75,5.8,5.85,5.9,5.95,6,6.05,6.1,6.15,6.2,6.25,6.3,6.35,6.4,6.4499999999999993,6.5,6.55,6.6,6.65,6.7,6.75,6.8]
[null,33,4.4000000000000004,4.45,4.5,4.5500000000000007,4.6000000000000005,4.6500000000000004,4.7,4.75,4.8000000000000007,4.8500000000000005,4.9000000000000004,4.95,5,5.0500000000000007,5.1000000000000005,5.15,5.2,5.25,5.3000000000000007,5.3500000000000005,5.4,5.45,5.5,5.5500000000000007,5.6000000000000005,5.65,5.7,5.75,5.8000000000000007,5.8500000000000005,5.9,5.95,6,6.0500000000000007,6.1000000000000005,6.15,6.2,6.25,6.3000000000000007,6.3500000000000005,6.4,6.4500000000000011,6.5,6.5500000000000007,6.6000000000000005,6.65,6.7000000000000011,6.75,6.8000000000000007,6.8500000000000005,6.9]
[null,34,4.5,4.55,4.5999999999999996,4.6500000000000004,4.7,4.75,4.8,4.8499999999999996,4.9000000000000004,4.95,5,5.05,5.0999999999999996,5.15,5.2,5.25,5.3,5.35,5.4,5.45,5.5,5.55,5.6,5.65,5.7,5.75,5.8,5.85,5.9,5.95,6,6.05,6.1,6.15,6.2,6.25,6.3,6.35,6.4,6.45,6.5,6.5500000000000007,6.6,6.65,6.7,6.75,6.8000000000000007,6.85,6.9,6.95,7]
[null,35,4.5999999999999996,4.6499999999999995,4.6999999999999993,4.75,4.8,4.8499999999999996,4.8999999999999995,4.9499999999999993,5,5.05,5.0999999999999996,5.1499999999999995,5.1999999999999993,5.25,5.3,5.35,5.3999999999999995,5.4499999999999993,5.5,5.55,5.6,5.6499999999999995,5.6999999999999993,5.75,5.8,5.85,5.8999999999999995,5.9499999999999993,6,6.05,6.1,6.1499999999999995,6.1999999999999993,6.25,6.3,6.35,6.3999999999999995,6.4499999999999993,6.5,6.55,6.6,6.65,6.6999999999999993,6.75,6.8,6.85,6.9,6.9499999999999993,7,7.05,7.1]
[null,36,4.6999999999999993,4.7499999999999991,4.7999999999999989,4.8499999999999996,4.8999999999999995,4.9499999999999993,4.9999999999999991,5.0499999999999989,5.0999999999999996,5.1499999999999995,5.1999999999999993,5.2499999999999991,5.2999999999999989,5.35,5.3999999999999995,5.4499999999999993,5.4999999999999991,5.5499999999999989,5.6,5.6499999999999995,5.6999999999999993,5.7499999999999991,5.7999999999999989,5.85,5.8999999999999995,5.9499999999999993,5.9999999999999991,6.0499999999999989,6.1,6.1499999999999995,6.1999999999999993,6.2499999999999991,6.2999999999999989,6.35,6.3999999999999995,6.4499999999999993,6.4999999999999991,{"$f":"1+$B48*0.1+0.1+AN$11*0.05","v":6.5499999999999989},6.6,6.6499999999999995,6.6999999999999993,6.75,6.7999999999999989,6.85,6.8999999999999995,6.9499999999999993,7,7.0499999999999989,7.1,7.1499999999999995,7.1999999999999993]
[null,37,4.8,4.8499999999999996,4.8999999999999995,4.95,5,5.05,5.0999999999999996,5.1499999999999995,5.2,5.25,5.3,5.35,5.4,5.45,5.5,5.55,5.6,5.65,5.7,5.75,5.8,5.85,5.9,5.95,6,6.05,6.1,6.15,6.2,6.25,6.3,6.35,6.4,6.45,6.5,6.55,6.6,6.65,6.7,6.75,6.8,6.85,6.9,6.9499999999999993,7,7.05,7.1,7.15,7.2,7.25,7.3]
[null,38,4.9000000000000004,4.95,5,5.0500000000000007,5.1000000000000005,5.15,5.2,5.25,5.3000000000000007,5.3500000000000005,5.4,5.45,5.5,5.5500000000000007,5.6000000000000005,5.65,5.7,5.75,5.8000000000000007,5.8500000000000005,5.9,5.95,6,6.0500000000000007,6.1000000000000005,6.15,6.2,6.25,6.3000000000000007,6.3500000000000005,6.4,6.45,6.5,6.5500000000000007,6.6000000000000005,6.65,6.7,6.75,6.8000000000000007,6.8500000000000005,6.9,6.9500000000000011,7,7.0500000000000007,7.1000000000000005,7.15,7.2000000000000011,7.25,7.3000000000000007,7.3500000000000005,7.4]
[null,39,5,5.05,5.0999999999999996,5.15,5.2,5.25,5.3,5.35,5.4,5.45,5.5,5.55,5.6,5.65,5.7,5.75,5.8,5.85,5.9,5.95,6,6.05,6.1,6.15,6.2,6.25,6.3,6.35,6.4,6.45,6.5,6.55,6.6,6.65,6.7,6.75,6.8,6.85,6.9,6.95,7,7.0500000000000007,7.1,7.15,7.2,7.25,7.3000000000000007,7.35,7.4,7.45,7.5]
[null,40,5.0999999999999996,5.1499999999999995,5.1999999999999993,5.25,5.3,5.35,5.3999999999999995,5.4499999999999993,5.5,5.55,5.6,5.6499999999999995,5.6999999999999993,5.75,5.8,5.85,5.8999999999999995,5.9499999999999993,6,6.05,6.1,6.1499999999999995,6.1999999999999993,6.25,6.3,6.35,6.3999999999999995,6.4499999999999993,6.5,6.55,6.6,6.6499999999999995,6.6999999999999993,6.75,6.8,6.85,6.8999999999999995,6.9499999999999993,7,7.05,7.1,7.15,7.1999999999999993,7.25,7.3,7.35,7.4,7.4499999999999993,7.5,7.55,7.6]
[null,41,5.2,5.25,5.3,5.3500000000000005,5.4,5.45,5.5,5.55,5.6000000000000005,5.65,5.7,5.75,5.8000000000000007,5.8500000000000005,5.9,5.95,6,6.0500000000000007,6.1000000000000005,6.15,6.2,6.25,6.3000000000000007,6.3500000000000005,6.4,6.45,6.5,6.5500000000000007,6.6000000000000005,6.65,6.7,6.75,6.8000000000000007,6.8500000000000005,6.9,6.95,7,7.0500000000000007,7.1000000000000005,7.15,7.2,7.25,7.3000000000000007,7.35,7.4,7.45,7.5,{"$f":"1+$B53*0.1+0.1+AX$11*0.05","v":7.5500000000000007},7.6000000000000005,7.65,7.7]
[null,42,5.3,5.35,5.3999999999999995,5.45,5.5,5.55,5.6,5.6499999999999995,5.7,5.75,5.8,5.85,5.9,5.95,6,6.05,6.1,6.15,6.2,6.25,6.3,6.35,6.4,6.45,6.5,6.55,6.6,6.65,6.7,6.75,6.8,6.85,6.9,6.95,7,7.05,7.1,7.15,7.2,7.25,7.3,7.35,7.4,7.4499999999999993,7.5,7.55,7.6,7.65,7.7,7.75,7.8]
[null,43,5.3999999999999995,5.4499999999999993,5.4999999999999991,5.55,5.6,5.6499999999999995,5.6999999999999993,5.7499999999999991,5.8,5.85,5.8999999999999995,5.9499999999999993,6,6.05,6.1,6.1499999999999995,6.1999999999999993,6.25,6.3,6.35,6.3999999999999995,6.4499999999999993,6.5,6.55,6.6,6.6499999999999995,6.6999999999999993,6.75,6.8,6.85,6.8999999999999995,6.9499999999999993,7,7.05,7.1,7.1499999999999995,7.1999999999999993,7.25,7.3,7.35,7.3999999999999995,7.4499999999999993,7.5,7.5499999999999989,7.6,7.6499999999999995,7.6999999999999993,7.75,7.8,7.85,7.8999999999999995]
[null,44,5.5,5.55,5.6,5.65,5.7,5.75,5.8,5.85,5.9,5.95,6,6.05,6.1,6.15,6.2,6.25,6.3,6.35,6.4,6.45,6.5,6.55,6.6,6.65,6.7,6.75,6.8,6.85,6.9,6.95,7,7.05,7.1,7.15,7.2,7.25,7.3,7.35,7.4,7.45,7.5,7.5500000000000007,7.6,7.65,7.7,7.75,7.8000000000000007,7.85,7.9,7.95,8]
[null,45,5.6,5.6499999999999995,5.6999999999999993,5.75,5.8,5.85,5.8999999999999995,5.9499999999999993,6,6.05,6.1,6.1499999999999995,6.1999999999999993,6.25,6.3,6.35,6.3999999999999995,6.4499999999999993,6.5,6.55,6.6,6.6499999999999995,6.6999999999999993,6.75,6.8,6.85,6.8999999999999995,6.9499999999999993,7,7.05,7.1,7.1499999999999995,7.1999999999999993,7.25,7.3,7.35,7.3999999999999995,7.4499999999999993,7.5,7.55,7.6,7.65,7.6999999999999993,7.75,7.8,7.85,7.9,7.9499999999999993,8,8.0500000000000007,8.1]
[null,46,5.7,5.75,5.8,5.8500000000000005,5.9,5.95,6,6.05,6.1000000000000005,6.15,6.2,6.25,6.3000000000000007,6.3500000000000005,6.4,6.45,6.5,6.5500000000000007,6.6000000000000005,6.65,6.7,6.75,6.8000000000000007,6.8500000000000005,6.9,6.95,7,7.0500000000000007,7.1000000000000005,7.15,7.2,7.25,7.3000000000000007,7.3500000000000005,7.4,7.45,7.5,7.5500000000000007,7.6000000000000005,7.65,7.7,7.75,7.8000000000000007,7.85,7.9,7.95,8,8.0500000000000007,8.1000000000000014,8.15,8.1999999999999993]
[null,47,5.8,5.85,5.8999999999999995,5.95,6,6.05,6.1,6.1499999999999995,{"$f":"1+$B59*0.1+0.1+K$11*0.05","v":6.2},6.25,6.3,6.35,6.4,6.45,6.5,6.55,6.6,6.65,6.7,6.75,6.8,6.85,6.9,6.95,7,7.05,7.1,7.15,7.2,7.25,7.3,7.35,7.4,7.45,7.5,7.55,7.6,7.65,7.7,7.75,7.8,7.85,7.9,7.9499999999999993,8,8.0500000000000007,8.1,8.15,8.1999999999999993,8.25,8.3000000000000007]
[null,48,5.9,5.95,6,6.0500000000000007,6.1000000000000005,6.15,6.2,6.25,6.3000000000000007,6.3500000000000005,6.4,6.45,6.5,6.5500000000000007,6.6000000000000005,6.65,6.7,6.75,6.8000000000000007,6.8500000000000005,6.9,6.95,7,7.0500000000000007,7.1000000000000005,7.15,7.2,7.25,7.3000000000000007,7.3500000000000005,7.4,7.45,7.5,7.5500000000000007,7.6000000000000005,7.65,7.7,7.75,7.8000000000000007,7.8500000000000005,7.9,7.9500000000000011,8,8.0500000000000007,8.1000000000000014,8.15,8.2000000000000011,8.25,8.3000000000000007,8.3500000000000014,8.4]
[null,49,6,6.05,6.1,6.15,6.2,6.25,6.3,6.35,6.4,6.45,6.5,6.55,6.6,6.65,6.7,6.75,6.8,6.85,6.9,6.95,7,7.05,7.1,7.15,7.2,7.25,7.3,7.35,7.4,7.45,7.5,7.55,7.6,7.65,7.7,7.75,7.8,7.85,7.9,7.95,8,8.0500000000000007,8.1,8.15,8.1999999999999993,8.25,8.3000000000000007,8.35,8.4,8.4499999999999993,8.5]
[null,50,6.1,6.1499999999999995,6.1999999999999993,6.25,6.3,6.35,6.3999999999999995,6.4499999999999993,6.5,6.55,6.6,6.6499999999999995,6.6999999999999993,6.75,6.8,6.85,6.8999999999999995,6.9499999999999993,7,7.05,7.1,7.1499999999999995,7.1999999999999993,7.25,7.3,7.35,7.3999999999999995,7.4499999999999993,7.5,7.55,7.6,7.6499999999999995,7.6999999999999993,7.75,7.8,7.85,7.8999999999999995,7.9499999999999993,8,8.0500000000000007,8.1,8.15,8.1999999999999993,8.25,8.3000000000000007,8.35,8.4,8.4499999999999993,8.5,8.5500000000000007,8.6]
[]
[null,null,"Loge"]
[null,"Bouclier",0,1,2,3,4,5,6,7,8,9,10,11,12,13,14,15,16,17,18,19,20,21,22,23,24,25,26,27,28,29,30,31,32,33,34,35,36,37,38,39,40,41,42,43,44,45,46,47,48,49,50]
[null,0,{"$f":"1+$B66*0.1+0.3+C$11*0.15","v":1.3},{"$f":"1+$B66*0.1+0.3+D$11*0.15","v":1.45},1.6,1.75,1.9,2.0499999999999998,2.2000000000000002,2.35,2.5,2.65,2.8,2.95,3.0999999999999996,3.25,3.4000000000000004,3.55,3.7,3.8499999999999996,4,4.1500000000000004,4.3,4.45,4.5999999999999996,4.75,4.8999999999999995,5.05,5.2,5.35,5.5,5.6499999999999995,5.8,5.9499999999999993,6.1,6.25,6.3999999999999995,6.55,6.6999999999999993,6.85,7,7.1499999999999995,7.3,7.4499999999999993,7.6,7.75,7.8999999999999995,8.0500000000000007,8.1999999999999993,8.35,8.5,8.65,8.8000000000000007]
[null,1,1.4000000000000001,{"$f":"1+$B67*0.1+0.3+D$11*0.15","v":1.55},1.7000000000000002,1.85,2,2.1500000000000004,2.2999999999999998,2.4500000000000002,2.6,2.75,2.9000000000000004,3.05,3.2,3.35,3.5,3.6500000000000004,3.8,3.95,4.0999999999999996,4.25,4.4000000000000004,4.55,4.7,4.8499999999999996,5,5.15,5.3,5.45,5.6000000000000005,5.75,5.9,6.05,6.2,6.3500000000000005,6.5,6.65,6.8,6.95,7.1000000000000005,7.25,7.4,7.55,7.7,7.8500000000000005,8,8.15,8.2999999999999989,8.4499999999999993,8.6,8.75,8.9]
[null,2,1.5,1.65,1.8,1.95,2.1,2.25,2.4,2.5499999999999998,2.7,2.8499999999999996,3,3.15,3.3,3.45,3.6,3.75,3.9,4.05,4.1999999999999993,4.3499999999999996,4.5,4.6500000000000004,4.8,4.9499999999999993,5.0999999999999996,5.25,5.4,5.55,5.7,5.85,6,6.1499999999999995,6.3,6.45,6.6,6.75,6.8999999999999995,7.05,7.2,7.35,7.5,7.6499999999999995,7.8,7.95,8.1,8.25,8.3999999999999986,8.5500000000000007,8.6999999999999993,8.85,9]
[null,3,1.6,1.75,1.9000000000000001,2.0499999999999998,2.2000000000000002,2.35,2.5,2.6500000000000004,2.8,2.95,3.1,3.25,3.4,3.55,3.7,3.85,4,4.1500000000000004,4.3,4.45,4.5999999999999996,4.75,4.9000000000000004,5.05,5.1999999999999993,5.35,5.5,5.65,5.8000000000000007,5.9499999999999993,6.1,6.25,6.4,6.5500000000000007,6.6999999999999993,6.85,7,7.15,7.3000000000000007,7.4499999999999993,7.6,7.75,7.9,8.0500000000000007,8.1999999999999993,8.35,8.5,8.65,8.7999999999999989,8.9499999999999993,9.1]
[null,4,1.7,1.8499999999999999,2,2.15,2.2999999999999998,2.4500000000000002,2.5999999999999996,2.75,2.9,3.05,3.2,3.3499999999999996,3.5,3.65,3.8,3.95,4.0999999999999996,4.25,4.3999999999999995,4.55,4.7,4.8499999999999996,5,5.1499999999999995,5.3,5.45,5.6,5.75,5.9,6.05,6.2,6.35,6.5,6.65,6.8,6.95,7.1,7.25,7.4,7.55,7.7,7.85,8,8.15,8.2999999999999989,8.4499999999999993,8.6,8.75,8.8999999999999986,9.0499999999999989,9.1999999999999993]
[null,5,1.8,1.95,2.1,2.25,2.4,2.5499999999999998,2.7,2.85,3,3.15,3.3,3.45,3.5999999999999996,3.75,3.9000000000000004,4.05,4.2,4.3499999999999996,4.5,4.6500000000000004,4.8,{"$f":"1+$B71*0.1+0.3+X$11*0.15","v":4.95},5.0999999999999996,5.25,5.3999999999999995,5.55,5.7,5.85,6,6.1499999999999995,6.3,6.4499999999999993,6.6,6.75,6.8999999999999995,7.05,7.1999999999999993,7.35,7.5,7.6499999999999995,7.8,7.9499999999999993,8.1,8.25,8.4,8.5500000000000007,8.6999999999999993,8.85,9,9.15,9.3000000000000007]
[null,6,1.9000000000000001,2.0500000000000003,2.2000000000000002,2.35,2.5,2.6500000000000004,2.8,2.95,3.1,3.25,3.4000000000000004,3.55,3.7,3.85,4,4.1500000000000004,4.3,4.45,4.5999999999999996,4.75,4.9000000000000004,5.05,5.2,5.35,5.5,5.65,5.8,5.95,6.1000000000000005,6.25,6.4,6.55,6.7,6.8500000000000005,7,7.15,7.3,7.45,7.6000000000000005,7.75,7.9,8.0499999999999989,8.1999999999999993,8.35,8.5,8.65,8.7999999999999989,8.9499999999999993,9.1,9.25,9.4]
[null,7,2,2.15,2.2999999999999998,2.4500000000000002,2.6,2.75,2.9,3.05,3.2,3.3499999999999996,3.5,3.65,3.8,3.95,4.0999999999999996,4.25,4.4000000000000004,4.55,4.6999999999999993,4.8499999999999996,5,5.15,5.3,5.4499999999999993,5.6,5.75,5.9,6.05,6.2,6.35,6.5,6.6499999999999995,6.8,6.95,7.1,7.25,7.3999999999999995,7.55,7.7,7.85,8,8.1499999999999986,8.3000000000000007,8.4499999999999993,8.6,8.75,8.8999999999999986,9.0500000000000007,9.1999999999999993,9.35,9.5]
[null,8,2.1,2.25,2.4,2.5499999999999998,2.7,2.85,3,3.1500000000000004,3.3,3.45,3.6,3.75,3.9,4.05,4.2,4.3499999999999996,4.5,4.6500000000000004,4.8,4.95,5.0999999999999996,5.25,5.4,5.55,5.6999999999999993,5.85,6,6.15,6.3000000000000007,6.4499999999999993,6.6,6.75,6.9,7.0500000000000007,7.1999999999999993,7.35,7.5,7.65,7.8000000000000007,7.9499999999999993,8.1,8.25,8.4,8.5500000000000007,8.6999999999999993,8.85,9,9.15,9.2999999999999989,9.4499999999999993,9.6]
[null,9,2.1999999999999997,2.3499999999999996,2.4999999999999996,2.6499999999999995,2.8,2.9499999999999997,3.0999999999999996,3.25,3.3999999999999995,3.55,3.6999999999999997,3.8499999999999996,3.9999999999999996,4.1499999999999995,4.3,4.4499999999999993,4.5999999999999996,4.75,4.8999999999999995,5.05,5.1999999999999993,5.35,5.5,5.6499999999999995,5.7999999999999989,5.9499999999999993,6.1,6.25,6.4,6.5499999999999989,6.6999999999999993,6.85,7,7.15,7.2999999999999989,7.4499999999999993,7.6,7.75,7.9,8.0499999999999989,8.1999999999999993,8.35,8.5,8.65,8.7999999999999989,8.9499999999999993,9.1,9.25,9.3999999999999986,9.5499999999999989,9.6999999999999993]
[null,10,2.2999999999999998,2.4499999999999997,2.5999999999999996,2.75,2.9,3.05,3.1999999999999997,3.3499999999999996,3.5,3.6499999999999995,3.8,3.9499999999999997,4.0999999999999996,4.25,4.4000000000000004,4.55,4.6999999999999993,4.8499999999999996,5,5.15,5.3,5.4499999999999993,5.6,5.75,5.8999999999999995,6.05,{"$f":"1+$B76*0.1+0.3+AC$11*0.15","v":6.1999999999999993},6.35,6.5,6.6499999999999995,6.8,6.9499999999999993,7.1,7.25,7.3999999999999995,7.55,7.6999999999999993,7.85,8,8.1499999999999986,8.3000000000000007,8.4499999999999993,8.6,8.75,8.8999999999999986,9.0500000000000007,9.1999999999999993,9.35,9.5,9.6499999999999986,9.8000000000000007]
[null,11,2.4,2.5499999999999998,2.6999999999999997,2.8499999999999996,3,3.15,3.3,3.45,3.5999999999999996,3.75,3.9,4.05,4.1999999999999993,4.3499999999999996,4.5,4.6500000000000004,4.8,4.9499999999999993,5.0999999999999996,5.25,5.4,5.55,5.6999999999999993,5.85,6,6.15,6.3,6.4499999999999993,6.6,6.75,6.9,7.0499999999999989,7.1999999999999993,7.35,7.5,7.65,7.7999999999999989,7.9499999999999993,8.1,8.25,8.4,8.5499999999999989,8.6999999999999993,8.85,9,9.15,9.2999999999999989,9.4499999999999993,9.6,9.75,9.9]
[null,12,2.5,2.65,2.8,2.95,3.1,3.25,3.4,3.55,3.7,3.8499999999999996,4,4.1500000000000004,4.3,4.45,4.5999999999999996,4.75,4.9000000000000004,5.05,5.1999999999999993,5.35,5.5,5.65,5.8,5.9499999999999993,6.1,6.25,6.4,6.55,6.7,6.85,7,7.1499999999999995,7.3,7.45,7.6,7.75,7.8999999999999995,8.0500000000000007,8.1999999999999993,8.35,8.5,8.6499999999999986,8.8000000000000007,8.9499999999999993,9.1,9.25,9.3999999999999986,9.5500000000000007,9.6999999999999993,9.85,10]
[null,13,2.5999999999999996,2.7499999999999996,2.8999999999999995,3.05,3.1999999999999997,3.3499999999999996,3.4999999999999996,3.6499999999999995,3.8,3.9499999999999993,4.0999999999999996,4.25,4.3999999999999995,4.55,4.6999999999999993,4.8499999999999996,5,5.1499999999999995,5.2999999999999989,5.4499999999999993,5.6,5.75,5.8999999999999995,6.0499999999999989,6.1999999999999993,6.35,6.5,6.6499999999999995,6.8,6.9499999999999993,7.1,7.2499999999999991,7.3999999999999995,7.55,7.6999999999999993,7.85,7.9999999999999991,8.1499999999999986,8.3000000000000007,8.4499999999999993,8.6,8.75,8.8999999999999986,9.0500000000000007,9.1999999999999993,9.35,9.5,9.6499999999999986,9.7999999999999989,9.9499999999999993,10.1]
[null,14,2.7,2.85,3,3.1500000000000004,3.3000000000000003,3.45,3.6,3.75,3.9000000000000004,4.05,4.2,4.3499999999999996,4.5,4.6500000000000004,4.8000000000000007,4.95,5.0999999999999996,5.25,5.4,5.5500000000000007,5.7,5.85,6,6.15,6.3,6.45,6.6,6.75,6.9,7.05,7.2,7.35,7.5,7.65,7.8,7.95,8.1,8.25,8.4,8.5500000000000007,8.6999999999999993,8.85,9,9.15,9.3000000000000007,9.4499999999999993,9.6,9.75,9.8999999999999986,10.050000000000001,10.199999999999999]
[null,15,2.8,2.9499999999999997,3.0999999999999996,3.25,3.4,3.55,3.6999999999999997,3.8499999999999996,4,4.1499999999999995,4.3,4.4499999999999993,4.5999999999999996,4.75,4.9000000000000004,5.05,5.1999999999999993,5.35,5.5,5.65,5.8,5.9499999999999993,6.1,6.25,6.3999999999999995,6.55,6.6999999999999993,6.85,7,7.1499999999999995,7.3,{"$f":"1+$B81*0.1+0.3+AH$11*0.15","v":7.4499999999999993},7.6,7.75,7.8999999999999995,8.0500000000000007,8.1999999999999993,8.35,8.5,8.6499999999999986,8.8000000000000007,8.9499999999999993,9.1,9.25,9.3999999999999986,9.5500000000000007,9.6999999999999993,9.85,10,10.149999999999999,10.3]
[null,16,2.9,3.05,3.1999999999999997,3.3499999999999996,3.5,3.65,3.8,3.95,4.0999999999999996,4.25,4.4000000000000004,4.55,4.6999999999999993,4.8499999999999996,5,5.15,5.3,5.4499999999999993,5.6,5.75,5.9,6.05,6.1999999999999993,6.35,6.5,6.65,6.8,6.9499999999999993,7.1,7.25,7.4,7.5499999999999989,7.6999999999999993,7.85,8,8.15,8.2999999999999989,8.4499999999999993,8.6,8.75,8.9,9.0499999999999989,9.1999999999999993,9.35,9.5,9.65,9.7999999999999989,9.9499999999999993,10.1,10.25,10.4]
[null,17,3,3.15,3.3,3.45,3.6,3.75,3.9,4.05,4.2,4.3499999999999996,4.5,4.6500000000000004,4.8,4.95,5.0999999999999996,5.25,5.4,5.55,5.6999999999999993,5.85,6,6.15,6.3,6.4499999999999993,6.6,6.75,6.9,7.05,7.2,7.35,7.5,7.6499999999999995,7.8,7.95,8.1,8.25,8.3999999999999986,8.5500000000000007,8.6999999999999993,8.85,9,9.1499999999999986,9.3000000000000007,9.4499999999999993,9.6,9.75,9.8999999999999986,10.050000000000001,10.199999999999999,10.35,10.5]
[null,18,3.0999999999999996,3.2499999999999996,3.3999999999999995,3.55,3.6999999999999997,3.8499999999999996,3.9999999999999996,4.1499999999999995,4.3,4.4499999999999993,4.5999999999999996,4.75,4.8999999999999995,5.05,5.1999999999999993,5.35,5.5,5.6499999999999995,5.7999999999999989,5.9499999999999993,6.1,6.25,6.3999999999999995,6.5499999999999989,6.6999999999999993,6.85,7,7.1499999999999995,7.3,7.4499999999999993,7.6,7.7499999999999991,7.8999999999999995,8.0500000000000007,8.1999999999999993,8.35,8.5,8.6499999999999986,8.8000000000000007,8.9499999999999993,9.1,9.25,9.3999999999999986,9.5500000000000007,9.6999999999999993,9.85,10,10.149999999999999,10.299999999999999,10.45,10.6]
[null,19,3.2,3.35,3.5,3.6500000000000004,3.8000000000000003,3.95,4.0999999999999996,4.25,4.4000000000000004,4.55,4.7,4.8499999999999996,5,5.15,5.3000000000000007,5.45,5.6,5.75,5.9,6.0500000000000007,6.2,6.35,6.5,6.65,6.8,6.95,7.1,7.25,7.4,7.55,7.7,7.85,8,8.15,8.3000000000000007,8.4499999999999993,8.6,8.75,8.9,9.0500000000000007,9.1999999999999993,9.35,9.5,9.65,9.8000000000000007,9.9499999999999993,10.1,10.25,10.399999999999999,10.55,10.7]
[null,20,3.3,3.4499999999999997,3.5999999999999996,3.75,3.9,4.05,4.1999999999999993,4.3499999999999996,4.5,4.6499999999999995,4.8,4.9499999999999993,5.0999999999999996,5.25,5.4,5.55,5.6999999999999993,5.85,6,6.15,6.3,6.4499999999999993,6.6,6.75,6.8999999999999995,7.05,7.1999999999999993,7.35,7.5,7.6499999999999995,7.8,7.9499999999999993,8.1,8.25,8.3999999999999986,8.5500000000000007,{"$f":"1+$B86*0.1+0.3+AM$11*0.15","v":8.6999999999999993},8.85,9,9.1499999999999986,9.3000000000000007,9.4499999999999993,9.6,9.75,9.8999999999999986,10.050000000000001,10.199999999999999,10.35,10.5,10.649999999999999,10.8]
[null,21,3.4,3.55,3.6999999999999997,3.8499999999999996,4,4.1500000000000004,4.3,4.45,4.5999999999999996,4.75,4.9000000000000004,5.05,5.1999999999999993,5.35,5.5,5.65,5.8,5.9499999999999993,6.1,6.25,6.4,6.55,6.6999999999999993,6.85,7,7.15,7.3,7.4499999999999993,7.6,7.75,7.9,8.0499999999999989,8.1999999999999993,8.35,8.5,8.65,8.7999999999999989,8.9499999999999993,9.1,9.25,9.4,9.5499999999999989,9.6999999999999993,9.85,10,10.15,10.299999999999999,10.45,10.6,10.75,10.9]
[null,22,3.5,3.65,3.8,3.95,4.0999999999999996,4.25,4.4000000000000004,4.55,4.7,4.8499999999999996,5,5.15,5.3,5.45,5.6,5.75,5.9,6.05,6.1999999999999993,6.35,6.5,6.65,6.8,6.9499999999999993,7.1,7.25,7.4,7.55,7.7,7.85,8,8.1499999999999986,8.3000000000000007,8.4499999999999993,8.6,8.75,8.8999999999999986,9.0500000000000007,9.1999999999999993,9.35,9.5,9.6499999999999986,9.8000000000000007,9.9499999999999993,10.1,10.25,10.399999999999999,10.55,10.7,10.85,11]
[null,23,3.6,3.75,3.9,4.05,4.2,4.3499999999999996,4.5,4.6500000000000004,4.8,4.95,5.0999999999999996,5.25,5.4,5.55,5.7,5.85,6,6.15,6.3,6.45,6.6,6.75,6.9,7.05,7.1999999999999993,7.35,7.5,7.65,7.8000000000000007,7.9499999999999993,8.1,8.25,8.4,8.5500000000000007,8.6999999999999993,8.85,9,9.15,9.3000000000000007,9.4499999999999993,9.6,9.75,9.9,10.050000000000001,10.199999999999999,10.35,10.5,10.65,10.799999999999999,10.95,11.1]
[null,24,3.7,3.85,4,4.1500000000000004,4.3,4.45,4.5999999999999996,4.75,4.9000000000000004,5.05,5.2,5.35,5.5,5.65,5.8000000000000007,5.95,6.1,6.25,6.4,6.5500000000000007,6.7,6.85,7,7.15,7.3,7.45,7.6,7.75,7.9,8.0500000000000007,8.1999999999999993,8.35,8.5,8.65,8.8000000000000007,8.9499999999999993,9.1,9.25,9.4,9.5500000000000007,9.6999999999999993,9.85,10,10.15,10.3,10.45,10.6,10.75,10.899999999999999,11.05,11.2]
[null,25,3.8,3.9499999999999997,4.0999999999999996,4.25,4.3999999999999995,4.55,4.6999999999999993,4.8499999999999996,5,5.1499999999999995,5.3,5.4499999999999993,5.6,5.75,5.9,6.05,6.1999999999999993,6.35,6.5,6.65,6.8,6.9499999999999993,7.1,7.25,7.3999999999999995,7.55,7.6999999999999993,7.85,8,8.1499999999999986,8.3000000000000007,8.4499999999999993,8.6,8.75,8.8999999999999986,9.0500000000000007,9.1999999999999993,9.35,9.5,9.6499999999999986,9.8000000000000007,{"$f":"1+$B91*0.1+0.3+AR$11*0.15","v":9.9499999999999993},10.1,10.25,10.399999999999999,10.55,10.7,10.85,11,11.149999999999999,11.3]
[null,26,3.9,4.05,4.2,4.3499999999999996,4.5,4.6500000000000004,4.8,4.95,5.0999999999999996,5.25,5.4,5.55,5.6999999999999993,5.85,6,6.15,6.3,6.4499999999999993,6.6,6.75,6.9,7.05,7.1999999999999993,7.35,7.5,7.65,7.8,7.9499999999999993,8.1,8.25,8.4,8.5499999999999989,8.6999999999999993,8.85,9,9.15,9.2999999999999989,9.4499999999999993,9.6,9.75,9.9,10.049999999999999,10.199999999999999,10.35,10.5,10.65,10.799999999999999,10.95,11.1,11.25,11.4]
[null,27,4,4.1500000000000004,4.3,4.45,4.5999999999999996,4.75,4.9000000000000004,5.05,5.2,5.35,5.5,5.65,5.8,5.95,6.1,6.25,6.4,6.55,6.6999999999999993,6.85,7,7.15,7.3,7.4499999999999993,7.6,7.75,7.9,8.0500000000000007,8.1999999999999993,8.35,8.5,8.6499999999999986,8.8000000000000007,8.9499999999999993,9.1,9.25,9.3999999999999986,9.5500000000000007,9.6999999999999993,9.85,10,10.149999999999999,10.3,10.45,10.6,10.75,10.899999999999999,11.05,11.2,11.35,11.5]
[null,28,4.1000000000000005,4.2500000000000009,4.4000000000000004,4.5500000000000007,4.7,4.8500000000000005,5,5.15,5.3000000000000007,5.45,5.6000000000000005,5.75,5.9,6.0500000000000007,6.2000000000000011,6.3500000000000005,6.5,6.65,6.8000000000000007,6.9500000000000011,7.1000000000000005,7.25,7.4,7.5500000000000007,7.7,7.8500000000000005,8,8.15,8.3000000000000007,8.4499999999999993,8.6000000000000014,8.75,8.9,9.0500000000000007,9.1999999999999993,9.3500000000000014,9.5,9.65,9.8000000000000007,9.9499999999999993,10.100000000000001,10.25,10.4,10.55,10.7,10.850000000000001,11,11.15,11.3,11.45,11.600000000000001]
[null,29,4.2,4.3500000000000005,4.5,4.6500000000000004,4.8,4.95,5.0999999999999996,5.25,5.4,5.55,5.7,5.85,6,6.15,6.3000000000000007,6.45,6.6,6.75,6.9,7.0500000000000007,7.2,7.35,7.5,7.65,7.8,7.95,8.1,8.25,8.4,8.5500000000000007,8.6999999999999993,8.85,9,9.15,9.3000000000000007,9.4499999999999993,9.6,9.75,9.9,10.050000000000001,10.199999999999999,10.35,10.5,10.65,10.8,10.95,11.1,11.25,11.399999999999999,11.55,11.7]
[null,30,4.3,4.45,4.5999999999999996,4.75,4.8999999999999995,5.05,5.1999999999999993,5.35,5.5,5.6499999999999995,5.8,5.9499999999999993,6.1,6.25,6.4,6.55,6.6999999999999993,6.85,7,7.15,7.3,7.4499999999999993,7.6,7.75,7.8999999999999995,8.0500000000000007,8.1999999999999993,8.35,8.5,8.6499999999999986,8.8000000000000007,8.9499999999999993,9.1,9.25,9.3999999999999986,9.5500000000000007,9.6999999999999993,9.85,10,10.149999999999999,10.3,10.45,10.6,10.75,10.899999999999999,11.05,{"$f":"1+$B96*0.1+0.3+AW$11*0.15","v":11.2},11.35,11.5,11.649999999999999,11.8]
[null,31,4.3999999999999995,4.55,4.6999999999999993,4.8499999999999996,4.9999999999999991,5.1499999999999995,5.2999999999999989,5.4499999999999993,5.6,5.7499999999999991,5.8999999999999995,6.0499999999999989,6.1999999999999993,6.35,6.5,6.6499999999999995,6.7999999999999989,6.9499999999999993,7.1,7.25,7.3999999999999995,7.5499999999999989,7.6999999999999993,7.85,7.9999999999999991,8.1499999999999986,8.2999999999999989,8.4499999999999993,8.6,8.75,8.8999999999999986,9.0499999999999989,9.1999999999999993,9.35,9.5,9.6499999999999986,9.7999999999999989,9.9499999999999993,10.1,10.25,10.399999999999999,10.549999999999999,10.7,10.85,11,11.149999999999999,11.299999999999999,11.45,11.599999999999998,11.75,11.899999999999999]
[null,32,{"$f":"1+$B98*0.1+0.3+C$11*0.15","v":4.5},4.6500000000000004,4.8,4.95,5.0999999999999996,5.25,5.4,5.55,5.7,5.85,6,6.15,6.3,6.45,6.6,6.75,6.9,7.05,7.1999999999999993,7.35,7.5,7.65,7.8,7.9499999999999993,8.1,8.25,8.4,8.5500000000000007,8.6999999999999993,8.85,9,9.1499999999999986,9.3000000000000007,9.4499999999999993,9.6,9.75,9.8999999999999986,10.050000000000001,10.199999999999999,10.35,10.5,10.649999999999999,10.8,10.95,11.1,11.25,11.399999999999999,11.55,11.7,11.85,12]
[null,33,4.6000000000000005,4.7500000000000009,4.9000000000000004,5.0500000000000007,5.2,5.3500000000000005,5.5,5.65,5.8000000000000007,5.95,6.1000000000000005,6.25,6.4,6.5500000000000007,6.7000000000000011,6.8500000000000005,7,7.15,7.3000000000000007,7.4500000000000011,7.6000000000000005,7.75,7.9,8.0500000000000007,8.1999999999999993,8.3500000000000014,8.5,8.65,8.8000000000000007,8.9499999999999993,9.1000000000000014,9.25,9.4,9.5500000000000007,9.6999999999999993,9.8500000000000014,10,10.15,10.3,10.45,10.600000000000001,10.75,10.9,11.05,11.2,11.350000000000001,11.5,11.65,11.8,11.95,12.100000000000001]
[null,34,4.7,4.8500000000000005,5,5.15,5.3,5.45,5.6,5.75,5.9,6.05,6.2,6.35,6.5,6.65,6.8000000000000007,6.95,7.1,7.25,7.4,7.5500000000000007,7.7,7.85,8,8.15,8.3000000000000007,8.4499999999999993,8.6,8.75,8.9,9.0500000000000007,9.1999999999999993,9.35,9.5,9.65,9.8000000000000007,9.9499999999999993,10.1,10.25,10.4,10.55,10.7,10.85,11,11.15,11.3,11.45,11.6,11.75,11.899999999999999,12.05,12.2]
[null,35,4.8,4.95,5.0999999999999996,5.25,5.3999999999999995,5.55,5.6999999999999993,5.85,6,6.1499999999999995,6.3,6.4499999999999993,6.6,6.75,6.9,7.05,7.1999999999999993,7.35,7.5,7.65,7.8,7.9499999999999993,8.1,8.25,8.3999999999999986,8.5500000000000007,8.6999999999999993,8.85,9,9.1499999999999986,9.3000000000000007,9.4499999999999993,9.6,9.75,9.8999999999999986,10.050000000000001,10.199999999999999,10.35,10.5,10.649999999999999,10.8,10.95,11.1,11.25,11.399999999999999,11.55,11.7,11.85,12,12.149999999999999,12.3]
[null,36,4.8999999999999995,{"$f":"1+$B102*0.1+0.3+D$11*0.15","v":5.05},5.1999999999999993,5.35,5.4999999999999991,5.6499999999999995,5.7999999999999989,5.9499999999999993,6.1,6.2499999999999991,6.3999999999999995,6.5499999999999989,6.6999999999999993,6.85,7,7.1499999999999995,7.2999999999999989,7.4499999999999993,7.6,7.75,7.8999999999999995,8.0499999999999989,8.1999999999999993,8.35,8.5,8.6499999999999986,8.7999999999999989,8.9499999999999993,9.1,9.25,9.3999999999999986,9.5499999999999989,9.6999999999999993,9.85,10,10.149999999999999,10.299999999999999,10.45,10.6,10.75,10.899999999999999,11.049999999999999,11.2,11.35,11.5,11.649999999999999,11.799999999999999,11.95,12.099999999999998,12.25,12.399999999999999]
[null,37,5,5.15,5.3,5.45,5.6,5.75,5.9,6.05,6.2,6.35,6.5,6.65,6.8,6.95,7.1,7.25,7.4,7.55,7.6999999999999993,7.85,8,8.15,8.3000000000000007,8.4499999999999993,8.6,8.75,8.9,9.0500000000000007,9.1999999999999993,9.35,9.5,9.6499999999999986,9.8000000000000007,9.9499999999999993,10.1,10.25,10.399999999999999,10.55,10.7,10.85,11,11.149999999999999,11.3,11.45,11.6,11.75,11.899999999999999,12.05,12.2,12.35,12.5]
[null,38,5.1000000000000005,5.2500000000000009,5.4,5.5500000000000007,5.7,5.8500000000000005,6,6.15,6.3000000000000007,6.45,6.6000000000000005,6.75,6.9,7.0500000000000007,7.2000000000000011,7.3500000000000005,7.5,7.65,7.8000000000000007,7.9500000000000011,8.1000000000000014,8.25,8.4,8.5500000000000007,8.6999999999999993,8.8500000000000014,9,9.15,9.3000000000000007,9.4499999999999993,9.6000000000000014,9.75,9.9,10.050000000000001,10.199999999999999,10.350000000000001,10.5,10.65,10.8,10.95,11.100000000000001,11.25,11.4,11.55,11.7,11.850000000000001,12,12.15,12.3,12.45,12.600000000000001]
[null,39,5.2,5.3500000000000005,5.5,5.65,5.8,5.95,6.1,6.25,6.4,6.55,6.7,6.85,7,7.15,7.3000000000000007,7.45,7.6,7.75,7.9,8.0500000000000007,8.1999999999999993,8.35,8.5,8.65,8.8000000000000007,8.9499999999999993,9.1,9.25,9.4,9.5500000000000007,9.6999999999999993,9.85,10,10.15,10.3,10.45,10.6,10.75,10.9,11.05,11.2,11.35,11.5,11.65,11.8,11.95,12.1,12.25,12.399999999999999,12.55,12.7]
[null,40,5.3,5.45,5.6,5.75,5.8999999999999995,6.05,6.1999999999999993,6.35,6.5,6.6499999999999995,6.8,6.9499999999999993,7.1,7.25,7.4,7.55,7.6999999999999993,7.85,8,8.15,8.3000000000000007,8.4499999999999993,8.6,8.75,8.8999999999999986,9.0500000000000007,9.1999999999999993,9.35,9.5,9.6499999999999986,9.8000000000000007,9.9499999999999993,10.1,10.25,10.399999999999999,10.55,10.7,10.85,11,11.149999999999999,11.3,11.45,11.6,11.75,11.899999999999999,12.05,12.2,12.35,12.5,12.649999999999999,12.8]
[null,41,5.4,5.5500000000000007,5.7,5.8500000000000005,6,6.15,{"$f":"1+$B107*0.1+0.3+I$11*0.15","v":6.3000000000000007},6.45,6.6000000000000005,6.75,6.9,7.0500000000000007,7.2,7.3500000000000005,7.5,7.65,7.8000000000000007,7.95,8.1,8.25,8.4,8.5500000000000007,8.6999999999999993,8.85,9,9.15,9.3000000000000007,9.4499999999999993,9.6000000000000014,9.75,9.9,10.050000000000001,10.199999999999999,10.350000000000001,10.5,10.65,10.8,10.95,11.100000000000001,11.25,11.4,11.55,11.7,11.850000000000001,12,12.15,12.3,12.45,12.6,12.75,12.9]
[null,42,5.5,5.65,5.8,5.95,6.1,6.25,6.4,6.55,6.7,6.85,7,7.15,7.3,7.45,7.6,7.75,7.9,8.0500000000000007,8.1999999999999993,8.35,8.5,8.65,8.8000000000000007,8.9499999999999993,9.1,9.25,9.4,9.5500000000000007,9.6999999999999993,9.85,10,10.149999999999999,10.3,10.45,10.6,10.75,10.899999999999999,11.05,11.2,11.35,11.5,11.649999999999999,11.8,11.95,12.1,12.25,12.399999999999999,12.55,12.7,12.85,13]
[null,43,5.6,5.75,5.8999999999999995,6.05,6.1999999999999993,6.35,6.5,6.6499999999999995,6.8,6.9499999999999993,7.1,7.25,7.3999999999999995,7.55,7.6999999999999993,7.85,8,8.1499999999999986,8.2999999999999989,8.4499999999999993,8.6,8.75,8.8999999999999986,9.0499999999999989,9.1999999999999993,9.35,9.5,9.6499999999999986,9.8000000000000007,9.9499999999999993,10.1,10.25,10.399999999999999,10.55,10.7,10.85,11,11.149999999999999,11.3,11.45,11.6,11.75,11.899999999999999,12.05,12.2,12.35,12.5,12.649999999999999,12.799999999999999,12.95,13.1]
[null,44,5.7,5.8500000000000005,6,6.15,6.3,6.45,6.6,6.75,6.9,7.05,7.2,7.35,7.5,7.65,7.8000000000000007,7.95,8.1,8.25,8.4,8.5500000000000007,8.6999999999999993,8.85,9,9.15,9.3000000000000007,9.4499999999999993,9.6,9.75,9.9,10.050000000000001,10.199999999999999,10.35,10.5,10.65,10.8,10.95,11.1,11.25,11.4,11.55,11.7,11.85,12,12.15,12.3,12.45,12.6,12.75,12.899999999999999,13.05,13.2]
[null,45,5.8,5.95,6.1,6.25,6.3999999999999995,6.55,6.6999999999999993,6.85,7,7.1499999999999995,7.3,7.4499999999999993,7.6,7.75,7.9,8.0500000000000007,8.1999999999999993,8.35,8.5,8.65,8.8000000000000007,8.9499999999999993,9.1,9.25,9.3999999999999986,9.5500000000000007,9.6999999999999993,9.85,10,10.149999999999999,10.3,10.45,10.6,10.75,10.899999999999999,11.05,11.2,11.35,11.5,11.649999999999999,11.8,11.95,12.1,12.25,12.399999999999999,12.55,12.7,12.85,13,13.149999999999999,13.3]
[null,46,5.9,6.0500000000000007,6.2,6.3500000000000005,6.5,6.65,6.8000000000000007,6.95,7.1000000000000005,7.25,7.4,{"$f":"1+$B112*0.1+0.3+N$11*0.15","v":7.5500000000000007},7.7,7.8500000000000005,8,8.15,8.3000000000000007,8.4499999999999993,8.6,8.75,8.9,9.0500000000000007,9.1999999999999993,9.35,9.5,9.65,9.8000000000000007,9.9499999999999993,10.100000000000001,10.25,10.4,10.55,10.7,10.850000000000001,11,11.15,11.3,11.45,11.600000000000001,11.75,11.9,12.05,12.2,12.350000000000001,12.5,12.65,12.8,12.95,13.1,13.25,13.4]
[null,47,6,6.15,6.3,6.45,6.6,6.75,6.9,7.05,7.2,7.35,7.5,7.65,7.8,7.95,8.1,8.25,8.4,8.5500000000000007,8.6999999999999993,8.85,9,9.15,9.3000000000000007,9.4499999999999993,9.6,9.75,9.9,10.050000000000001,10.199999999999999,10.35,10.5,10.649999999999999,10.8,10.95,11.1,11.25,11.399999999999999,11.55,11.7,11.85,12,12.149999999999999,12.3,12.45,12.6,12.75,12.899999999999999,13.05,13.2,13.35,13.5]
[null,48,6.1000000000000005,6.2500000000000009,6.4,6.5500000000000007,6.7,6.8500000000000005,7,7.15,7.3000000000000007,7.45,7.6000000000000005,7.75,7.9,8.0500000000000007,8.2000000000000011,8.3500000000000014,8.5,8.65,8.8000000000000007,8.9500000000000011,9.1000000000000014,9.25,9.4,9.5500000000000007,9.6999999999999993,9.8500000000000014,10,10.15,10.3,10.45,10.600000000000001,10.75,10.9,11.05,11.2,11.350000000000001,11.5,11.65,11.8,11.95,12.100000000000001,12.25,12.4,12.55,12.7,12.850000000000001,13,13.15,13.3,13.45,13.600000000000001]
[null,49,6.2,6.3500000000000005,6.5,6.65,6.8,6.95,7.1,7.25,7.4,7.55,7.7,7.85,8,8.15,8.3000000000000007,8.4499999999999993,8.6,8.75,8.9,9.0500000000000007,9.1999999999999993,9.35,9.5,9.65,9.8000000000000007,9.9499999999999993,10.1,10.25,10.4,10.55,10.7,10.85,11,11.15,11.3,11.45,11.6,11.75,11.9,12.05,12.2,12.35,12.5,12.65,12.8,12.95,13.1,13.25,13.399999999999999,13.55,13.7]
[null,50,6.3,6.45,6.6,6.75,6.8999999999999995,7.05,7.1999999999999993,7.35,7.5,7.6499999999999995,7.8,7.9499999999999993,8.1,8.25,8.4,8.5500000000000007,8.6999999999999993,8.85,9,9.15,9.3000000000000007,9.4499999999999993,9.6,9.75,9.8999999999999986,10.050000000000001,10.199999999999999,10.35,10.5,10.649999999999999,10.8,10.95,11.1,11.25,11.399999999999999,11.55,11.7,11.85,12,12.149999999999999,12.3,12.45,12.6,12.75,12.899999999999999,13.05,13.2,13.35,13.5,13.649999999999999,13.8]

{"sheet":"Révisions","index":4,"n_rows":8,"n_cols":4,"rows_kept":8,"cut":false,"hidden":false,"merged":[[7,1,9,1],[7,2,9,2],[7,3,9,3]]}
[null,"sonde et XP :"]
[null,"Version","Date","Release note"]
[null,"1.00","2013-01-19","Création (amélioration/automatisation d'un fichier d'ilidan), pour le \"très vieux\" que j'avais fait autrefois je ne le retrouve plus^^"]
[null,"1.01","2013-01-22","Modifications de certaines formules pour éliminer des fonctions non compatibles avec certaines versions d'excel."]
[null,"1.02","2013-02-09"," - Suppression de \"ARRONDI.AU.MULTIPLE\" pour des raisons de compatibilité inter-version d'excel.\n - Correction du nombre de point de vie de base des Tanks.\n - Prise en compte de la possibilité que la sonde n'ai pas tué que des JSN.\n - Suppression des unités ennemies tuées lors de la sonde.\n - Possibilité de corriger le nombre d'unité (pour tenir compte des pontes depuis le RC par exemple).\n - Ajout de mises en forme conditionnelles (alerte en rouge si nombre de JSN ou FdF insuffisants).\n - Ajout des feuilles \"Manuel\", \"Multiplicateurs de vie\" et \"Révisions\"."]
[]
[null,"armée :"]
[null,"2.0","2013-11-20","calcul automatisé du % pour la ponte en fonction de l'armée actuelle, afin d'éviter de faire des calculs \nMise en place et modification TDP VA VC nombre d'ouvrière\nModification du texte par copie/colle pour transmission par mp, rendu plus lisible"]

{"sheet":"Data","index":5,"n_rows":18,"n_cols":7,"rows_kept":18,"cut":false,"hidden":false,"merged":[]}
[]
[]
[]
[null,"Type d'unité","Att","Def","Vie","Nom 1","Nom 2"]
[null,"Jeune Soldate Naine",3,2,8,"Jeune Soldate Naine","Jeunes Soldates Naines"]
[null,"Soldate Naine",5,4,10,"Soldate Naine","Soldates Naines"]
[null,"Naine d'Elite",7,6,13,"Naine d'Elite","Naines d'Elites"]
[null,"Jeune Soldate",10,9,16,"Jeune Soldate","Jeunes Soldates"]
[null,"Soldate",15,14,20,"Soldate","Soldates"]
[null,"Concierge",1,25,30,"Concierge","Concierges"]
[null,"Concierge d'élite",1,35,40,"Concierge d'élite","Concierges d'élites"]
[null,"Artilleuse",30,15,10,"Artilleuse","Artilleuses"]
[null,"Artilleuse d'élite",35,18,12,"Artilleuse d'élite","Artilleuses d'élites"]
[null,"Soldate d'élite",24,23,27,"Soldate d'élite","Soldates d'élites"]
[null,"Tank",55,1,35,"Tank","Tanks"]
[null,"Tank d'élite",80,1,50,"Tank d'élite","Tanks d'élites"]
[null,"Tueuse",50,50,50,"Tueuse","Tueuses"]
[null,"Tueuse d'élite",55,55,55,"Tueuse d'élite","Tueuses d'élites"]