{"text_format":"1","workbook":"xlsx","n_sheets":7,"sheets":["Armée","Auto sur sonde","Manuel","Multiplicateurs vie","tdp","Data","Révisions"],"not_rendered":{"charts":0,"images":0,"macros":0,"external_links":0,"defined_names":0,"comments":0,"pivot_tables":0},"unopened":[],"bounds":{"document_bytes":16777216,"sheet_cells":100000,"rows_first":2000,"rows_last":500,"rows_between":2000,"halvings":0,"cell_chars":16384,"cell_head_chars":4096},"cells_cut":0,"cells_raw":0,"read":"whole","date_system":"1900"}

{"sheet":"Armée","index":0,"n_rows":99,"n_cols":62,"rows_kept":99,"cut":false,"hidden":false,"merged":[[60,20,60,22],[60,23,60,24],[33,5,33,17],[37,8,37,13],[4,22,18,24],[5,26,6,29],[17,50,17,51],[17,48,17,49],[17,46,17,47],[17,44,17,45],[17,42,17,43],[17,40,17,41],[17,52,17,53],[17,54,17,55],[17,56,17,57],[17,58,17,59],[17,60,17,61],[2,3,2,24],[2,31,2,33],[3,31,3,33],[4,6,4,11],[5,6,5,11],[6,6,6,11],[4,12,4,13],[5,12,5,13],[6,12,6,13],[7,12,7,13],[8,12,8,13],[9,12,9,13],[10,12,10,13],[11,12,11,13],[12,12,12,13],[13,12,13,13],[14,12,14,13],[15,12,15,13],[16,12,16,13],[17,12,17,13],[18,12,18,13],[13,6,13,11],[14,6,14,11],[15,6,15,11],[10,6,10,11],[11,6,11,11],[12,6,12,11],[7,6,7,11],[8,6,8,11],[9,6,9,11],[23,2,23,3],[23,11,23,16],[24,2,24,3],[22,31,23,33],[25,2,25,3],[25,7,25,9],[25,11,25,16],[16,6,16,11],[17,6,17,11],[18,6,18,11],[18,31,19,33],[22,1,22,3],[22,7,22,9],[22,11,22,16],[22,20,22,21],[22,23,22,24],[20,31,21,33],[17,31,17,33],[24,11,24,16],[24,20,24,21],[24,23,24,24],[29,2,29,3],[30,2,30,3],[31,2,31,3],[31,5,31,18],[31,20,31,21],[31,23,31,24],[26,2,26,3],[26,11,26,16],[24,31,24,33],[27,2,27,3],[28,2,28,3],[28,7,28,9],[28,11,29,16],[27,20,27,21],[27,23,27,24],[30,23,30,24],[30,20,30,21],[34,2,34,3],[34,5,36,18],[34,20,34,21],[34,23,34,24],[35,2,35,3],[35,20,35,21],[35,23,35,24],[36,2,36,3],[32,2,32,3],[32,5,32,18],[32,20,32,21],[32,23,32,24],[33,2,33,3],[33,20,33,21],[33,23,33,24],[36,20,36,21],[36,23,36,24],[37,20,37,21],[37,23,37,24],[38,2,38,3],[38,5,38,8],[38,19,39,19],[38,20,39,21],[38,23,39,24],[39,2,39,3],[39,5,39,8],[43,20,44,24],[44,6,44,8],[45,6,45,8],[46,6,46,8],[46,20,47,24],[47,6,47,8],[40,1,40,3],[41,1,41,3],[41,6,41,8],[41,9,41,11],[41,20,42,24],[42,6,42,8],[40,20,40,21],[40,23,40,24],[56,6,56,8],[56,20,57,24],[57,6,57,8],[48,6,48,8],[48,20,49,24],[49,6,49,8],[50,6,50,8],[50,20,50,24],[51,6,51,8],[51,20,52,24],[52,6,52,8],[1,40,2,61],[9,35,9,39],[58,20,59,22],[58,23,59,24],[71,7,71,8],[25,20,25,21],[25,23,25,24],[28,20,28,21],[28,23,28,24],[65,7,65,8],[66,7,66,8],[67,7,67,8],[68,5,68,8],[69,7,69,8],[70,7,70,8],[59,5,59,7],[60,5,60,6],[61,5,61,7],[62,5,62,7],[64,7,64,8],[53,6,53,8],[53,20,54,24],[54,6,54,8],[55,6,55,8]]}
[]
[null,null,null,null,null,null,null,null,null,null,null,null,null,null,null,null,null,null,null,null,null,null,null,null,null,null,null,null,null,null,null,null,null,null,null,null,null,null,null,null,"TABLEAU DE REFERENCE SELON LE POURCENTAGE QUE VOUS DEVEZ PONDRE ET EN FONCTION DE VOTRE TEMPS DE PONTE RENSEIGNE\n (Exprimé en sec puis Jr-hr-min environ)"]
[null,"DATE :",null,"2013-11-24",null,null,null,null,null,null,null,null,null,null,null,null,null,null,null,null,null,null,null,null,null,null,null,null,null,null,null,"tableau de calcul perso"]
[null,"(2) voir tableau de calcul perso avant de remplir",null,null,null,"(1) à effectuer en 1er"]
[null,"OBJECTIF d'ARMEE SOUHAITEE\n(notez ici)",null,"Reste à pondre/ sur votre prévision initiale",null,"Actuellement j'ai : \n(notez si dessous)","En ponte lancée N°1 de\n(notez si dessous)",null,null,null,null,null,"En ponte lancée N°2 de\n(notez si dessous)",null,"En ponte lancée N°3 de\n(notez si dessous)",null,"dénomination :",null,"TOTAL FINAL \nAPRES PONTE",null,"votre armée totale comporte actuellement ",null,"\n\nidéal de ponte \n(selon i-sork)\n\n\n-Début de serveur-\n\nChasseur :\nSur 100% de JSN\n80 à 90% de JS\n20 à 30% d'ARTI\n\n",null,null,null,null,null,null,null,null,"calcul perso :","sur","soit pour",null,null,null,null,null,null,null,"temps de ponte actuel de base","en ponte actuellement pour la jsn en sec","conversion en heure min  ","temps en sec pour 90% ","temps en h/m/s pour 90%","temps en sec pour 80% ","temps en h/m/s pour 80%","temps en sec pour 70% ","temps en h/m/s pour 70%","temps en sec pour 60% ","temps en h/m/s pour 60%","temps en sec pour 50% ","temps en h/m/s pour 50%","temps en sec pour 40% ","temps en h/m/s pour 40%","temps en sec pour 30% ","temps en h/m/s pour 30%","temps en sec pour 20% ","temps en h/m/s pour 20%","temps en sec pour 10% ","temps en h/m/s pour 10%"]
[null,0,null,{"$f":"B6-S6","v":0},null,0,0,null,null,null,null,null,0,null,0,null,"jeunes Soldate naines",null,{"$f":"SUM(F6:O6)","v":0},null,{"$f":"100","v":100},"%",null,null,null,null,"modifier total JSN SOUHAITE",null,null,null,">>","JSN = >>",1,0,"<ici",null,null,null,null,null,"jeunes Soldate naines",{"$f":"VLOOKUP(X59,tdp!A3:C102,3,FALSE)","v":{"$error":"#N/A"}},{"$f":"AP6*G6","v":{"$error":"#N/A"}},{"$f":"INT(AQ6/3600/24)&\"j \"&MOD(INT(AQ6/3600),24)&\"h \"&MOD(INT(AQ6/60),60)&\"m \"","v":{"$error":"#N/A"}}]
[null,0,null,0,null,0,0,null,null,null,null,null,0,null,0,null,"Soldates Naines",null,{"$f":"SUM(F7:O7)","v":0},null,{"$f":"S7*100/S6","v":{"$error":"#DIV/0!"}},"%",null,null,null,null,null,null,null,null,null,"vous devez pondre","en%","vous aurez",null,null,null,null,null,null,"Soldates Naines",{"$f":"VLOOKUP(X59,tdp!A3:D102,4,FALSE)","v":{"$error":"#N/A"}},null,null,{"$f":"AP7*AF8","v":{"$error":"#N/A"}},{"$f":"INT(AS7/3600/24)&\"j \"&MOD(INT(AS7/3600),24)&\"h \"&MOD(INT(AS7/60),60)&\"min env\"","v":{"$error":"#N/A"}},{"$f":"AP7*AF9","v":{"$error":"#N/A"}},{"$f":"INT(AU7/3600/24)&\"j \"&MOD(INT(AU7/3600),24)&\"h \"&MOD(INT(AU7/60),60)&\"min env\"","v":{"$error":"#N/A"}},{"$f":"AP7*AF10","v":{"$error":"#N/A"}},{"$f":"INT(AW7/3600/24)&\"j \"&MOD(INT(AW7/3600),24)&\"h \"&MOD(INT(AW7/60),60)&\"min env\"","v":{"$error":"#N/A"}},{"$f":"AP7*AF11","v":{"$error":"#N/A"}},{"$f":"INT(AY7/3600/24)&\"j \"&MOD(INT(AY7/3600),24)&\"h \"&MOD(INT(AY7/60),60)&\"min env\"","v":{"$error":"#N/A"}},{"$f":"AP7*AF12","v":{"$error":"#N/A"}},{"$f":"INT(BA7/3600/24)&\"j \"&MOD(INT(BA7/3600),24)&\"h \"&MOD(INT(BA7/60),60)&\"min env\"","v":{"$error":"#N/A"}},{"$f":"AP7*AF13","v":{"$error":"#N/A"}},{"$f":"INT(BC7/3600/24)&\"j \"&MOD(INT(BC7/3600),24)&\"h \"&MOD(INT(BC7/60),60)&\"min env\"","v":{"$error":"#N/A"}},{"$f":"AP7*AF14","v":{"$error":"#N/A"}},{"$f":"INT(BE7/3600/24)&\"j \"&MOD(INT(BE7/3600),24)&\"h \"&MOD(INT(BE7/60),60)&\"min env\"","v":{"$error":"#N/A"}},{"$f":"AP7*AF15","v":{"$error":"#N/A"}},{"$f":"INT(BG7/3600/24)&\"j \"&MOD(INT(BG7/3600),24)&\"h \"&MOD(INT(BG7/60),60)&\"min env\"","v":{"$error":"#N/A"}},{"$f":"AP7*AF16","v":{"$error":"#N/A"}},{"$f":"INT(BI7/3600/24)&\"j \"&MOD(INT(BI7/3600),24)&\"h \"&MOD(INT(BI7/60),60)&\"min env\"","v":{"$error":"#N/A"}}]
[null,0,null,0,null,0,0,null,null,null,null,null,0,null,0,null,"Naines d'Elites",null,0,null,{"$f":"S8*100/S6","v":{"$error":"#DIV/0!"}},"%",null,null,null,null,null,null,null,null,null,{"$f":"AH8-AF23","v":0},0.9,{"$f":"AH6*90/100","v":0},"←",null,null,null,null,null,"Naines d'Elites",{"$f":"VLOOKUP(X59,tdp!A3:E102,5,FALSE)","v":{"$error":"#N/A"}},null,null,{"$f":"AP8*AF8","v":{"$error":"#N/A"}},{"$f":"INT(AS8/3600/24)&\"j \"&MOD(INT(AS8/3600),24)&\"h \"&MOD(INT(AS8/60),60)&\"min env\"","v":{"$error":"#N/A"}},{"$f":"AP8*AF9","v":{"$error":"#N/A"}},{"$f":"INT(AU8/3600/24)&\"j \"&MOD(INT(AU8/3600),24)&\"h \"&MOD(INT(AU8/60),60)&\"min env\"","v":{"$error":"#N/A"}},{"$f":"AP8*AF10","v":{"$error":"#N/A"}},{"$f":"INT(AW8/3600/24)&\"j \"&MOD(INT(AW8/3600),24)&\"h \"&MOD(INT(AW8/60),60)&\"min env\"","v":{"$error":"#N/A"}},{"$f":"AP8*AF11","v":{"$error":"#N/A"}},{"$f":"INT(AY8/3600/24)&\"j \"&MOD(INT(AY8/3600),24)&\"h \"&MOD(INT(AY8/60),60)&\"min env\"","v":{"$error":"#N/A"}},{"$f":"AP8*AF12","v":{"$error":"#N/A"}},{"$f":"INT(BA8/3600/24)&\"j \"&MOD(INT(BA8/3600),24)&\"h \"&MOD(INT(BA8/60),60)&\"min env\"","v":{"$error":"#N/A"}},{"$f":"AP8*AF13","v":{"$error":"#N/A"}},{"$f":"INT(BC8/3600/24)&\"j \"&MOD(INT(BC8/3600),24)&\"h \"&MOD(INT(BC8/60),60)&\"min env\"","v":{"$error":"#N/A"}},{"$f":"AP8*AF14","v":{"$error":"#N/A"}},{"$f":"INT(BE8/3600/24)&\"j \"&MOD(INT(BE8/3600),24)&\"h \"&MOD(INT(BE8/60),60)&\"min env\"","v":{"$error":"#N/A"}},{"$f":"AP8*AF15","v":{"$error":"#N/A"}},{"$f":"INT(BG8/3600/24)&\"j \"&MOD(INT(BG8/3600),24)&\"h \"&MOD(INT(BG8/60),60)&\"min env\"","v":{"$error":"#N/A"}},{"$f":"AP8*AF16","v":{"$error":"#N/A"}},{"$f":"INT(BI8/3600/24)&\"j \"&MOD(INT(BI8/3600),24)&\"h \"&MOD(INT(BI8/60),60)&\"min env\"","v":{"$error":"#N/A"}}]
[null,0,null,{"$f":"B9-S9","v":0},null,0,0,null,null,null,null,null,0,null,0,null,"Jeunes Soldates",null,0,null,{"$f":"S9*100/S6","v":{"$error":"#DIV/0!"}},"%",null,null,null,null,null,null,null,null,null,{"$f":"AH9-AF23","v":0},0.8,{"$f":"AH6*80/100","v":0},"←",null,null,null,null,null,"Jeunes Soldates",{"$f":"VLOOKUP(X59,tdp!A3:F102,6,FALSE)","v":{"$error":"#N/A"}},null,null,{"$f":"AP9*AF8","v":{"$error":"#N/A"}},{"$error":"#N/A"},{"$f":"AP9*AF9","v":{"$error":"#N/A"}},{"$error":"#N/A"},{"$f":"AP9*AF10","v":{"$error":"#N/A"}},{"$error":"#N/A"},{"$f":"AP9*AF11","v":{"$error":"#N/A"}},{"$error":"#N/A"},{"$f":"AP9*AF12","v":{"$error":"#N/A"}},{"$error":"#N/A"},{"$f":"AP9*AF13","v":{"$error":"#N/A"}},{"$error":"#N/A"},{"$f":"AP9*AF14","v":{"$error":"#N/A"}},{"$error":"#N/A"},{"$f":"AP9*AF15","v":{"$error":"#N/A"}},{"$error":"#N/A"},{"$f":"AP9*AF16","v":{"$error":"#N/A"}},{"$error":"#N/A"}]
[null,0,null,0,null,0,0,null,null,null,null,null,0,null,0,null,"Soldates",null,0,null,{"$f":"F10*100/S6","v":{"$error":"#DIV/0!"}},"%",null,null,null,null,null,null,null,null,null,{"$f":"AH10-AF23","v":0},0.7,{"$f":"AH6*70/100","v":0},"←","Conversion EN Tps",null,null,null,null,"Soldates",{"$f":"VLOOKUP(X59,tdp!A3:G102,7,FALSE)","v":{"$error":"#N/A"}},null,null,{"$f":"AP10*AF8","v":{"$error":"#N/A"}},{"$error":"#N/A"},{"$f":"AP10*AF9","v":{"$error":"#N/A"}},{"$error":"#N/A"},{"$f":"AP10*AF10","v":{"$error":"#N/A"}},{"$error":"#N/A"},{"$f":"AP10*AF11","v":{"$error":"#N/A"}},{"$error":"#N/A"},{"$f":"AP10*AF12","v":{"$error":"#N/A"}},{"$error":"#N/A"},{"$f":"AP10*AF13","v":{"$error":"#N/A"}},{"$error":"#N/A"},{"$f":"AP10*AF14","v":{"$error":"#N/A"}},{"$error":"#N/A"},{"$f":"AP10*AF15","v":{"$error":"#N/A"}},{"$error":"#N/A"},{"$f":"AP10*AF16","v":{"$error":"#N/A"}},{"$error":"#N/A"}]
[null,0,null,0,null,0,0,null,null,null,null,null,0,null,0,null,"Concierges",null,0,null,{"$f":"S11*100/S6","v":{"$error":"#DIV/0!"}},"%",null,null,null,null,null,null,null,null,null,{"$f":"AH11-AF23","v":0},0.6,{"$f":"AH6*60/100","v":0},"←",null,null,null,null,null,"Concierges",{"$f":"VLOOKUP(X59,tdp!A3:H102,8,FALSE)","v":{"$error":"#N/A"}},null,null,{"$f":"AP11*AF8","v":{"$error":"#N/A"}},{"$error":"#N/A"},{"$f":"AP11*AF9","v":{"$error":"#N/A"}},{"$error":"#N/A"},{"$f":"AP11*AF10","v":{"$error":"#N/A"}},{"$error":"#N/A"},{"$f":"AP11*AF11","v":{"$error":"#N/A"}},{"$error":"#N/A"},{"$f":"AP11*AF12","v":{"$error":"#N/A"}},{"$error":"#N/A"},{"$f":"AP11*AF13","v":{"$error":"#N/A"}},{"$error":"#N/A"},{"$f":"AP11*AF14","v":{"$error":"#N/A"}},{"$error":"#N/A"},{"$f":"AP11*AF15","v":{"$error":"#N/A"}},{"$error":"#N/A"},{"$f":"AP11*AF16","v":{"$error":"#N/A"}},{"$error":"#N/A"}]
[null,0,null,0,null,0,0,null,null,null,null,null,0,null,0,null,"Concierges d'élites",null,0,null,{"$f":"S12*100/S6","v":{"$error":"#DIV/0!"}},"%",null,null,null,null,null,null,null,null,null,{"$f":"AH12-AF23","v":0},0.5,{"$f":"AH6*50/100","v":0},"←",null,null,null,null,null,"Artilleuses",{"$f":"VLOOKUP(X59,tdp!A3:I102,9,FALSE)","v":{"$error":"#N/A"}},null,null,{"$f":"AP12*AF8","v":{"$error":"#N/A"}},{"$error":"#N/A"},{"$f":"AP12*AF9","v":{"$error":"#N/A"}},{"$error":"#N/A"},{"$f":"AP12*AF10","v":{"$error":"#N/A"}},{"$error":"#N/A"},{"$f":"AP12*AF11","v":{"$error":"#N/A"}},{"$error":"#N/A"},{"$f":"AP12*AF12","v":{"$error":"#N/A"}},{"$error":"#N/A"},{"$f":"AP12*AF13","v":{"$error":"#N/A"}},{"$error":"#N/A"},{"$f":"AP12*AF14","v":{"$error":"#N/A"}},{"$error":"#N/A"},{"$f":"AP12*AF15","v":{"$error":"#N/A"}},{"$error":"#N/A"},{"$f":"AP12*AF16","v":{"$error":"#N/A"}},{"$error":"#N/A"}]
[null,0,null,{"$f":"B13-S13","v":0},null,0,0,null,null,null,null,null,0,null,0,null,"Artilleuses",null,0,null,{"$f":"S13*100/S6","v":{"$error":"#DIV/0!"}},"%",null,null,null,null,null,null,null,null,null,{"$f":"AH13-AF23","v":0},0.4,{"$f":"AH6*40/100","v":0},"←",null,null,null,null,null,"Artilleuses d'élites",{"$f":"VLOOKUP(X59,tdp!A3:J102,10,FALSE)","v":{"$error":"#N/A"}},null,null,{"$f":"AP13*AF8","v":{"$error":"#N/A"}},{"$error":"#N/A"},{"$f":"AP13*AF9","v":{"$error":"#N/A"}},{"$error":"#N/A"},{"$f":"AP13*AF10","v":{"$error":"#N/A"}},{"$error":"#N/A"},{"$f":"AP13*AF11","v":{"$error":"#N/A"}},{"$error":"#N/A"},{"$f":"AP13*AF12","v":{"$error":"#N/A"}},{"$error":"#N/A"},{"$f":"AP13*AF13","v":{"$error":"#N/A"}},{"$error":"#N/A"},{"$f":"AP13*AF14","v":{"$error":"#N/A"}},{"$error":"#N/A"},{"$f":"AP13*AF15","v":{"$error":"#N/A"}},{"$error":"#N/A"},{"$f":"AP13*AF16","v":{"$error":"#N/A"}},{"$error":"#N/A"}]
[null,0,null,0,null,0,0,null,null,null,null,null,0,null,0,null,"Artilleuses d'élites",null,0,null,{"$f":"S14*100/S6","v":{"$error":"#DIV/0!"}},"%",null,null,null,null,null,null,null,null,null,{"$f":"AH14-AF23","v":0},0.3,{"$f":"AH6*30/100","v":0},"←",null,null,null,null,null,"Soldates d'élites",{"$f":"VLOOKUP(X59,tdp!A3:K102,11,FALSE)","v":{"$error":"#N/A"}},null,null,{"$f":"AP14*AF8","v":{"$error":"#N/A"}},{"$error":"#N/A"},{"$f":"AP14*AF9","v":{"$error":"#N/A"}},{"$error":"#N/A"},{"$f":"AP14*AF10","v":{"$error":"#N/A"}},{"$error":"#N/A"},{"$f":"AP14*AF11","v":{"$error":"#N/A"}},{"$error":"#N/A"},{"$f":"AP14*AF12","v":{"$error":"#N/A"}},{"$error":"#N/A"},{"$f":"AP14*AF13","v":{"$error":"#N/A"}},{"$error":"#N/A"},{"$f":"AP14*AF14","v":{"$error":"#N/A"}},{"$error":"#N/A"},{"$f":"AP14*AF15","v":{"$error":"#N/A"}},{"$error":"#N/A"},{"$f":"AP14*AF16","v":{"$error":"#N/A"}},{"$error":"#N/A"}]
[null,0,null,0,null,0,0,null,null,null,null,null,0,null,0,null,"Soldates d'élites",null,0,null,{"$f":"S15*100/S6","v":{"$error":"#DIV/0!"}},"%",null,null,null,null,null,null,null,null,null,{"$f":"AH15-AF23","v":0},0.2,{"$f":"AH6*20/100","v":0},"←",null,null,null,null,null,"Tanks ",{"$f":"VLOOKUP(X59,tdp!A3:L102,12,FALSE)","v":{"$error":"#N/A"}},null,null,{"$f":"AP15*AF8","v":{"$error":"#N/A"}},{"$error":"#N/A"},{"$f":"AP15*AF9","v":{"$error":"#N/A"}},{"$error":"#N/A"},{"$f":"AP15*AF10","v":{"$error":"#N/A"}},{"$error":"#N/A"},{"$f":"AP15*AF11","v":{"$error":"#N/A"}},{"$error":"#N/A"},{"$f":"AP15*AF12","v":{"$error":"#N/A"}},{"$error":"#N/A"},{"$f":"AP15*AF13","v":{"$error":"#N/A"}},{"$error":"#N/A"},{"$f":"AP15*AF14","v":{"$error":"#N/A"}},{"$error":"#N/A"},{"$f":"AP15*AF15","v":{"$error":"#N/A"}},{"$error":"#N/A"},{"$f":"AP15*AF16","v":{"$error":"#N/A"}},{"$error":"#N/A"}]
[null,0,null,0,null,0,0,null,null,null,null,null,0,null,0,null,"Tanks ",null,0,null,{"$f":"S16*100/S6","v":{"$error":"#DIV/0!"}},"%",null,null,null,null,null,null,null,null,null,{"$f":"AH16-AF23","v":0},0.1,{"$f":"AH6*10/100","v":0},"←",null,null,null,null,null,"Tueuses ",{"$f":"VLOOKUP(X59,tdp!A3:M102,13,FALSE)","v":{"$error":"#N/A"}},null,null,{"$f":"AP16*AF8","v":{"$error":"#N/A"}},{"$error":"#N/A"},{"$f":"AP16*AF9","v":{"$error":"#N/A"}},{"$error":"#N/A"},{"$f":"AP16*AF10","v":{"$error":"#N/A"}},{"$error":"#N/A"},{"$f":"AP16*AF11","v":{"$error":"#N/A"}},{"$error":"#N/A"},{"$f":"AP16*AF12","v":{"$error":"#N/A"}},{"$error":"#N/A"},{"$f":"AP16*AF13","v":{"$error":"#N/A"}},{"$error":"#N/A"},{"$f":"AP16*AF14","v":{"$error":"#N/A"}},{"$error":"#N/A"},{"$f":"AP16*AF15","v":{"$error":"#N/A"}},{"$error":"#N/A"},{"$f":"AP16*AF16","v":{"$error":"#N/A"}},{"$error":"#N/A"}]
[null,0,null,0,null,0,0,null,null,null,null,null,0,null,0,null,"Tanks d'élites",null,{"$f":"SUM(F17:O17)","v":0},null,{"$f":"S17*100/S6","v":{"$error":"#DIV/0!"}},"%",null,null,null,null,null,null,null,null,null,null,null,null,"↑",null,null,null,null,null,"Tueuses d'élites",{"$f":"VLOOKUP(X59,tdp!A3:N102,14,FALSE)","v":{"$error":"#N/A"}},null,null,{"$f":"AP17*AF8","v":{"$error":"#N/A"}},{"$error":"#N/A"},{"$f":"AP17*AF9","v":{"$error":"#N/A"}},{"$error":"#N/A"},{"$f":"AP17*AF10","v":{"$error":"#N/A"}},{"$error":"#N/A"},{"$f":"AP17*AF11","v":{"$error":"#N/A"}},{"$error":"#N/A"},{"$f":"AP17*AF12","v":{"$error":"#N/A"}},{"$error":"#N/A"},{"$f":"AP17*AF13","v":{"$error":"#N/A"}},{"$error":"#N/A"},{"$f":"AP17*AF14","v":{"$error":"#N/A"}},{"$error":"#N/A"},{"$f":"AP17*AF15","v":{"$error":"#N/A"}},{"$error":"#N/A"},{"$f":"AP17*AF16","v":{"$error":"#N/A"}},{"$error":"#N/A"}]
[null,0,null,0,null,0,0,null,null,null,null,null,0,null,0,null,"Tueuses ",null,0,null,{"$f":"S18*100/S6","v":{"$error":"#DIV/0!"}},"%",null,null,null,null,null,null,null,null,null,"reportez la somme souhaitée si dessus en colonne B ",null,null,"┘",null,null,null,null,null,"ne pas modifier si dessus",null,"ne pas modifier si dessus",null,"ne pas modifier si dessus",null,"ne pas modifier si dessus",null,"ne pas modifier si dessus",null,"ne pas modifier si dessus",null,"ne pas modifier si dessus",null,"ne pas modifier si dessus",null,"ne pas modifier si dessus",null,"ne pas modifier si dessus",null,"ne pas modifier si dessus"]
[null,0,null,0,null,0,0,null,null,null,null,null,0,null,0,null,"Tueuses d'élites",null,0,null,{"$f":"S19*100/S6","v":{"$error":"#DIV/0!"}},"%",null,null,null,null,null,null,null,null,null,"Selectionnez dans le menu déroulant si dessous le type de fourmis que vous souhaitez créer",null,null,null,null,null,null,null,null,"ex :  si vous pondez X nombre d'artilleuses pour 90% la ligne artilleuses est en surbrillance et allez sur la colonne 90% donc pour pondre X il vous faudra le temps indiqué pour pondre "]
[null,null,null,"ne pas modifier si dessus",null,null,null,null,null,null,null,null,null,null,null,null,"ne pas modifier si dessus",null,"ne pas modifier si dessus",null,"ne pas modifier si dessus"]
[null,"NOTE : veuillez noter votre armée actuelle dans un premier temps, puis notez votre objectif d'armée, si vous faites en fonction du pourcentage reportez vous au tableur dédié aux poucents et tdp ",null,null,null,null,null,null,null,null,null,null,null,null,null,null,null,null,null,null,null,null,null,null,null,null,null,null,null,null,null,"Jeunes Soldates",null,null,"<="]
[null,null,null,null,null,null,null,null,null,null,null,null,null,null,null,null,null,null,null,null,null,null,null,null,null,null,null,null,null,null,null,null,null,null,"<="]
[null,"mon ancienne armée sauvegarde ",null,null,null,"FDF brut",null,"bonus AR",null,null,null,"ARME NIVEAU\n (notez si dessous)",null,null,null,null,null,null,"TOTAL DE FDF",null,"diff : fdf/vie",null,null,"diff : fdf/def ",null,null,null,null,null,null,null,{"$f":"IF(AF21=\"\",\"\",VLOOKUP(AF21,Q6:S19,3,0))","v":0}]
[null,0,"jeunes Soldate naines",null,null,{"$f":"(S6*3)+(S7*5)+(S8*7)+(S9*10)+(S10*15)+(S11*1)+(S12*1)+(S13*30)+(S14*35)+(S15*24)+(S16*55)+(S17*80)+(S18*50)+(S19*55)","v":0},null,"(+",{"$f":"S24-F24","v":0},")",null,0,null,null,null,null,null,null,{"$f":"F24*(10+L24)/10","v":0},null,{"$f":"((S24-S27)/S27)*100","v":{"$error":"#DIV/0!"}},"%",null,{"$f":"((S24-S30)/S30)*100","v":{"$error":"#DIV/0!"}},"%"]
[null,0,"Soldates Naines",null,null,"ne pas modifier si dessus",null,null,"ne pas modifier si dessus",null,null,null,null,null,null,null,null,null,"ne pas modifier si dessus",null,"ne pas modifier si dessus",null,null,"ne pas modifier si dessus",null,null,null,null,null,null,null,"ne pas modifier si dessus"]
[null,0,"Naines d'Elites",null,null,"VIE brut",null,"bonus BOU",null,null,null,"BOUCLIER NIVEAU \n(notez si dessous)",null,null,null,null,null,null,"TOTAL DE VIE \nen attaque ",null,"diff : vie/fdf",null,null,"diff : vie/def"]
[null,0,"Jeunes Soldates",null,null,{"$f":"(S6*8)+(S7*10)+(S8*13)+(S9*16)+(S10*20)+(S11*30)+(S12*40)+(S13*10)+(S14*12)+(S15*27)+(S16*35)+(S17*50)+(S18*50)+(S19*55)","v":0},null,"(+",{"$f":"S27-F27","v":0},")",null,0,null,null,null,null,null,null,{"$f":"F27*(10+L27)/10","v":0},null,{"$f":"((S27-S24)/S24)*100","v":{"$error":"#DIV/0!"}},"%",null,{"$f":"((S27-S30)/S30)*100","v":{"$error":"#DIV/0!"}},"%"]
[null,0,"Soldates",null,null,"ne pas modifier si dessus",null,null,"ne pas modifier si dessus",null,null,null,null,null,null,null,null,null,"ne pas modifier si dessus",null,"ne pas modifier si dessus",null,null,"ne pas modifier si dessus"]
[null,0,"Concierges",null,null,"DEFENSE brut",null,"bonus AR",null,null,null,"EXE",null,null,null,null,null,null,"TOTAL DEFENSE",null,"diff : def/fdf",null,null,"diff : def/ vie"]
[null,0,"Concierges d'élites",null,null,{"$f":"(S6*2)+(S7*4)+(S8*6)+(S9*9)+(S10*14)+(S11*25)+(S12*35)+(S13*15)+(S14*18)+(S15*23)+(S16*1)+(S17*1)+(S18*50)+(S19*55)","v":0},null,"(+",{"$f":"S30-F30","v":0},")",null,null,null,null,null,null,null,null,{"$f":"F30*(10+L24)/10","v":0},null,{"$f":"((S30-S24)/S24)*100","v":{"$error":"#DIV/0!"}},"%",null,{"$f":"((S30-S27)/S27)*100","v":{"$error":"#DIV/0!"}},"%"]
[null,0,"Artilleuses",null,null,"ne pas modifier si dessus",null,null,"ne pas modifier si dessus",null,null,null,null,null,null,null,null,null,"ne pas modifier si dessus",null,"ne pas modifier si dessus",null,null,"ne pas modifier si dessus"]
[null,0,"Artilleuses d'élites",null,null,"TOTAL DE FOURMIS",null,null,null,null,null,null,null,null,null,null,null,null,null,null,"DOME \n(notez si dessous)",null,null,"LOGE \n(notez si dessous)"]
[null,0,"Soldates d'élites",null,null,{"$f":"SUM(S6:S19)","v":0},null,null,null,null,null,null,null,null,null,null,null,null,null,null,0,null,null,0]
[null,0,"Tanks ",null,null,"                                                                                                 ne pas modifier si dessus",null,null,null,null,null,null,null,null,null,null,null,null,"i-sork 2013"]
[null,0,"Tanks d'élites",null,null,"RESUME \n(si vous devez envoyer ces informations copiez/collez la zone blanche et envoyez par mp -ATTENTION REVELER SON ARMEE COMPORTE UN RISQUE restez vigilant-)",null,null,null,null,null,null,null,null,null,null,null,null,null,null,"Bonus de bouclier ",null,null,"Bonus de bouclier"]
[null,0,"Tueuses ",null,null,null,null,null,null,null,null,null,null,null,null,null,null,null,null,"+",{"$f":"U39-S27","v":0},null,"+",{"$f":"X39-S27","v":0}]
[null,0,"Tueuses d'élites",null,null,null,null,null,null,null,null,null,null,null,null,null,null,null,null,null,"ne pas modifier si dessus",null,null,"ne pas modifier si dessus"]
[null,null,null,null,null,"date :",null,null,{"$f":"D3","v":"2013-11-24"},null,null,null,null,null,null,null,null,null,null,null,"TOTAL DE VIE \nEN DOME",null,null,"TOTAL DE VIE \nEN LOGE"]
[null,"fdf notez ici","vie notez ici",null,null,"Vous avez actuellement un total de fourmis de :",null,null,null,null,null,null,null,null,null,null,null,null,null,null,{"$f":"F27*(1+0.1*L27+0.1+0.05*U33)","v":0},null,null,{"$f":"F27*(1+0.1*L27+0.3+0.15*X33)","v":0}]
[null,0,0,null,null,{"$f":"F33","v":0}]
[null,"def notez ici",null,null,null,"Vous avez actuellement :",null,null,null,null,null,null,null,null,null,null,null,null,null,null,"ne pas modifier si dessus",null,null,"ne pas modifier si dessus"]
[null,0,null,null,null,{"$f":"U44","v":0},"ouvrières",null,null,null,null,null,null,null,null,null,null,null,null,null,"NOMBRE D'OUVRIERES \n(notez si dessous)"]
[null,null,null,null,null,"Avec  un nombre total de :"]
[null,null,null,null,null,null,null,null,null,null,null,null,null,null,null,null,null,null,null,null,0]
[null,null,null,null,null,{"$f":"S6","v":0},"jeunes Soldate naines--",null,null,"soit",null,{"$f":"U6","v":100},"%"," ------- selon le ratio 100% JSN"]
[null,null,null,null,null,{"$f":"S7","v":0},"Soldates Naines---------",null,null,"soit",null,{"$f":"U7","v":{"$error":"#DIV/0!"}},"%"," ------- selon le ratio 100% JSN"]
[null,null,null,null,null,0,"Naines d'Elites----------",null,null,"soit",null,{"$f":"U8","v":{"$error":"#DIV/0!"}},"%"," ------- selon le ratio 100% JSN",null,null,null,null,null,null,"VOTRE VA\n (notez si dessous)"]
[null,null,null,null,null,0,"Jeunes Soldates---------",null,null,"soit",null,{"$f":"U9","v":{"$error":"#DIV/0!"}},"%"," ------- selon le ratio 100% JSN"]
[null,null,null,null,null,0,"Soldates------------------",null,null,"soit",null,{"$f":"U10","v":{"$error":"#DIV/0!"}},"%"," ------- selon le ratio 100% JSN",null,null,null,null,null,null,0]
[null,null,null,null,null,0,"Concierges---------------",null,null,"soit",null,{"$f":"U11","v":{"$error":"#DIV/0!"}},"%"," ------- selon le ratio 100% JSN"]
[null,null,null,null,null,0,"Concierges d'élites-----",null,null,"soit",null,{"$f":"U12","v":{"$error":"#DIV/0!"}},"%"," ------- selon le ratio 100% JSN"]
[null,null,null,null,null,0,"Artilleuses----------------",null,null,"soit",null,{"$f":"U13","v":{"$error":"#DIV/0!"}},"%"," ------- selon le ratio 100% JSN",null,null,null,null,null,null,"VOTRE VC \n(notez si dessous)"]
[null,null,null,null,null,0,"Artilleuses d'élites------",null,null,"soit",null,{"$f":"U14","v":{"$error":"#DIV/0!"}},"%"," ------- selon le ratio 100% JSN"]
[null,null,null,null,null,0,"Soldates d'élites--------",null,null,"soit",null,{"$f":"U15","v":{"$error":"#DIV/0!"}},"%"," ------- selon le ratio 100% JSN",null,null,null,null,null,null,0]
[null,null,null,null,null,0,"Tanks ---------------------",null,null,"soit",null,{"$f":"U16","v":{"$error":"#DIV/0!"}},"%"," ------- selon le ratio 100% JSN"]
[null,null,null,null,null,0,"Tanks d'élites------------",null,null,"soit",null,{"$f":"U17","v":{"$error":"#DIV/0!"}},"%"," ------- selon le ratio 100% JSN"]
[null,null,null,null,null,0,"Tueuses ------------------",null,null,"soit",null,{"$f":"U18","v":{"$error":"#DIV/0!"}},"%"," ------- selon le ratio 100% JSN",null,null,null,null,null,null,"VOTRE Niveau de TDP\n(indiquez le niveau uniquement)"]
[null,null,null,null,null,0,"Tueuses d'élites---------",null,null,"soit",null,{"$f":"U19","v":{"$error":"#DIV/0!"}},"%"," ------- selon le ratio 100% JSN"]
[null,null,null,null,null,null,null,null,null,null,null,null,null,null,null,null,null,null,null,null,{"$f":"VLOOKUP(X59,tdp!A3:B102,2,FALSE)","v":{"$error":"#N/A"}},null,null,0]
[null,null,null,null,null,"Vous avez une arme de niveau :",null,null,{"$f":"L24","v":0}]
[null,null,null,null,null,"Vous avez un bouclier de niveau :",null,null,{"$f":"L27","v":0},null,null,null,null,null,null,null,null,null,null,null,"ne pas modifier si dessus",null,null,"notez si dessus"]
[null,null,null,null,null,"Vous avez un Dôme de niveau :",null,null,{"$f":"U33","v":0}]
[null,null,null,null,null,"Vous avez une Loge Impèriale de niveau :",null,null,{"$f":"X33","v":0}]
[]
[null,null,null,null,null,"Vous avez une bonus de vie en Dôme de  :",null,{"$f":"U36","v":0}]
[null,null,null,null,null,"soit un total de vie en dôme de  :",null,{"$f":"U39","v":0}]
[null,null,null,null,null,"Vous avez un bonus de vie en Loge de :",null,{"$f":"X36","v":0}]
[null,null,null,null,null,"soit un total de vie en loge de :",null,{"$f":"X39","v":0}]
[]
[null,null,null,null,null,"Vous avez une force de frappe brut de : ",null,{"$f":"F24","v":0}]
[null,null,null,null,null,"Vous avez une vie brut de :",null,{"$f":"F27","v":0}]
[null,null,null,null,null,"Vous avez une force de défense brut de : ",null,{"$f":"F30","v":0}]
[]
[null,null,null,null,null,"A cela s'ajoute :"]
[]
[null,null,null,null,null,"Le bonus d'arme en force de frappe de :",null,null,{"$f":"I24","v":0}]
[null,null,null,null,null,"Le bonus d'arme en défense de :",null,null,{"$f":"I30","v":0}]
[null,null,null,null,null,"Le bonus de bouclier en vie de :",null,null,{"$f":"I27","v":0}]
[]
[null,null,null,null,null,"Soit :"]
[]
[null,null,null,null,null,"Une force de frappe totale de :",null,null,{"$f":"S24","v":0}]
[null,null,null,null,null,"Ce qui représente :",null,null,{"$f":"U24","v":{"$error":"#DIV/0!"}},"%",null,"de différence, entre, la force de frappe et la vie"]
[null,null,null,null,null,"Aussi :",null,null,{"$f":"X24","v":{"$error":"#DIV/0!"}},"%",null,"de différence, entre, la force de frappe et la force de défense"]
[]
[null,null,null,null,null,"Une vie totale de :",null,null,{"$f":"S27","v":0}]
[null,null,null,null,null,"Ce qui représente :",null,null,{"$f":"U27","v":{"$error":"#DIV/0!"}},"%",null,"de différence, entre, la vie et la force de frappe"]
[null,null,null,null,null,"Aussi :",null,null,{"$f":"X27","v":{"$error":"#DIV/0!"}},"%",null,"de différence, entre, la vie et la force de défense"]
[]
[]
[null,null,null,null,null,"Une force de défense totale de :",null,null,{"$f":"S30","v":0}]
[null,null,null,null,null,"Ce qui représente :",null,null,{"$f":"U30","v":{"$error":"#DIV/0!"}},"%",null,"de différence, entre la force de défense et la force de frappe"]
[null,null,null,null,null,"Aussi :",null,null,{"$f":"X30","v":{"$error":"#DIV/0!"}},"%",null,"de différence, entre la force de défense et la vie"]
[]
[null,null,null,null,null,"Votre niveau de vitesse d'Attaque est de :",null,null,{"$f":"U49","v":0}]
[null,null,null,null,null,"votre niveau de Vitesse de Chasse est de :",null,null,{"$f":"U54","v":0}]
[]
[null,null,null,null,null,"Votre temps de ponte est d'actuellement :",null,null,{"$f":"U59","v":{"$error":"#N/A"}},"pour 1 ouvrière"]
[null,null,null,null,null,"niveau TDP",null,null,{"$f":"X59","v":0}]

{"sheet":"Auto sur sonde","index":1,"n_rows":54,"n_cols":18,"rows_kept":54,"cut":false,"hidden":false,"merged":[[52,2,52,3],[52,4,52,5],[53,2,53,3],[53,4,53,5],[49,2,49,3],[49,4,49,5],[50,2,50,3],[50,4,50,5],[45,2,45,3],[45,4,45,5],[51,2,51,3],[51,4,51,5],[46,2,46,3],[46,4,46,5],[47,2,47,3],[47,4,47,5],[48,2,48,3],[48,4,48,5],[44,2,44,3],[44,4,44,5],[44,7,44,9],[43,7,43,10],[39,7,39,10],[40,2,40,3],[40,4,40,5],[40,7,40,9],[41,2,41,3],[41,4,41,5],[42,2,42,3],[42,4,42,5],[43,2,43,3],[35,6,38,6],[38,2,38,3],[38,4,38,5],[39,2,39,3],[39,4,39,5],[43,4,43,5],[27,3,27,5],[27,6,27,7],[29,1,29,2],[29,6,29,7],[26,4,26,5],[26,6,26,7],[26,1,26,2],[25,1,25,2],[25,4,25,5],[16,8,16,9],[5,13,5,16],[21,8,21,10],[7,8,7,11],[15,8,15,10],[17,8,17,10],[14,8,14,9],[15,11,15,12],[30,6,30,7],[18,8,18,9],[25,6,25,7],[19,8,19,10],[7,17,7,21],[0,1,0,11],[13,8,13,9],[4,1,4,11],[12,8,12,9],[1,1,1,4],[3,1,3,11],[5,1,5,4],[8,8,8,11]]}
[null,"ANALYSE  RC de sonde et CALCUL D'OPTI XP"]
[null,"Rapport de sonde :"]
[]
[null,"  \n\nVous attaquez la fourmilière de polak60\n\nTroupes en attaque:100 Jeunes Soldates Naines.\nTroupes en défense:40 156 Jeunes Soldates Naines, 7 328 Soldates Naines, 5 347 Naines d'Elites, 34 291 Jeunes Soldates, 12 274 Soldates, 9 450 Concierges, 9 403 Artilleuses, 247 Artilleuses d'élites, 585 Soldates d'élites.\n\nVous infligez 300(+360) dégâts et tuez 31 ennemies.\nL’ennemie inflige 1 017 357(+1 119 093) dégâts à vos fourmis et en tue 100.\n\nVous avez infiltré l’ennemi. Les informations sont bien rentrées... mais pas vos soldates !\nVos troupes ont échoué\n\n"]
[null,"Supprimez le contenu de la cellule, puis copier un RC de sonde, qui a échoué (vous n'avez pas tué tous les ennemis^^) dans la cellule (et non sur la cellule -> double clic pour avoir le curseur texte)"]
[null,"Ennemi :",null,null,null,null,null,null,null,null,null,null,null,"Extraction des données du RC :"]
[]
[null,"Type d'unité","Nb unité","Att HB","Def HB","Vie HB","Modifier nb unité",null,"Mode d'emploi :",null,null,null,null,"Nb unité","Nb tué","Position","Suivant","Texte à Analyser"]
[null,"Jeune Soldate Naine",{"$f":"IF(G9>0,G9,N9-O9)","v":40125},{"$f":"Data!C5*$N9","v":120468},{"$f":"Data!D5*$N9","v":80312},{"$f":"Data!E5*$N9","v":321248},null,null,null,null,null,null,null,{"$f":"IF((P9>0),VALUE(SUBSTITUTE(MID(R9,1,(P9-1)),\" \",\"\")),0)","v":40156},{"$f":"MIN(Q$26-0,N9)","v":31},{"$f":"IF(ISERROR(SEARCH(Data!F5,R9)),IF(ISERROR(SEARCH(Data!G5,R9)),0,SEARCH(Data!G5,R9)),SEARCH(Data!F5,R9))","v":8},{"$f":"IF(ISERROR(SEARCH(\",\",R9,P9)),IF(ISERROR(SEARCH(\".\",R9,P9)),0,(SEARCH(\".\",R9,P9)+2)),(SEARCH(\",\",R9,P9)+2))","v":32},{"$f":"MID(B4,(SEARCH(\"Troupes en défense\",B4)+19),SEARCH(\".\",MID(B4,(SEARCH(\"Troupes en défense\",B4)+19),1000)))","v":"40 156 Jeunes Soldates Naines, 7 328 Soldates Naines, 5 347 Naines d'Elites, 34 291 Jeunes Soldates, 12 274 Soldates, 9 450 Concierges, 9 403 Artilleuses, 247 Artilleuses d'élites, 585 Soldates d'élites."}]
[null,"Soldate Naine",null,{"$f":"Data!C6*$N10","v":36640},{"$f":"Data!D6*$N10","v":29312},{"$f":"Data!E6*$N10","v":73280},null,null,"1/ Copier le RC de la sonde",null,null,null,null,{"$f":"IF((P10>0),VALUE(SUBSTITUTE(MID(R10,1,(P10-1)),\" \",\"\")),0)","v":7328},{"$f":"MIN(Q$26-SUM(O$9:O9),N10)","v":0},{"$f":"IF(ISERROR(SEARCH(Data!F6,R10)),IF(ISERROR(SEARCH(Data!G6,R10)),0,SEARCH(Data!G6,R10)),SEARCH(Data!F6,R10))","v":7},24,{"$f":"IF(((P9+Q9)>0),MID(R9,Q9,5000),R9)","v":"7 328 Soldates Naines, 5 347 Naines d'Elites, 34 291 Jeunes Soldates, 12 274 Soldates, 9 450 Concierges, 9 403 Artilleuses, 247 Artilleuses d'élites, 585 Soldates d'élites."}]
[null,"Naine d'Elite",{"$f":"IF(G11>0,G11,N11-O11)","v":5347},{"$f":"Data!C7*$N11","v":37429},{"$f":"Data!D7*$N11","v":32082},{"$f":"Data!E7*$N11","v":69511},null,null,"2/ Renseigner \"Mon niveau\" Armes et Bouclier",null,null,null,null,5347,{"$f":"MIN(Q$26-SUM(O$9:O10),N11)","v":0},{"$f":"IF(ISERROR(SEARCH(Data!F7,R11)),IF(ISERROR(SEARCH(Data!G7,R11)),0,SEARCH(Data!G7,R11)),SEARCH(Data!F7,R11))","v":7},24,"5 347 Naines d'Elites, 34 291 Jeunes Soldates, 12 274 Soldates, 9 450 Concierges, 9 403 Artilleuses, 247 Artilleuses d'élites, 585 Soldates d'élites."]
[null,"Jeune Soldate",34291,{"$f":"Data!C8*$N12","v":342910},{"$f":"Data!D8*$N12","v":308619},{"$f":"Data!E8*$N12","v":548656},null,null,"3/ Saisir les unités à envoyer",null,null,null,null,34291,{"$f":"MIN(Q$26-SUM(O$9:O11),N12)","v":0},{"$f":"IF(ISERROR(SEARCH(Data!F8,R12)),IF(ISERROR(SEARCH(Data!G8,R12)),0,SEARCH(Data!G8,R12)),SEARCH(Data!F8,R12))","v":8},25,"34 291 Jeunes Soldates, 12 274 Soldates, 9 450 Concierges, 9 403 Artilleuses, 247 Artilleuses d'élites, 585 Soldates d'élites."]
[null,"Soldate",12274,{"$f":"Data!C9*$N13","v":184110},{"$f":"Data!D9*$N13","v":171836},{"$f":"Data!E9*$N13","v":245480},null,null,null,null,null,null,null,12274,{"$f":"MIN(Q$26-SUM(O$9:O12),N13)","v":0},{"$f":"IF(ISERROR(SEARCH(Data!F9,R13)),IF(ISERROR(SEARCH(Data!G9,R13)),0,SEARCH(Data!G9,R13)),SEARCH(Data!F9,R13))","v":8},18,"12 274 Soldates, 9 450 Concierges, 9 403 Artilleuses, 247 Artilleuses d'élites, 585 Soldates d'élites."]
[null,"Concierge",9450,{"$f":"Data!C10*$N14","v":9450},{"$f":"Data!D10*$N14","v":236250},{"$f":"Data!E10*$N14","v":283500},0,null,"Légende",null,null,null,null,9450,{"$f":"MIN(Q$26-SUM(O$9:O13),N14)","v":0},{"$f":"IF(ISERROR(SEARCH(Data!F10,R14)),IF(ISERROR(SEARCH(Data!G10,R14)),0,SEARCH(Data!G10,R14)),SEARCH(Data!F10,R14))","v":7},19,"9 450 Concierges, 9 403 Artilleuses, 247 Artilleuses d'élites, 585 Soldates d'élites."]
[null,"Concierge d'élite",0,{"$f":"Data!C11*$N15","v":0},{"$f":"Data!D11*$N15","v":0},{"$f":"Data!E11*$N15","v":0},null,null,null,null,null,null,null,0,{"$f":"MIN(Q$26-SUM(O$9:O14),N15)","v":0},{"$f":"IF(ISERROR(SEARCH(Data!F11,R15)),IF(ISERROR(SEARCH(Data!G11,R15)),0,SEARCH(Data!G11,R15)),SEARCH(Data!F11,R15))","v":0},0,"9 403 Artilleuses, 247 Artilleuses d'élites, 585 Soldates d'élites."]
[null,"Artilleuse",9403,{"$f":"Data!C12*$N16","v":282090},{"$f":"Data!D12*$N16","v":141045},{"$f":"Data!E12*$N16","v":94030},null,null,"cellule à renseigner",null,null," (les seules à modifier)",null,9403,{"$f":"MIN(Q$26-SUM(O$9:O15),N16)","v":0},{"$f":"IF(ISERROR(SEARCH(Data!F12,R16)),IF(ISERROR(SEARCH(Data!G12,R16)),0,SEARCH(Data!G12,R16)),SEARCH(Data!F12,R16))","v":7},20,"9 403 Artilleuses, 247 Artilleuses d'élites, 585 Soldates d'élites."]
[null,"Artilleuse d'élite",247,{"$f":"Data!C13*$N17","v":8645},{"$f":"Data!D13*$N17","v":4446},{"$f":"Data!E13*$N17","v":2964},null,null,null,null,null,null,null,247,{"$f":"MIN(Q$26-SUM(O$9:O16),N17)","v":0},{"$f":"IF(ISERROR(SEARCH(Data!F13,R17)),IF(ISERROR(SEARCH(Data!G13,R17)),0,SEARCH(Data!G13,R17)),SEARCH(Data!F13,R17))","v":5},27,"247 Artilleuses d'élites, 585 Soldates d'élites."]
[null,"Soldate d'élite",585,{"$f":"Data!C14*$N18","v":14040},{"$f":"Data!D14*$N18","v":13455},{"$f":"Data!E14*$N18","v":15795},null,null,"résultat de calcul",null,null,null,null,585,{"$f":"MIN(Q$26-SUM(O$9:O17),N18)","v":0},{"$f":"IF(ISERROR(SEARCH(Data!F14,R18)),IF(ISERROR(SEARCH(Data!G14,R18)),0,SEARCH(Data!G14,R18)),SEARCH(Data!F14,R18))","v":5},24,"585 Soldates d'élites."]
[null,"Tank",0,{"$f":"Data!C15*$N19","v":0},{"$f":"Data!D15*$N19","v":0},{"$f":"Data!E15*$N19","v":0},null,null,null,null,null,null,null,0,{"$f":"MIN(Q$26-SUM(O$9:O18),N19)","v":0},{"$f":"IF(ISERROR(SEARCH(Data!F15,R19)),IF(ISERROR(SEARCH(Data!G15,R19)),0,SEARCH(Data!G15,R19)),SEARCH(Data!F15,R19))","v":0},0,""]
[null,"Tank d'élite",0,{"$f":"Data!C16*$N20","v":0},{"$f":"Data!D16*$N20","v":0},{"$f":"Data!E16*$N20","v":0},null,null,"Titre",null,null,null,null,0,{"$f":"MIN(Q$26-SUM(O$9:O19),N20)","v":0},{"$f":"IF(ISERROR(SEARCH(Data!F16,R20)),IF(ISERROR(SEARCH(Data!G16,R20)),0,SEARCH(Data!G16,R20)),SEARCH(Data!F16,R20))","v":0},0,""]
[null,"Tueuse",0,{"$f":"Data!C17*$N21","v":0},{"$f":"Data!D17*$N21","v":0},{"$f":"Data!E17*$N21","v":0},null,null,null,null,null,null,null,0,{"$f":"MIN(Q$26-SUM(O$9:O20),N21)","v":0},{"$f":"IF(ISERROR(SEARCH(Data!F17,R21)),IF(ISERROR(SEARCH(Data!G17,R21)),0,SEARCH(Data!G17,R21)),SEARCH(Data!F17,R21))","v":0},0,""]
[null,"Tueuse d'élite",0,{"$f":"Data!C18*$N22","v":0},{"$f":"Data!D18*$N22","v":0},{"$f":"Data!E18*$N22","v":0},null,null,"Titre ou résultat de calcul",null,null,null,null,0,{"$f":"MIN(Q$26-SUM(O$9:O21),N22)","v":0},{"$f":"IF(ISERROR(SEARCH(Data!F18,R22)),IF(ISERROR(SEARCH(Data!G18,R22)),0,SEARCH(Data!G18,R22)),SEARCH(Data!F18,R22))","v":0},0,""]
[null,"TOTAUX :",{"$f":"SUM(N9:N22)","v":119081},{"$f":"SUM(D9:D22)","v":1035782},{"$f":"SUM(E9:E22)","v":1017357},{"$f":"SUM(F9:F22)","v":1654464}]
[null,null,null,null,null,null,null,null,null,null,null,null,null,null,null,null,"Valeur","Extraction du texte"]
[null,null,null,null,null,null,null,null,null,null,null,null,null,null,null,"Dégâts sonde :",{"$f":"VALUE(SUBSTITUTE(MID(R25,1,(SEARCH(\"(\",R25)-1)),\" \",\"\")+VALUE(SUBSTITUTE(MID(R25,(SEARCH(\"(\",R25)+2),((SEARCH(\")\",R25)-SEARCH(\"(\",R25))-2)),\" \",\"\")))","v":660},{"$f":"MID(B4,(SEARCH(\"Vous infligez\",B4)+14),((SEARCH(\"dégâts\",B4)-SEARCH(\"Vous infligez\",B4))-14))","v":"300(+360) "}]
[null,"Multiplicateur vie ennemi : ",null,{"$f":"ROUND(((Q25/SUMPRODUCT(O9:O22,Data!E5:E18))*20),0)/20","v":2.65},"Vie HB x 3 : ",null,{"$f":"F23*3","v":4963392},null,null,null,null,null,null,null,null,"Pertes ennemi :",{"$f":"R26","v":31},{"$f":"VALUE(SUBSTITUTE(MID(B4,(SEARCH(\"dégâts\",B4)+14),((SEARCH(\"ennemies.\",B4)-SEARCH(\"dégâts\",B4))-14)),\" \",\"\"))","v":31}]
[null,{"$f":"CONCATENATE(\"(\",MID(MID(B4,(SEARCH(\"Vous attaquez\",B4)+14),100),1,(SEARCH(\"de\",MID(B4,(SEARCH(\"Vous attaquez\",B4)+14),100))-2)),\")    \")","v":"(la fourmilière)    "},null,null,"Vie AB lieu de la sonde : ",null,{"$f":"F23*D26","v":4384329.5999999996}]
[null,null,null,"FdF AB nécessaire pour réplique 10% : ",null,null,{"$f":"MAX(G26:H27)","v":4963392},null,null,null,null,null,null,null,null,null,"Valeur","Extraction du texte"]
[null,null,null,null,null,null,null,null,null,null,null,null,null,null,null,"Dégâts def AB :",{"$f":"VALUE(SUBSTITUTE(MID(R29,1,(SEARCH(\"(\",R29)-1)),\" \",\"\")) + VALUE(SUBSTITUTE(MID(R29,(SEARCH(\"(\",R29)+2),((SEARCH(\")\",R29)-SEARCH(\"(\",R29))-2)),\" \",\"\"))","v":2136450},{"$f":"MID(B4,(SEARCH(\" inflige \",B4)+9),((SEARCH(\"dégâts à vos\",B4)-SEARCH(\" inflige \",B4))-10))","v":"1 017 357(+1 119 093)"}]
[null,"Armes de l'ennemi : ",null,{"$f":"ROUND((((Q29-Q30)/Q30)*10),0)","v":11},null,"Défense AB : ",{"$f":"E23*(1+(D30/10))","v":2136449.7000000002},null,null,null,null,null,null,null,null,"Dégâts def HB :",{"$f":"VALUE(SUBSTITUTE(MID(R29,1,(SEARCH(\"(\",R29)-1)),\" \",\"\"))","v":1017357}]
[null,null,null,null,null,"Réplique 10% : ",{"$f":"G30/10","v":213644.97000000003}]
[]
[]
[null,"Calcul attaque à lancer :"]
[]
[null,"Mon niveau Armes :",12,null,null,null,"Nb unité à ajouter pour compléter la FdF nécessaire"]
[null,"Mon niveau Bouclier :",11]
[]
[null,"Type d'unité","Nb unité envoyées",null,"Att AB"]
[null,"Jeune Soldate Naine",null,null,{"$f":"(Data!C5*$C40)*(1+(C$36/10))","v":0},null,{"$f":"IF((H$45>E$54),((H$45-E$54)/(Data!C5*(1+('Auto sur sonde'!C$36/10)))),\"FdF suffisante\")","v":752029.09090909082},"JSN nécessaires en cas de réplique à 10% :"]
[null,"Soldate Naine",null,null,{"$f":"(Data!C6*$C41)*(1+(C$36/10))","v":0},null,{"$f":"IF((H$45>E$54),((H$45-E$54)/(Data!C6*(1+('Auto sur sonde'!C$36/10)))),\"FdF suffisante\")","v":451217.45454545453},{"$f":"ROUNDUP((G31/(Data!E5*(1+(C37/10)))),0)","v":12717},null,null,{"$f":"IF((C40>H41),\"OK\",\"Alerte !\")","v":"Alerte !"}]
[null,"Naine d'Elite",null,null,{"$f":"(Data!C7*$C42)*(1+(C$36/10))","v":0},null,{"$f":"IF((H$45>E$54),((H$45-E$54)/(Data!C7*(1+('Auto sur sonde'!C$36/10)))),\"FdF suffisante\")","v":322298.18181818177}]
[null,"Jeune Soldate",null,null,{"$f":"(Data!C8*$C43)*(1+(C$36/10))","v":0},null,{"$f":"IF((H$45>E$54),((H$45-E$54)/(Data!C8*(1+('Auto sur sonde'!C$36/10)))),\"FdF suffisante\")","v":225608.72727272726}]
[null,"Soldate",null,null,{"$f":"(Data!C9*$C44)*(1+(C$36/10))","v":0},null,{"$f":"IF((H$45>E$54),((H$45-E$54)/(Data!C9*(1+('Auto sur sonde'!C$36/10)))),\"FdF suffisante\")","v":150405.81818181818},"FdF AB nécessaire pour réplique 10% :"]
[null,"Concierge",null,null,{"$f":"(Data!C10*$C45)*(1+(C$36/10))","v":0},null,{"$f":"IF((H$45>E$54),((H$45-E$54)/(Data!C10*(1+('Auto sur sonde'!C$36/10)))),\"FdF suffisante\")","v":2256087.2727272725},{"$f":"G28","v":4963392},null,null,{"$f":"IF((E54>H45),\"OK\",\"Alerte !\")","v":"Alerte !"}]
[null,"Concierge d'élite",null,null,{"$f":"(Data!C11*$C46)*(1+(C$36/10))","v":0},null,{"$f":"IF((H$45>E$54),((H$45-E$54)/(Data!C11*(1+('Auto sur sonde'!C$36/10)))),\"FdF suffisante\")","v":2256087.2727272725}]
[null,"Artilleuse",null,null,{"$f":"(Data!C12*$C47)*(1+(C$36/10))","v":0},null,{"$f":"IF((H$45>E$54),((H$45-E$54)/(Data!C12*(1+('Auto sur sonde'!C$36/10)))),\"FdF suffisante\")","v":75202.909090909088}]
[null,"Artilleuse d'élite",null,null,{"$f":"(Data!C13*$C48)*(1+(C$36/10))","v":0},null,{"$f":"IF((H$45>E$54),((H$45-E$54)/(Data!C13*(1+('Auto sur sonde'!C$36/10)))),\"FdF suffisante\")","v":64459.63636363636}]
[null,"Soldate d'élite",null,null,{"$f":"(Data!C14*$C49)*(1+(C$36/10))","v":0},null,{"$f":"IF((H$45>E$54),((H$45-E$54)/(Data!C14*(1+('Auto sur sonde'!C$36/10)))),\"FdF suffisante\")","v":94003.636363636353}]
[null,"Tank",null,null,{"$f":"(Data!C15*$C50)*(1+(C$36/10))","v":0},null,{"$f":"IF((H$45>E$54),((H$45-E$54)/(Data!C15*(1+('Auto sur sonde'!C$36/10)))),\"FdF suffisante\")","v":41019.768595041314}]
[null,"Tank d'élite",null,null,{"$f":"(Data!C16*$C51)*(1+(C$36/10))","v":0},null,{"$f":"IF((H$45>E$54),((H$45-E$54)/(Data!C16*(1+('Auto sur sonde'!C$36/10)))),\"FdF suffisante\")","v":28201.090909090908}]
[null,"Tueuse",null,null,{"$f":"(Data!C17*$C52)*(1+(C$36/10))","v":0},null,{"$f":"IF((H$45>E$54),((H$45-E$54)/(Data!C17*(1+('Auto sur sonde'!C$36/10)))),\"FdF suffisante\")","v":45121.745454545446}]
[null,"Tueuse d'élite",null,null,{"$f":"(Data!C18*$C53)*(1+(C$36/10))","v":0},null,{"$f":"IF((H$45>E$54),((H$45-E$54)/(Data!C18*(1+('Auto sur sonde'!C$36/10)))),\"FdF suffisante\")","v":41019.768595041314}]
[null,"TOTAUX :",{"$f":"SUM(C40:C53)","v":0},null,{"$f":"SUM(E40:E53)","v":0}]

{"sheet":"Manuel","index":2,"n_rows":57,"n_cols":17,"rows_kept":57,"cut":false,"hidden":false,"merged":[[11,16,11,20],[12,16,12,20],[19,16,19,20],[20,16,20,20],[21,16,21,20],[13,16,13,20],[14,16,14,20],[15,16,15,20],[16,16,16,20],[17,16,17,20],[18,16,18,20],[0,1,0,11],[50,9,50,11],[51,9,51,12],[52,9,52,11],[38,6,40,7],[14,8,14,9],[42,9,42,12],[48,9,48,12],[49,9,49,12],[18,8,18,10],[27,10,27,11],[1,1,1,4],[4,1,4,11],[5,1,5,4],[8,8,8,11],[3,1,3,11],[7,8,7,11],[5,14,5,16],[24,6,24,7],[12,8,12,12],[13,8,13,12],[19,8,19,10],[16,11,16,12],[11,8,11,12],[16,8,16,10],[17,8,17,10],[15,8,15,9],[10,8,10,12],[9,8,9,12],[7,16,7,20],[8,16,8,20],[9,16,9,20],[10,16,10,20],[29,1,29,2],[28,1,28,2],[24,4,24,5],[32,1,32,2],[29,6,29,7],[26,4,26,5],[26,6,26,7],[26,1,26,2],[25,1,25,2],[24,1,24,2],[43,9,43,12],[43,2,43,3],[43,4,43,5],[44,9,44,11],[41,2,41,3],[41,4,41,5],[42,2,42,3],[42,4,42,5],[44,2,44,3],[44,4,44,5],[47,2,47,3],[47,4,47,5],[46,9,46,11],[45,9,45,12],[46,2,46,3],[45,2,45,3],[45,4,45,5],[54,4,54,5],[49,2,49,3],[49,4,49,5],[50,2,50,3],[50,4,50,5],[51,2,51,3],[51,4,51,5],[24,8,24,11],[26,10,26,11],[27,6,27,7],[28,4,28,7],[25,8,25,11],[27,4,27,5],[56,2,56,3],[56,4,56,5],[30,6,30,7],[26,8,26,9],[27,8,27,9],[53,2,53,3],[53,4,53,5],[55,2,55,3],[55,4,55,5],[52,2,52,3],[52,4,52,5],[48,2,48,3],[48,4,48,5],[46,4,46,5],[54,2,54,3]]}
[null,"Petit tableur pour calculer une opti d'Xp..."]
[null,"Import d'armée :"]
[]
[null,"40 156 Jeunes Soldates Naines, 7 328 Soldates Naines, 5 347 Naines d'Elites, 34 291 Jeunes Soldates, 12 274 Soldates, 9 450 Concierges, 9 403 Artilleuses, 247 Artilleuses d'élites, 585 Soldates d'élites.\n"]
[null,"Supprimez le contenu de la cellule, puis copier une armée, unités séparées par des virgules ou points."]
[null,"Ennemi :",null,null,null,null,null,null,null,null,null,null,null,null,"Extraction des données armée :"]
[]
[null,"Type d'unité","Nb unité","Nb unité","Att HB","Def HB","Vie HB",null,"Mode d'emploi :",null,null,null,null,null,"Position","Suivant","Texte à Analyser"]
[null,"Jeune Soldate Naine",null,{"$f":"IF(C9=0,IF((O9>0),VALUE(SUBSTITUTE(MID(Q9,1,(O9-1)),\" \",\"\")),0),C9)","v":40156},{"$f":"Data!C5*$D9","v":120468},{"$f":"Data!D5*$D9","v":80312},{"$f":"Data!E5*$D9","v":321248},null,null,null,null,null,null,null,{"$f":"IF(ISERROR(SEARCH(Data!F5,Q9)),IF(ISERROR(SEARCH(Data!G5,Q9)),0,SEARCH(Data!G5,Q9)),SEARCH(Data!F5,Q9))","v":8},{"$f":"IF(ISERROR(SEARCH(\",\",Q9,O9)),IF(ISERROR(SEARCH(\".\",Q9,O9)),0,(SEARCH(\".\",Q9,O9)+2)),(SEARCH(\",\",Q9,O9)+2))","v":32},{"$f":"B4","v":"40 156 Jeunes Soldates Naines, 7 328 Soldates Naines, 5 347 Naines d'Elites, 34 291 Jeunes Soldates, 12 274 Soldates, 9 450 Concierges, 9 403 Artilleuses, 247 Artilleuses d'élites, 585 Soldates d'élites.\n"}]
[null,"Soldate Naine",null,{"$f":"IF(C10=0,IF((O10>0),VALUE(SUBSTITUTE(MID(Q10,1,(O10-1)),\" \",\"\")),0),C10)","v":7328},{"$f":"Data!C6*$D10","v":36640},{"$f":"Data!D6*$D10","v":29312},{"$f":"Data!E6*$D10","v":73280},null,"1/ Copier l'armée ou remplir le nombre d'unité",null,null,null,null,null,{"$f":"IF(ISERROR(SEARCH(Data!F6,Q10)),IF(ISERROR(SEARCH(Data!G6,Q10)),0,SEARCH(Data!G6,Q10)),SEARCH(Data!F6,Q10))","v":7},24,{"$f":"IF(((O9+P9)>0),MID(Q9,P9,5000),Q9)","v":"7 328 Soldates Naines, 5 347 Naines d'Elites, 34 291 Jeunes Soldates, 12 274 Soldates, 9 450 Concierges, 9 403 Artilleuses, 247 Artilleuses d'élites, 585 Soldates d'élites.\n"}]
[null,"Naine d'Elite",null,5347,{"$f":"Data!C7*$D11","v":37429},{"$f":"Data!D7*$D11","v":32082},{"$f":"Data!E7*$D11","v":69511},null,"    (les valeurs saisies ont la priorité sur les valeurs importées).",null,null,null,null,null,{"$f":"IF(ISERROR(SEARCH(Data!F7,Q11)),IF(ISERROR(SEARCH(Data!G7,Q11)),0,SEARCH(Data!G7,Q11)),SEARCH(Data!F7,Q11))","v":7},24,"5 347 Naines d'Elites, 34 291 Jeunes Soldates, 12 274 Soldates, 9 450 Concierges, 9 403 Artilleuses, 247 Artilleuses d'élites, 585 Soldates d'élites.\n"]
[null,"Jeune Soldate",null,34291,{"$f":"Data!C8*$D12","v":342910},{"$f":"Data!D8*$D12","v":308619},{"$f":"Data!E8*$D12","v":548656},null,"2/ Saisir armes, bouclier dome ou loge de l'ennemi",null,null,null,null,null,{"$f":"IF(ISERROR(SEARCH(Data!F8,Q12)),IF(ISERROR(SEARCH(Data!G8,Q12)),0,SEARCH(Data!G8,Q12)),SEARCH(Data!F8,Q12))","v":8},25,"34 291 Jeunes Soldates, 12 274 Soldates, 9 450 Concierges, 9 403 Artilleuses, 247 Artilleuses d'élites, 585 Soldates d'élites.\n"]
[null,"Soldate",null,12274,{"$f":"Data!C9*$D13","v":184110},{"$f":"Data!D9*$D13","v":171836},{"$f":"Data!E9*$D13","v":245480},null,"3/ Saisir vos niveaux d'arme et bouclier",null,null,null,null,null,{"$f":"IF(ISERROR(SEARCH(Data!F9,Q13)),IF(ISERROR(SEARCH(Data!G9,Q13)),0,SEARCH(Data!G9,Q13)),SEARCH(Data!F9,Q13))","v":8},18,"12 274 Soldates, 9 450 Concierges, 9 403 Artilleuses, 247 Artilleuses d'élites, 585 Soldates d'élites.\n"]
[null,"Concierge",null,9450,{"$f":"Data!C10*$D14","v":9450},{"$f":"Data!D10*$D14","v":236250},{"$f":"Data!E10*$D14","v":283500},null,"4/ Saisir vos unité à envoyer",null,null,null,null,null,{"$f":"IF(ISERROR(SEARCH(Data!F10,Q14)),IF(ISERROR(SEARCH(Data!G10,Q14)),0,SEARCH(Data!G10,Q14)),SEARCH(Data!F10,Q14))","v":7},19,"9 450 Concierges, 9 403 Artilleuses, 247 Artilleuses d'élites, 585 Soldates d'élites.\n"]
[null,"Concierge d'élite",null,0,{"$f":"Data!C11*$D15","v":0},{"$f":"Data!D11*$D15","v":0},{"$f":"Data!E11*$D15","v":0},null,null,null,null,null,null,null,{"$f":"IF(ISERROR(SEARCH(Data!F11,Q15)),IF(ISERROR(SEARCH(Data!G11,Q15)),0,SEARCH(Data!G11,Q15)),SEARCH(Data!F11,Q15))","v":0},0,"9 403 Artilleuses, 247 Artilleuses d'élites, 585 Soldates d'élites.\n"]
[null,"Artilleuse",null,9403,{"$f":"Data!C12*$D16","v":282090},{"$f":"Data!D12*$D16","v":141045},{"$f":"Data!E12*$D16","v":94030},null,"Légende :",null,null,null,null,null,{"$f":"IF(ISERROR(SEARCH(Data!F12,Q16)),IF(ISERROR(SEARCH(Data!G12,Q16)),0,SEARCH(Data!G12,Q16)),SEARCH(Data!F12,Q16))","v":7},20,"9 403 Artilleuses, 247 Artilleuses d'élites, 585 Soldates d'élites.\n"]
[null,"Artilleuse d'élite",null,247,{"$f":"Data!C13*$D17","v":8645},{"$f":"Data!D13*$D17","v":4446},{"$f":"Data!E13*$D17","v":2964},null,"cellule à renseigner",null,null," (les seules à modifier)",null,null,{"$f":"IF(ISERROR(SEARCH(Data!F13,Q17)),IF(ISERROR(SEARCH(Data!G13,Q17)),0,SEARCH(Data!G13,Q17)),SEARCH(Data!F13,Q17))","v":5},27,"247 Artilleuses d'élites, 585 Soldates d'élites.\n"]
[null,"Soldate d'élite",null,585,{"$f":"Data!C14*$D18","v":14040},{"$f":"Data!D14*$D18","v":13455},{"$f":"Data!E14*$D18","v":15795},null,"résultat de calcul",null,null,null,null,null,{"$f":"IF(ISERROR(SEARCH(Data!F14,Q18)),IF(ISERROR(SEARCH(Data!G14,Q18)),0,SEARCH(Data!G14,Q18)),SEARCH(Data!F14,Q18))","v":5},24,"585 Soldates d'élites.\n"]
[null,"Tank",null,0,{"$f":"Data!C15*$D19","v":0},{"$f":"Data!D15*$D19","v":0},{"$f":"Data!E15*$D19","v":0},null,"Titre",null,null,null,null,null,{"$f":"IF(ISERROR(SEARCH(Data!F15,Q19)),IF(ISERROR(SEARCH(Data!G15,Q19)),0,SEARCH(Data!G15,Q19)),SEARCH(Data!F15,Q19))","v":0},0,""]
[null,"Tank d'élite",null,0,{"$f":"Data!C16*$D20","v":0},{"$f":"Data!D16*$D20","v":0},{"$f":"Data!E16*$D20","v":0},null,"Titre ou résultat de calcul",null,null,null,null,null,{"$f":"IF(ISERROR(SEARCH(Data!F16,Q20)),IF(ISERROR(SEARCH(Data!G16,Q20)),0,SEARCH(Data!G16,Q20)),SEARCH(Data!F16,Q20))","v":0},0,""]
[null,"Tueuse",null,0,{"$f":"Data!C17*$D21","v":0},{"$f":"Data!D17*$D21","v":0},{"$f":"Data!E17*$D21","v":0},null,null,null,null,null,null,null,{"$f":"IF(ISERROR(SEARCH(Data!F17,Q21)),IF(ISERROR(SEARCH(Data!G17,Q21)),0,SEARCH(Data!G17,Q21)),SEARCH(Data!F17,Q21))","v":0},0,""]
[null,"Tueuse d'élite",null,0,{"$f":"Data!C18*$D22","v":0},{"$f":"Data!D18*$D22","v":0},{"$f":"Data!E18*$D22","v":0},null,null,null,null,null,null,null,{"$f":"IF(ISERROR(SEARCH(Data!F18,Q22)),IF(ISERROR(SEARCH(Data!G18,Q22)),0,SEARCH(Data!G18,Q22)),SEARCH(Data!F18,Q22))","v":0},0,""]
[null,"TOTAUX :",{"$f":"SUM(C9:C22)","v":0},{"$f":"SUM(D9:D22)","v":119081},{"$f":"SUM(E9:E22)","v":1035782},{"$f":"SUM(F9:F22)","v":1017357},{"$f":"SUM(G9:G22)","v":1654464}]
[]
[null,"Armes : ",null,11,"Vie HB x 3 : ",null,{"$f":"G23*3","v":4963392},null,"FdF AB nécessaire pour une réplique à 10%"]
[null,"Bouclier : ",null,11]
[null,"Dôme : ",null,6,"Vie AB Dome : ",null,{"$f":"G23*D29","v":4136160},null,"En dôme : ",null,{"$f":"MAX(G25,G27)","v":4963392}]
[null,null,"Loge : ",10,"Vie AB Loge : ",null,{"$f":"G23*D30","v":6452409.5999999996},null,"En loge : ",null,{"$f":"MAX(G25,G28)","v":6452409.5999999996}]
[null,"Multiplicateur vie Dome : ",null,{"$f":"1+D26/10+0.1+0.05*D27","v":2.5}]
[null,"Multiplicateur vie Loge : ",null,{"$f":"1+D26/10+0.3+0.15*D28","v":3.9},null,"Défense AB : ",{"$f":"F23*(1+D25/10)","v":2136449.7000000002}]
[null,null,null,"FdF AB nécessaire pour réplique 10% : ",null,"Réplique 10% : ",{"$f":"G30/10","v":213644.97000000003}]
[]
[]
[]
[]
[]
[null,"Calcul attaque à lancer :"]
[]
[null,"Mon niveau Armes :",12,null,null,null,"Nb unité à ajouter pour compléter la FdF nécessaire"]
[null,"Mon niveau Bouclier :",11]
[]
[null,"Type d'unité","Nb unité envoyées",null,"Att AB",null,"Dôme","Loge"]
[null,"Jeune Soldate Naine",null,null,{"$f":"(Data!C5*$C43)*(1+(C$39/10))","v":0},null,{"$f":"IF((J$47>E$57),((J$47-E$57)/(Data!C5*(1+(Manuel!C$39/10)))),\"FdF suffisante\")","v":752029.09090909082},{"$f":"IF((J$53>E$57),((J$53-E$57)/(Data!C5*(1+(C$39/10)))),\"FdF suffisante\")","v":977637.818181818},null,"Dôme"]
[null,"Soldate Naine",null,null,{"$f":"(Data!C6*$C44)*(1+(C$39/10))","v":0},null,{"$f":"IF((J$47>E$57),((J$47-E$57)/(Data!C6*(1+(Manuel!C$39/10)))),\"FdF suffisante\")","v":451217.45454545453},{"$f":"IF((J$53>E$57),((J$53-E$57)/(Data!C6*(1+(C$39/10)))),\"FdF suffisante\")","v":586582.69090909092},null,"JSN nécessaires en cas de réplique à 10% :"]
[null,"Naine d'Elite",null,null,{"$f":"(Data!C7*$C45)*(1+(C$39/10))","v":0},null,{"$f":"IF((J$47>E$57),((J$47-E$57)/(Data!C7*(1+(Manuel!C$39/10)))),\"FdF suffisante\")","v":322298.18181818177},{"$f":"IF((J$53>E$57),((J$53-E$57)/(Data!C7*(1+(C$39/10)))),\"FdF suffisante\")","v":418987.63636363629},null,{"$f":"ROUNDUP((G31/(Data!E5*(1+(C40/10)))),0)","v":12717},null,null,{"$f":"IF((C43>J45),\"OK\",\"Alerte !\")","v":"Alerte !"}]
[null,"Jeune Soldate",null,null,{"$f":"(Data!C8*$C46)*(1+(C$39/10))","v":0},null,{"$f":"IF((J$47>E$57),((J$47-E$57)/(Data!C8*(1+(Manuel!C$39/10)))),\"FdF suffisante\")","v":225608.72727272726},{"$f":"IF((J$53>E$57),((J$53-E$57)/(Data!C8*(1+(C$39/10)))),\"FdF suffisante\")","v":293291.34545454546},null,"FdF AB nécessaire pour réplique 10% :"]
[null,"Soldate",null,null,{"$f":"(Data!C9*$C47)*(1+(C$39/10))","v":0},null,{"$f":"IF((J$47>E$57),((J$47-E$57)/(Data!C9*(1+(Manuel!C$39/10)))),\"FdF suffisante\")","v":150405.81818181818},{"$f":"IF((J$53>E$57),((J$53-E$57)/(Data!C9*(1+(C$39/10)))),\"FdF suffisante\")","v":195527.56363636363},null,{"$f":"K27","v":4963392},null,null,{"$f":"IF((E57>J47),\"OK\",\"Alerte !\")","v":"Alerte !"}]
[null,"Concierge",null,null,{"$f":"(Data!C10*$C48)*(1+(C$39/10))","v":0},null,{"$f":"IF((J$47>E$57),((J$47-E$57)/(Data!C10*(1+(Manuel!C$39/10)))),\"FdF suffisante\")","v":2256087.2727272725},{"$f":"IF((J$53>E$57),((J$53-E$57)/(Data!C10*(1+(C$39/10)))),\"FdF suffisante\")","v":2932913.4545454541}]
[null,"Concierge d'élite",null,null,{"$f":"(Data!C11*$C49)*(1+(C$39/10))","v":0},null,{"$f":"IF((J$47>E$57),((J$47-E$57)/(Data!C11*(1+(Manuel!C$39/10)))),\"FdF suffisante\")","v":2256087.2727272725},{"$f":"IF((J$53>E$57),((J$53-E$57)/(Data!C11*(1+(C$39/10)))),\"FdF suffisante\")","v":2932913.4545454541},null,"Loge"]
[null,"Artilleuse",null,null,{"$f":"(Data!C12*$C50)*(1+(C$39/10))","v":0},null,{"$f":"IF((J$47>E$57),((J$47-E$57)/(Data!C12*(1+(Manuel!C$39/10)))),\"FdF suffisante\")","v":75202.909090909088},{"$f":"IF((J$53>E$57),((J$53-E$57)/(Data!C12*(1+(C$39/10)))),\"FdF suffisante\")","v":97763.781818181815},null,"JSN nécessaires en cas de réplique à 10% :"]
[null,"Artilleuse d'élite",null,null,{"$f":"(Data!C13*$C51)*(1+(C$39/10))","v":0},null,{"$f":"IF((J$47>E$57),((J$47-E$57)/(Data!C13*(1+(Manuel!C$39/10)))),\"FdF suffisante\")","v":64459.63636363636},{"$f":"IF((J$53>E$57),((J$53-E$57)/(Data!C13*(1+(C$39/10)))),\"FdF suffisante\")","v":83797.527272727268},null,{"$f":"ROUNDUP((G31/(Data!E5*(1+(C40/10)))),0)","v":12717},null,null,{"$f":"IF((C43>J51),\"OK\",\"Alerte !\")","v":"Alerte !"}]
[null,"Soldate d'élite",null,null,{"$f":"(Data!C14*$C52)*(1+(C$39/10))","v":0},null,{"$f":"IF((J$47>E$57),((J$47-E$57)/(Data!C14*(1+(Manuel!C$39/10)))),\"FdF suffisante\")","v":94003.636363636353},{"$f":"IF((J$53>E$57),((J$53-E$57)/(Data!C14*(1+(C$39/10)))),\"FdF suffisante\")","v":122204.72727272725},null,"FdF AB nécessaire pour réplique 10% :"]
[null,"Tank",null,null,{"$f":"(Data!C15*$C53)*(1+(C$39/10))","v":0},null,{"$f":"IF((J$47>E$57),((J$47-E$57)/(Data!C15*(1+(Manuel!C$39/10)))),\"FdF suffisante\")","v":41019.768595041314},{"$f":"IF((J$53>E$57),((J$53-E$57)/(Data!C15*(1+(C$39/10)))),\"FdF suffisante\")","v":53325.699173553709},null,{"$f":"K28","v":6452409.5999999996},null,null,{"$f":"IF((E65>J53),\"OK\",\"Alerte !\")","v":"Alerte !"}]
[null,"Tank d'élite",null,null,{"$f":"(Data!C16*$C54)*(1+(C$39/10))","v":0},null,{"$f":"IF((J$47>E$57),((J$47-E$57)/(Data!C16*(1+(Manuel!C$39/10)))),\"FdF suffisante\")","v":28201.090909090908},{"$f":"IF((J$53>E$57),((J$53-E$57)/(Data!C16*(1+(C$39/10)))),\"FdF suffisante\")","v":36661.418181818182}]
[null,"Tueuse",null,null,{"$f":"(Data!C17*$C55)*(1+(C$39/10))","v":0},null,{"$f":"IF((J$47>E$57),((J$47-E$57)/(Data!C17*(1+(Manuel!C$39/10)))),\"FdF suffisante\")","v":45121.745454545446},{"$f":"IF((J$53>E$57),((J$53-E$57)/(Data!C17*(1+(C$39/10)))),\"FdF suffisante\")","v":58658.269090909082}]
[null,"Tueuse d'élite",null,null,{"$f":"(Data!C18*$C56)*(1+(C$39/10))","v":0},null,{"$f":"IF((J$47>E$57),((J$47-E$57)/(Data!C18*(1+(Manuel!C$39/10)))),\"FdF suffisante\")","v":41019.768595041314},{"$f":"IF((J$53>E$57),((J$53-E$57)/(Data!C18*(1+(C$39/10)))),\"FdF suffisante\")","v":53325.699173553709}]
[null,"TOTAUX :",{"$f":"SUM(C43:C56)","v":0},null,{"$f":"SUM(E43:E56)","v":0}]

{"sheet":"Multiplicateurs vie","index":3,"n_rows":116,"n_cols":53,"rows_kept":116,"cut":false,"hidden":false,"merged":[[9,2,9,52],[63,2,63,52],[0,1,0,20],[1,1,1,4],[1,5,1,8],[4,1,4,2],[1,9,1,26],[3,1,3,2],[6,1,6,2],[7,1,7,2]]}
[null,"Combinaisons bouclier/dôme et bouclier/loge (plus bas dans la page) => multiplicateur de vie"]
[null,"Multiplicateur :",null,null,null,2.5,null,null,null," Saisissez ici le multiplicateur de vie trouvé sur une sonde pour voir les combinaison bouclier/dôme ou bouclier/loge possibles\n (selon le lieu de la sonde)."]
[]
[null,"Bouclier :",null,{"$f":"ROUND(($F$2-1-0.1-D5*0.05)*100,0)/10","v":14},{"$f":"D4-1","v":13},{"$f":"E4-1","v":12},11,10,9,8,7,6,5,4,3,2,1,0,-1,-2,-3,-4,-5,-6,-7,-8,-9,-10,-11,-12,-13,-14,-15,-16,-17,-18,-19,-20,-21,-22,-23,-24,-25,-26,-27,-28,-29,-30,-31,-32,-33,-34,-35]
[null,"Dôme :",null,{"$f":"IF(ROUND($F$2*10,0)/10=$F$2,0,1)","v":0},{"$f":"($F$2-1-0.1*E4-0.1)/0.05","v":1.9999999999999989},3.999999999999996,5.9999999999999982,8,10,11.999999999999998,13.999999999999998,15.999999999999998,18,20,21.999999999999996,23.999999999999996,25.999999999999996,27.999999999999996,30,31.999999999999996,34,35.999999999999993,37.999999999999993,40,42,43.999999999999993,45.999999999999993,47.999999999999993,50,52,53.999999999999993,56,57.999999999999993,60,62,63.999999999999993,{"$f":"($F$2-1-0.1*AK4-0.1)/0.05","v":66},68,70,72,74,76,78,79.999999999999986,82,84.000000000000014,86.000000000000014,88,90,92,94.000000000000014,96.000000000000014,98]
[]
[null,"Bouclier :",null,{"$f":"ROUND(($F$2-1-0.3-D8*0.15)*100,0)/10","v":12},{"$f":"D7-3","v":9},{"$f":"E7-3","v":6},3,0,-3,-6,-9,-12,-15,-18,-21,-24,-27,-30,-33,-36,-39,-42,-45,-48,-51,-54,-57,-60,-63,-66,-69,-72,-75,-78,-81,-84,-87,-90,-93,-96,-99,-102,-105,-108,-111,-114,-117,-120,-123,-126,-129,-132,-135]
[null,"Loge :",null,{"$f":"IF(ROUND($F$2*10,0)/10=$F$2,0,1)","v":0},{"$f":"($F$2-1-0.1*E7-0.3)/0.15","v":2},{"$f":"($F$2-1-0.1*F7-0.3)/0.15","v":3.9999999999999991},6,8,10,12,14.000000000000002,16.000000000000004,18.000000000000004,20,22.000000000000004,24.000000000000004,26.000000000000004,28.000000000000004,30.000000000000007,32,34.000000000000007,36.000000000000007,38,40.000000000000007,42.000000000000007,44.000000000000007,46.000000000000007,48,50.000000000000007,52.000000000000014,54,55.999999999999993,58,60,61.999999999999993,64,66,68,70,72.000000000000014,74,76,78,80,82.000000000000014,84,86,88,90,92.000000000000014,94,96,98]
[]
[null,null,"Dôme"]
[null,"Bouclier",0,1,2,3,4,5,6,7,8,9,10,11,12,13,14,15,16,17,18,19,20,21,22,23,24,25,26,27,28,29,30,31,32,33,34,35,36,37,38,39,40,41,42,43,44,45,46,47,48,49,50]
[null,0,{"$f":"1+$B12*0.1+0.1+C$11*0.05","v":1.1000000000000001},{"$f":"1+$B12*0.1+0.1+D$11*0.05","v":1.1500000000000001},1.2000000000000002,1.25,1.3,1.35,1.4000000000000001,1.4500000000000002,1.5,1.55,1.6,1.6500000000000001,1.7000000000000002,1.75,1.8000000000000003,1.85,1.9000000000000001,1.9500000000000002,2,2.0500000000000003,2.1,2.1500000000000004,2.2000000000000002,2.25,2.3000000000000003,2.35,2.4000000000000004,2.4500000000000002,2.5,2.5500000000000003,2.6,2.6500000000000004,2.7,2.75,2.8000000000000003,2.85,2.9000000000000004,2.95,3,3.0500000000000003,3.1,3.1500000000000004,3.2,3.25,3.3000000000000003,3.35,3.4000000000000004,3.45,3.5000000000000004,3.5500000000000003,{"$f":"1+$B12*0.1+0.1+BA$11*0.05","v":3.6}]
[null,1,1.2000000000000002,{"$f":"1+$B13*0.1+0.1+D$11*0.05","v":1.2500000000000002},1.3000000000000003,1.35,1.4000000000000001,1.4500000000000002,1.5000000000000002,1.5500000000000003,1.6,1.6500000000000001,1.7000000000000002,1.7500000000000002,1.8000000000000003,1.85,1.9000000000000004,1.9500000000000002,2,2.0500000000000003,2.1,2.1500000000000004,2.2000000000000002,2.25,2.3000000000000003,2.3500000000000005,2.4000000000000004,2.4500000000000002,2.5,2.5500000000000003,2.6000000000000005,2.6500000000000004,2.7,2.75,2.8000000000000003,2.8500000000000005,2.9000000000000004,2.95,3,3.0500000000000003,3.1000000000000005,3.1500000000000004,3.2,3.2500000000000004,3.3000000000000003,3.35,3.4000000000000004,3.45,3.5000000000000004,3.5500000000000003,3.6000000000000005,3.6500000000000004,3.7]
[null,2,1.3,1.35,1.4000000000000001,1.4500000000000002,1.5,1.55,1.6,1.6500000000000001,1.7000000000000002,1.75,1.8,1.85,1.9000000000000001,1.9500000000000002,2,2.0499999999999998,2.1,2.1500000000000004,2.2000000000000002,2.25,2.2999999999999998,2.35,2.4000000000000004,2.4500000000000002,2.5,2.5499999999999998,2.6,2.6500000000000004,2.7,2.75,2.8,2.85,2.9000000000000004,2.95,3,3.05,3.1,3.1500000000000004,3.2,3.25,3.3,3.3500000000000005,3.4000000000000004,3.45,3.5,3.55,3.6000000000000005,3.6500000000000004,3.7,3.75,3.8]
[null,3,1.4000000000000001,1.4500000000000002,1.5000000000000002,1.5500000000000003,1.6,1.6500000000000001,1.7000000000000002,1.7500000000000002,1.8000000000000003,1.85,1.9000000000000001,1.9500000000000002,2,2.0500000000000003,2.1,2.1500000000000004,2.2000000000000002,2.25,2.3000000000000003,2.35,2.4000000000000004,2.4500000000000002,2.5,2.5500000000000003,2.6000000000000005,2.6500000000000004,2.7,2.75,2.8000000000000003,2.8500000000000005,2.9000000000000004,2.95,3,3.0500000000000003,3.1000000000000005,3.1500000000000004,3.2,3.25,3.3000000000000003,3.3500000000000005,3.4000000000000004,3.45,3.5,3.55,3.6000000000000005,3.6500000000000004,3.7,3.75,3.8000000000000007,3.8500000000000005,3.9000000000000004]
[null,4,1.5,1.55,1.6,1.65,1.7,1.75,1.8,1.85,1.9,1.95,2,2.0499999999999998,2.1,2.15,2.2000000000000002,2.25,2.2999999999999998,2.35,2.4,2.4500000000000002,2.5,2.5499999999999998,2.6,2.6500000000000004,2.7,2.75,2.8,2.85,2.9000000000000004,2.95,3,3.05,3.1,3.1500000000000004,3.2,3.25,3.3,3.35,3.4000000000000004,3.45,3.5,3.5500000000000003,3.6,3.65,3.7,3.75,3.8000000000000003,3.85,3.9000000000000004,3.95,4]
[null,5,1.6,1.6500000000000001,1.7000000000000002,1.75,1.8,1.85,1.9000000000000001,1.9500000000000002,2,2.0500000000000003,2.1,2.1500000000000004,2.2000000000000002,2.25,2.3000000000000003,2.35,2.4000000000000004,2.4500000000000002,2.5,2.5500000000000003,2.6,2.6500000000000004,2.7,2.75,2.8000000000000003,2.85,{"$f":"1+$B17*0.1+0.1+AC$11*0.05","v":2.9000000000000004},2.95,3,3.0500000000000003,3.1,3.1500000000000004,3.2,3.25,3.3000000000000003,3.35,3.4000000000000004,3.45,3.5,3.5500000000000003,3.6,3.6500000000000004,3.7,3.75,3.8000000000000003,3.85,3.9000000000000004,3.95,4,4.0500000000000007,4.0999999999999996]
[null,6,1.7000000000000002,1.7500000000000002,1.8000000000000003,1.85,1.9000000000000001,1.9500000000000002,2,2.0500000000000003,2.1,2.1500000000000004,2.2000000000000002,2.25,2.3000000000000003,2.35,2.4000000000000004,2.4500000000000002,2.5,2.5500000000000003,2.6,2.6500000000000004,2.7,2.75,2.8000000000000003,2.8500000000000005,2.9000000000000004,2.95,3,3.0500000000000003,3.1000000000000005,3.1500000000000004,3.2,3.25,3.3000000000000003,3.3500000000000005,3.4000000000000004,3.45,3.5,3.5500000000000003,3.6000000000000005,3.6500000000000004,3.7,3.7500000000000004,3.8000000000000003,3.85,3.9000000000000004,3.95,4,4.0500000000000007,4.1000000000000005,4.1500000000000004,4.2]
[null,7,1.8000000000000003,1.8500000000000003,1.9000000000000004,1.9500000000000002,2.0000000000000004,2.0500000000000003,2.1000000000000005,2.1500000000000004,2.2000000000000002,2.2500000000000004,2.3000000000000003,2.3500000000000005,2.4000000000000004,2.4500000000000002,2.5000000000000004,2.5500000000000003,2.6000000000000005,2.6500000000000004,2.7,2.7500000000000004,2.8000000000000003,2.8500000000000005,2.9000000000000004,2.95,3.0000000000000004,3.0500000000000003,3.1000000000000005,3.1500000000000004,3.2,3.2500000000000004,3.3000000000000003,3.3500000000000005,3.4000000000000004,3.45,3.5000000000000004,3.5500000000000003,3.6000000000000005,3.6500000000000004,3.7,3.7500000000000004,3.8000000000000003,3.8500000000000005,3.9000000000000004,3.95,4,4.0500000000000007,4.1000000000000005,4.1500000000000004,4.2000000000000011,4.25,4.3000000000000007]
[null,8,1.9000000000000001,1.9500000000000002,2,2.0500000000000003,2.1,2.1500000000000004,2.2000000000000002,2.25,2.3000000000000003,2.35,2.4000000000000004,2.4500000000000002,2.5,2.5500000000000003,2.6,2.6500000000000004,2.7,2.75,2.8000000000000003,2.85,2.9000000000000004,2.95,3,3.0500000000000003,3.1000000000000005,3.1500000000000004,3.2,3.25,3.3000000000000003,3.3500000000000005,3.4000000000000004,3.45,3.5,3.5500000000000003,3.6000000000000005,3.6500000000000004,3.7,3.75,3.8000000000000003,3.8500000000000005,3.9000000000000004,3.95,4,4.05,4.1000000000000005,4.1500000000000004,4.2,4.25,4.3000000000000007,4.3500000000000005,4.4000000000000004]
[null,9,2,2.0499999999999998,2.1,2.15,2.2000000000000002,2.25,2.2999999999999998,2.35,2.4,2.4500000000000002,2.5,2.5499999999999998,2.6,2.65,2.7,2.75,2.8,2.85,2.9,2.95,3,3.05,3.1,3.1500000000000004,3.2,3.25,3.3,3.35,3.4000000000000004,3.45,3.5,3.55,3.6,3.6500000000000004,3.7,3.75,3.8,3.85,3.9000000000000004,3.95,4,4.0500000000000007,4.0999999999999996,4.1500000000000004,4.2,4.25,4.3000000000000007,4.3499999999999996,4.4000000000000004,4.45,4.5]
[null,10,2.1,2.15,2.2000000000000002,2.25,2.3000000000000003,2.35,2.4000000000000004,2.4500000000000002,2.5,2.5500000000000003,2.6,2.6500000000000004,2.7,2.75,2.8000000000000003,2.85,2.9000000000000004,2.95,3,3.0500000000000003,3.1,3.1500000000000004,3.2,3.25,3.3000000000000003,3.35,3.4000000000000004,3.45,3.5,3.5500000000000003,3.6,3.6500000000000004,3.7,3.75,3.8000000000000003,3.85,{"$f":"1+$B22*0.1+0.1+AM$11*0.05","v":3.9000000000000004},3.95,4,4.0500000000000007,4.0999999999999996,4.1500000000000004,4.2,4.25,4.3000000000000007,4.3499999999999996,4.4000000000000004,4.45,4.5,4.5500000000000007,4.5999999999999996]
[null,11,2.2000000000000002,2.25,2.3000000000000003,2.35,2.4000000000000004,2.4500000000000002,2.5,2.5500000000000003,2.6,2.6500000000000004,2.7,2.75,2.8000000000000003,2.85,2.9000000000000004,2.95,3,3.0500000000000003,3.1,3.1500000000000004,3.2,3.25,3.3000000000000003,3.3500000000000005,3.4000000000000004,3.45,3.5,3.5500000000000003,3.6000000000000005,3.6500000000000004,3.7,3.75,3.8000000000000003,3.8500000000000005,3.9000000000000004,3.95,4,4.0500000000000007,4.1000000000000005,4.1500000000000004,4.2,4.25,4.3000000000000007,4.3499999999999996,4.4000000000000004,4.45,4.5,4.5500000000000007,4.6000000000000005,4.6500000000000004,4.7]
[null,12,2.3000000000000003,2.35,2.4000000000000004,2.4500000000000002,2.5000000000000004,2.5500000000000003,2.6000000000000005,2.6500000000000004,2.7,2.7500000000000004,2.8000000000000003,2.8500000000000005,2.9000000000000004,2.95,3.0000000000000004,3.0500000000000003,3.1000000000000005,3.1500000000000004,3.2,3.2500000000000004,3.3000000000000003,3.3500000000000005,3.4000000000000004,3.45,3.5000000000000004,3.5500000000000003,3.6000000000000005,3.6500000000000004,3.7,3.7500000000000004,3.8000000000000003,3.8500000000000005,3.9000000000000004,3.95,4,4.0500000000000007,4.1000000000000005,4.1500000000000004,4.2,4.25,4.3000000000000007,4.3500000000000005,4.4000000000000004,4.45,4.5,4.5500000000000007,4.6000000000000005,4.6500000000000004,4.7000000000000011,4.75,4.8000000000000007]
[null,13,2.4,2.4499999999999997,2.5,2.5499999999999998,2.6,2.65,2.7,2.75,2.8,2.85,2.9,2.95,3,3.05,3.1,3.15,3.2,3.25,3.3,3.35,3.4,3.45,3.5,3.55,3.6,3.65,3.7,3.75,3.8,3.85,3.9,3.95,4,4.05,4.0999999999999996,4.1500000000000004,4.2,4.25,4.3,4.3499999999999996,4.4000000000000004,4.45,4.5,4.55,4.5999999999999996,4.6500000000000004,4.7,4.75,4.8000000000000007,4.8499999999999996,4.9000000000000004]
[null,14,2.5000000000000004,2.5500000000000003,2.6000000000000005,2.6500000000000004,2.7000000000000006,2.7500000000000004,2.8000000000000007,2.8500000000000005,2.9000000000000004,2.9500000000000006,3.0000000000000004,3.0500000000000007,3.1000000000000005,3.1500000000000004,3.2000000000000006,3.2500000000000004,3.3000000000000007,3.3500000000000005,3.4000000000000004,3.4500000000000006,3.5000000000000004,3.5500000000000007,3.6000000000000005,3.6500000000000004,3.7000000000000006,3.7500000000000004,3.8000000000000007,3.8500000000000005,3.9000000000000004,3.9500000000000006,4,4.0500000000000007,4.1000000000000005,4.1500000000000004,4.2000000000000011,4.25,4.3000000000000007,4.3500000000000005,4.4000000000000004,4.4500000000000011,4.5,4.5500000000000007,4.6000000000000005,4.6500000000000004,4.7000000000000011,4.75,4.8000000000000007,4.8500000000000005,4.9000000000000004,4.9500000000000011,5]
[null,15,2.6,2.65,2.7,2.75,2.8000000000000003,2.85,2.9000000000000004,2.95,3,3.0500000000000003,3.1,3.1500000000000004,3.2,3.25,3.3000000000000003,3.35,3.4000000000000004,3.45,3.5,3.5500000000000003,3.6,3.6500000000000004,3.7,3.75,3.8000000000000003,3.85,3.9000000000000004,3.95,4,4.0500000000000007,4.0999999999999996,4.1500000000000004,4.2,4.25,4.3000000000000007,4.3499999999999996,4.4000000000000004,4.45,4.5,4.5500000000000007,4.5999999999999996,4.6500000000000004,4.7,4.75,4.8000000000000007,4.8499999999999996,{"$f":"1+$B27*0.1+0.1+AW$11*0.05","v":4.9000000000000004},4.95,5,5.0500000000000007,5.0999999999999996]
[null,16,2.7,2.75,2.8000000000000003,2.85,2.9000000000000004,2.95,3,3.0500000000000003,3.1,3.1500000000000004,3.2,3.25,3.3000000000000003,3.35,3.4000000000000004,3.45,3.5,3.5500000000000003,3.6,3.6500000000000004,3.7,3.75,3.8000000000000003,3.8500000000000005,3.9000000000000004,3.95,4,4.0500000000000007,4.1000000000000005,4.1500000000000004,4.2,4.25,4.3000000000000007,4.3500000000000005,4.4000000000000004,4.45,4.5,4.5500000000000007,4.6000000000000005,4.6500000000000004,4.7,4.75,4.8000000000000007,4.8499999999999996,4.9000000000000004,4.95,5,5.0500000000000007,5.1000000000000005,5.15,5.2]
[null,17,2.8000000000000003,2.85,2.9000000000000004,2.95,3.0000000000000004,3.0500000000000003,3.1000000000000005,3.1500000000000004,3.2,3.2500000000000004,3.3000000000000003,3.3500000000000005,3.4000000000000004,3.45,3.5000000000000004,3.5500000000000003,3.6000000000000005,3.6500000000000004,3.7,3.7500000000000004,3.8000000000000003,3.8500000000000005,3.9000000000000004,3.95,4,4.0500000000000007,4.1000000000000005,4.1500000000000004,4.2,4.25,4.3000000000000007,4.3500000000000005,4.4000000000000004,4.45,4.5,4.5500000000000007,4.6000000000000005,4.6500000000000004,4.7,4.75,4.8000000000000007,4.8500000000000005,4.9000000000000004,4.95,5,5.0500000000000007,5.1000000000000005,5.15,5.2000000000000011,5.25,5.3000000000000007]
[null,18,2.9,2.9499999999999997,3,3.05,3.1,3.15,3.2,3.25,3.3,3.35,3.4,3.45,3.5,3.55,3.6,3.65,3.7,3.75,3.8,3.85,3.9,3.95,4,4.05,4.0999999999999996,4.1500000000000004,4.2,4.25,4.3,4.3499999999999996,4.4000000000000004,4.45,4.5,4.55,4.5999999999999996,4.6500000000000004,4.7,4.75,4.8,4.8499999999999996,4.9000000000000004,4.95,5,5.05,5.0999999999999996,5.15,5.2,5.25,5.3000000000000007,5.35,5.4]
[null,19,3.0000000000000004,3.0500000000000003,3.1000000000000005,3.1500000000000004,3.2000000000000006,3.2500000000000004,3.3000000000000007,3.3500000000000005,3.4000000000000004,3.4500000000000006,3.5000000000000004,3.5500000000000007,3.6000000000000005,3.6500000000000004,3.7000000000000006,3.7500000000000004,3.8000000000000007,3.8500000000000005,3.9000000000000004,3.9500000000000006,4,4.0500000000000007,4.1000000000000005,4.1500000000000004,4.2000000000000011,4.25,4.3000000000000007,4.3500000000000005,4.4000000000000004,4.4500000000000011,4.5,4.5500000000000007,4.6000000000000005,4.6500000000000004,4.7000000000000011,4.75,4.8000000000000007,4.8500000000000005,4.9000000000000004,4.9500000000000011,5,5.0500000000000007,5.1000000000000005,5.15,5.2000000000000011,5.25,5.3000000000000007,5.3500000000000005,5.4,5.4500000000000011,5.5]
[null,20,3.1,3.15,3.2,3.25,3.3000000000000003,3.35,3.4000000000000004,3.45,3.5,3.5500000000000003,3.6,3.6500000000000004,3.7,3.75,3.8000000000000003,3.85,3.9000000000000004,3.95,4,4.05,4.0999999999999996,4.1500000000000004,4.2,4.25,4.3000000000000007,4.3499999999999996,4.4000000000000004,4.45,4.5,4.5500000000000007,4.5999999999999996,4.6500000000000004,4.7,4.75,4.8000000000000007,4.8499999999999996,4.9000000000000004,4.95,5,5.0500000000000007,5.0999999999999996,5.15,5.2,5.25,5.3000000000000007,5.35,5.4,5.45,5.5,5.5500000000000007,5.6]
[null,21,3.2,3.25,3.3000000000000003,3.35,3.4000000000000004,3.45,3.5,{"$f":"1+$B33*0.1+0.1+J$11*0.05","v":3.5500000000000003},3.6,3.6500000000000004,3.7,3.75,3.8000000000000003,3.85,3.9000000000000004,3.95,4,4.0500000000000007,4.1000000000000005,4.1500000000000004,4.2,4.25,4.3000000000000007,4.3500000000000005,4.4000000000000004,4.45,4.5,4.5500000000000007,4.6000000000000005,4.6500000000000004,4.7,4.75,4.8000000000000007,4.8500000000000005,4.9000000000000004,4.95,5,5.0500000000000007,5.1000000000000005,5.15,5.2,5.25,5.3000000000000007,5.35,5.4,5.45,5.5,5.5500000000000007,5.6000000000000005,5.65,5.7]
[null,22,3.3000000000000003,3.35,3.4000000000000004,3.45,3.5000000000000004,3.5500000000000003,3.6000000000000005,3.6500000000000004,3.7,3.7500000000000004,3.8000000000000003,3.8500000000000005,3.9000000000000004,3.95,4,4.0500000000000007,4.1000000000000005,4.1500000000000004,4.2,4.25,4.3000000000000007,4.3500000000000005,4.4000000000000004,4.45,4.5,4.5500000000000007,4.6000000000000005,4.6500000000000004,4.7,4.75,4.8000000000000007,4.8500000000000005,4.9000000000000004,4.95,5,5.0500000000000007,5.1000000000000005,5.15,5.2,5.25,5.3000000000000007,5.3500000000000005,5.4,5.45,5.5,5.5500000000000007,5.6000000000000005,5.65,5.7000000000000011,5.75,5.8000000000000007]
[null,23,3.4000000000000004,3.45,3.5000000000000004,3.5500000000000003,3.6000000000000005,3.6500000000000004,3.7,3.7500000000000004,3.8000000000000003,3.8500000000000005,3.9000000000000004,3.95,4,4.0500000000000007,4.1000000000000005,4.1500000000000004,4.2,4.25,4.3000000000000007,4.3500000000000005,4.4000000000000004,4.45,4.5,4.5500000000000007,4.6000000000000005,4.6500000000000004,4.7,4.75,4.8000000000000007,4.8500000000000005,4.9000000000000004,4.95,5,5.0500000000000007,5.1000000000000005,5.15,5.2,5.25,5.3000000000000007,5.3500000000000005,5.4,5.4500000000000011,5.5,5.5500000000000007,5.6000000000000005,5.65,5.7000000000000011,5.75,5.8000000000000007,5.8500000000000005,5.9]
[null,24,3.5000000000000004,3.5500000000000003,3.6000000000000005,3.6500000000000004,3.7000000000000006,3.7500000000000004,3.8000000000000007,3.8500000000000005,3.9000000000000004,3.9500000000000006,4,4.0500000000000007,4.1000000000000005,4.1500000000000004,4.2,4.25,4.3000000000000007,4.3500000000000005,4.4000000000000004,4.45,4.5,4.5500000000000007,4.6000000000000005,4.6500000000000004,4.7000000000000011,4.75,4.8000000000000007,4.8500000000000005,4.9000000000000004,4.9500000000000011,5,5.0500000000000007,5.1000000000000005,5.15,5.2000000000000011,5.25,5.3000000000000007,5.3500000000000005,5.4,5.4500000000000011,5.5,5.5500000000000007,5.6000000000000005,5.65,5.7000000000000011,5.75,5.8000000000000007,5.8500000000000005,5.9,5.9500000000000011,6]
[null,25,3.6,3.65,3.7,3.75,3.8000000000000003,3.85,3.9000000000000004,3.95,4,4.05,4.0999999999999996,4.1500000000000004,4.2,4.25,4.3,4.3499999999999996,4.4000000000000004,4.45,4.5,4.55,4.5999999999999996,4.6500000000000004,4.7,4.75,4.8000000000000007,4.8499999999999996,4.9000000000000004,4.95,5,5.0500000000000007,5.0999999999999996,5.15,5.2,5.25,5.3000000000000007,5.35,5.4,5.45,5.5,5.5500000000000007,5.6,5.65,5.7,5.75,5.8000000000000007,5.85,5.9,5.95,6,6.0500000000000007,6.1]
[null,26,3.7,3.75,3.8000000000000003,3.85,3.9000000000000004,3.95,4,4.05,4.1000000000000005,4.1500000000000004,4.2,4.25,4.3000000000000007,4.3500000000000005,4.4000000000000004,4.45,4.5,{"$f":"1+$B38*0.1+0.1+T$11*0.05","v":4.5500000000000007},4.6000000000000005,4.6500000000000004,4.7,4.75,4.8000000000000007,4.8500000000000005,4.9000000000000004,4.95,5,5.0500000000000007,5.1000000000000005,5.15,5.2,5.25,5.3000000000000007,5.3500000000000005,5.4,5.45,5.5,5.5500000000000007,5.6000000000000005,5.65,5.7,5.75,5.8000000000000007,5.85,5.9,5.95,6,6.0500000000000007,6.1000000000000005,6.15,6.2]
[null,27,3.8000000000000003,3.85,3.9000000000000004,3.95,4,4.0500000000000007,4.1000000000000005,4.1500000000000004,4.2,4.25,4.3000000000000007,4.3500000000000005,4.4000000000000004,4.45,4.5,4.5500000000000007,4.6000000000000005,4.6500000000000004,4.7,4.75,4.8000000000000007,4.8500000000000005,4.9000000000000004,4.95,5,5.0500000000000007,5.1000000000000005,5.15,5.2,5.25,5.3000000000000007,5.3500000000000005,5.4,5.45,5.5,5.5500000000000007,5.6000000000000005,5.65,5.7,5.75,5.8000000000000007,5.8500000000000005,5.9,5.95,6,6.0500000000000007,6.1000000000000005,6.15,6.2000000000000011,6.25,6.3000000000000007]
[null,28,3.9000000000000004,3.95,4,4.0500000000000007,4.1000000000000005,4.1500000000000004,4.2,4.25,4.3000000000000007,4.3500000000000005,4.4000000000000004,4.45,4.5,4.5500000000000007,4.6000000000000005,4.6500000000000004,4.7,4.75,4.8000000000000007,4.8500000000000005,4.9000000000000004,4.95,5,5.0500000000000007,5.1000000000000005,5.15,5.2,5.25,5.3000000000000007,5.3500000000000005,5.4,5.45,5.5,5.5500000000000007,5.6000000000000005,5.65,5.7,5.75,5.8000000000000007,5.8500000000000005,5.9,5.9500000000000011,6,6.0500000000000007,6.1000000000000005,6.15,6.2000000000000011,6.25,6.3000000000000007,6.3500000000000005,6.4]
[null,29,4,4.05,4.0999999999999996,4.1500000000000004,4.2,4.25,4.3,4.3499999999999996,4.4000000000000004,4.45,4.5,4.55,4.5999999999999996,4.6500000000000004,4.7,4.75,4.8,4.8499999999999996,4.9000000000000004,4.95,5,5.05,5.0999999999999996,5.15,5.2,5.25,5.3,5.35,5.4,5.45,5.5,5.55,5.6,5.65,5.7,5.75,5.8,5.85,5.9,5.95,6,6.0500000000000007,6.1,6.15,6.2,6.25,6.3000000000000007,6.35,6.4,6.45,6.5]
[null,30,4.0999999999999996,4.1499999999999995,4.1999999999999993,4.25,4.3,4.3499999999999996,4.3999999999999995,4.4499999999999993,4.5,4.55,4.5999999999999996,4.6499999999999995,4.6999999999999993,4.75,4.8,4.8499999999999996,4.8999999999999995,4.9499999999999993,5,5.05,5.0999999999999996,5.1499999999999995,5.1999999999999993,5.25,5.3,5.35,5.3999999999999995,5.4499999999999993,5.5,5.55,5.6,5.6499999999999995,5.6999999999999993,5.75,5.8,5.85,5.8999999999999995,5.9499999999999993,6,6.05,6.1,6.15,6.1999999999999993,6.25,6.3,6.35,6.4,6.4499999999999993,6.5,6.55,6.6]
[null,31,4.1999999999999993,4.2499999999999991,4.2999999999999989,4.3499999999999996,4.3999999999999995,4.4499999999999993,4.4999999999999991,4.5499999999999989,4.5999999999999996,4.6499999999999995,4.6999999999999993,4.7499999999999991,4.7999999999999989,4.8499999999999996,4.8999999999999995,4.9499999999999993,4.9999999999999991,5.0499999999999989,5.0999999999999996,5.1499999999999995,5.1999999999999993,5.2499999999999991,5.2999999999999989,5.35,5.3999999999999995,5.4499999999999993,5.4999999999999991,{"$f":"1+$B43*0.1+0.1+AD$11*0.05","v":5.5499999999999989},5.6,5.6499999999999995,5.6999999999999993,5.7499999999999991,5.7999999999999989,5.85,5.8999999999999995,5.9499999999999993,5.9999999999999991,6.0499999999999989,6.1,6.1499999999999995,6.1999999999999993,6.25,6.2999999999999989,6.35,6.3999999999999995,6.4499999999999993,6.5,6.5499999999999989,6.6,6.6499999999999995,6.6999999999999993]
[null,32,{"$f":"1+$B44*0.1+0.1+C$11*0.05","v":4.3},4.3499999999999996,4.3999999999999995,4.45,4.5,4.55,4.5999999999999996,4.6499999999999995,4.7,4.75,4.8,4.8499999999999996,4.9000000000000004,4.95,5,5.05,5.0999999999999996,5.15,5.2,5.25,5.3,5.35,5.4,5.45,5.5,5.55,5.6,5.65,5.7,5.75,5.8,5.85,5.9,5.95,6,6.05,6.1,6.15,6.2,6.25,6.3,6.35,6.4,6.4499999999999993,6.5,6.55,6.6,6.65,6.7,6.75,6.8]
[null,33,4.4000000000000004,4.45,4.5,4.5500000000000007,4.6000000000000005,4.6500000000000004,4.7,4.75,4.8000000000000007,4.8500000000000005,4.9000000000000004,4.95,5,5.0500000000000007,5.1000000000000005,5.15,5.2,5.25,5.3000000000000007,5.3500000000000005,5.4,5.45,5.5,5.5500000000000007,5.6000000000000005,5.65,5.7,5.75,5.8000000000000007,5.8500000000000005,5.9,5.95,6,6.0500000000000007,6.1000000000000005,6.15,6.2,6.25,6.3000000000000007,6.3500000000000005,6.4,6.4500000000000011,6.5,6.5500000000000007,6.6000000000000005,6.65,6.7000000000000011,6.75,6.8000000000000007,6.8500000000000005,6.9]
[null,34,4.5,4.55,4.5999999999999996,4.6500000000000004,4.7,4.75,4.8,4.8499999999999996,4.9000000000000004,4.95,5,5.05,5.0999999999999996,5.15,5.2,5.25,5.3,5.35,5.4,5.45,5.5,5.55,5.6,5.65,5.7,5.75,5.8,5.85,5.9,5.95,6,6.05,6.1,6.15,6.2,6.25,6.3,6.35,6.4,6.45,6.5,6.5500000000000007,6.6,6.65,6.7,6.75,6.8000000000000007,6.85,6.9,6.95,7]
[null,35,4.5999999999999996,4.6499999999999995,4.6999999999999993,4.75,4.8,4.8499999999999996,4.8999999999999995,4.9499999999999993,5,5.05,5.0999999999999996,5.1499999999999995,5.1999999999999993,5.25,5.3,5.35,5.3999999999999995,5.4499999999999993,5.5,5.55,5.6,5.6499999999999995,5.6999999999999993,5.75,5.8,5.85,5.8999999999999995,5.9499999999999993,6,6.05,6.1,6.1499999999999995,6.1999999999999993,6.25,6.3,6.35,6.3999999999999995,6.4499999999999993,6.5,6.55,6.6,6.65,6.6999999999999993,6.75,6.8,6.85,6.9,6.9499999999999993,7,7.05,7.1]
[null,36,4.6999999999999993,4.7499999999999991,4.7999999999999989,4.8499999999999996,4.8999999999999995,4.9499999999999993,4.9999999999999991,5.0499999999999989,5.0999999999999996,5.1499999999999995,5.1999999999999993,5.2499999999999991,5.2999999999999989,5.35,5.3999999999999995,5.4499999999999993,5.4999999999999991,5.5499999999999989,5.6,5.6499999999999995,5.6999999999999993,5.7499999999999991,5.7999999999999989,5.85,5.8999999999999995,5.9499999999999993,5.9999999999999991,6.0499999999999989,6.1,6.1499999999999995,6.1999999999999993,6.2499999999999991,6.2999999999999989,6.35,6.3999999999999995,6.4499999999999993,6.4999999999999991,{"$f":"1+$B48*0.1+0.1+AN$11*0.05","v":6.5499999999999989},6.6,6.6499999999999995,6.6999999999999993,6.75,6.7999999999999989,6.85,6.8999999999999995,6.9499999999999993,7,7.0499999999999989,7.1,7.1499999999999995,7.1999999999999993]
[null,37,4.8,4.8499999999999996,4.8999999999999995,4.95,5,5.05,5.0999999999999996,5.1499999999999995,5.2,5.25,5.3,5.35,5.4,5.45,5.5,5.55,5.6,5.65,5.7,5.75,5.8,5.85,5.9,5.95,6,6.05,6.1,6.15,6.2,6.25,6.3,6.35,6.4,6.45,6.5,6.55,6.6,6.65,6.7,6.75,6.8,6.85,6.9,6.9499999999999993,7,7.05,7.1,7.15,7.2,7.25,7.3]
[null,38,4.9000000000000004,4.95,5,5.0500000000000007,5.1000000000000005,5.15,5.2,5.25,5.3000000000000007,5.3500000000000005,5.4,5.45,5.5,5.5500000000000007,5.6000000000000005,5.65,5.7,5.75,5.8000000000000007,5.8500000000000005,5.9,5.95,6,6.0500000000000007,6.1000000000000005,6.15,6.2,6.25,6.3000000000000007,6.3500000000000005,6.4,6.45,6.5,6.5500000000000007,6.6000000000000005,6.65,6.7,6.75,6.8000000000000007,6.8500000000000005,6.9,6.9500000000000011,7,7.0500000000000007,7.1000000000000005,7.15,7.2000000000000011,7.25,7.3000000000000007,7.3500000000000005,7.4]
[null,39,5,5.05,5.0999999999999996,5.15,5.2,5.25,5.3,5.35,5.4,5.45,5.5,5.55,5.6,5.65,5.7,5.75,5.8,5.85,5.9,5.95,6,6.05,6.1,6.15,6.2,6.25,6.3,6.35,6.4,6.45,6.5,6.55,6.6,6.65,6.7,6.75,6.8,6.85,6.9,6.95,7,7.0500000000000007,7.1,7.15,7.2,7.25,7.3000000000000007,7.35,7.4,7.45,7.5]
[null,40,5.0999999999999996,5.1499999999999995,5.1999999999999993,5.25,5.3,5.35,5.3999999999999995,5.4499999999999993,5.5,5.55,5.6,5.6499999999999995,5.6999999999999993,5.75,5.8,5.85,5.8999999999999995,5.9499999999999993,6,6.05,6.1,6.1499999999999995,6.1999999999999993,6.25,6.3,6.35,6.3999999999999995,6.4499999999999993,6.5,6.55,6.6,6.6499999999999995,6.6999999999999993,6.75,6.8,6.85,6.8999999999999995,6.9499999999999993,7,7.05,7.1,7.15,7.1999999999999993,7.25,7.3,7.35,7.4,7.4499999999999993,7.5,7.55,7.6]
[null,41,5.2,5.25,5.3,5.3500000000000005,5.4,5.45,5.5,5.55,5.6000000000000005,5.65,5.7,5.75,5.8000000000000007,5.8500000000000005,5.9,5.95,6,6.0500000000000007,6.1000000000000005,6.15,6.2,6.25,6.3000000000000007,6.3500000000000005,6.4,6.45,6.5,6.5500000000000007,6.6000000000000005,6.65,6.7,6.75,6.8000000000000007,6.8500000000000005,6.9,6.95,7,7.0500000000000007,7.1000000000000005,7.15,7.2,7.25,7.3000000000000007,7.35,7.4,7.45,7.5,{"$f":"1+$B53*0.1+0.1+AX$11*0.05","v":7.5500000000000007},7.6000000000000005,7.65,7.7]
[null,42,5.3,5.35,5.3999999999999995,5.45,5.5,5.55,5.6,5.6499999999999995,5.7,5.75,5.8,5.85,5.9,5.95,6,6.05,6.1,6.15,6.2,6.25,6.3,6.35,6.4,6.45,6.5,6.55,6.6,6.65,6.7,6.75,6.8,6.85,6.9,6.95,7,7.05,7.1,7.15,7.2,7.25,7.3,7.35,7.4,7.4499999999999993,7.5,7.55,7.6,7.65,7.7,7.75,7.8]
[null,43,5.3999999999999995,5.4499999999999993,5.4999999999999991,5.55,5.6,5.6499999999999995,5.6999999999999993,5.7499999999999991,5.8,5.85,5.8999999999999995,5.9499999999999993,6,6.05,6.1,6.1499999999999995,6.1999999999999993,6.25,6.3,6.35,6.3999999999999995,6.4499999999999993,6.5,6.55,6.6,6.6499999999999995,6.6999999999999993,6.75,6.8,6.85,6.8999999999999995,6.9499999999999993,7,7.05,7.1,7.1499999999999995,7.1999999999999993,7.25,7.3,7.35,7.3999999999999995,7.4499999999999993,7.5,7.5499999999999989,7.6,7.6499999999999995,7.6999999999999993,7.75,7.8,7.85,7.8999999999999995]
[null,44,5.5,5.55,5.6,5.65,5.7,5.75,5.8,5.85,5.9,5.95,6,6.05,6.1,6.15,6.2,6.25,6.3,6.35,6.4,6.45,6.5,6.55,6.6,6.65,6.7,6.75,6.8,6.85,6.9,6.95,7,7.05,7.1,7.15,7.2,7.25,7.3,7.35,7.4,7.45,7.5,7.5500000000000007,7.6,7.65,7.7,7.75,7.8000000000000007,7.85,7.9,7.95,8]
[null,45,5.6,5.6499999999999995,5.6999999999999993,5.75,5.8,5.85,5.8999999999999995,5.9499999999999993,6,6.05,6.1,6.1499999999999995,6.1999999999999993,6.25,6.3,6.35,6.3999999999999995,6.4499999999999993,6.5,6.55,6.6,6.6499999999999995,6.6999999999999993,6.75,6.8,6.85,6.8999999999999995,6.9499999999999993,7,7.05,7.1,7.1499999999999995,7.1999999999999993,7.25,7.3,7.35,7.3999999999999995,7.4499999999999993,7.5,7.55,7.6,7.65,7.6999999999999993,7.75,7.8,7.85,7.9,7.9499999999999993,8,8.0500000000000007,8.1]
[null,46,5.7,5.75,5.8,5.8500000000000005,5.9,5.95,6,6.05,6.1000000000000005,6.15,6.2,6.25,6.3000000000000007,6.3500000000000005,6.4,6.45,6.5,6.5500000000000007,6.6000000000000005,6.65,6.7,6.75,6.8000000000000007,6.8500000000000005,6.9,6.95,7,7.0500000000000007,7.1000000000000005,7.15,7.2,7.25,7.3000000000000007,7.3500000000000005,7.4,7.45,7.5,7.5500000000000007,7.6000000000000005,7.65,7.7,7.75,7.8000000000000007,7.85,7.9,7.95,8,8.0500000000000007,8.1000000000000014,8.15,8.1999999999999993]
[null,47,5.8,5.85,5.8999999999999995,5.95,6,6.05,6.1,6.1499999999999995,{"$f":"1+$B59*0.1+0.1+K$11*0.05","v":6.2},6.25,6.3,6.35,6.4,6.45,6.5,6.55,6.6,6.65,6.7,6.75,6.8,6.85,6.9,6.95,7,7.05,7.1,7.15,7.2,7.25,7.3,7.35,7.4,7.45,7.5,7.55,7.6,7.65,7.7,7.75,7.8,7.85,7.9,7.9499999999999993,8,8.0500000000000007,8.1,8.15,8.1999999999999993,8.25,8.3000000000000007]
[null,48,5.9,5.95,6,6.0500000000000007,6.1000000000000005,6.15,6.2,6.25,6.3000000000000007,6.3500000000000005,6.4,6.45,6.5,6.5500000000000007,6.6000000000000005,6.65,6.7,6.75,6.8000000000000007,6.8500000000000005,6.9,6.95,7,7.0500000000000007,7.1000000000000005,7.15,7.2,7.25,7.3000000000000007,7.3500000000000005,7.4,7.45,7.5,7.5500000000000007,7.6000000000000005,7.65,7.7,7.75,7.8000000000000007,7.8500000000000005,7.9,7.9500000000000011,8,8.0500000000000007,8.1000000000000014,8.15,8.2000000000000011,8.25,8.3000000000000007,8.3500000000000014,8.4]
[null,49,6,6.05,6.1,6.15,6.2,6.25,6.3,6.35,6.4,6.45,6.5,6.55,6.6,6.65,6.7,6.75,6.8,6.85,6.9,6.95,7,7.05,7.1,7.15,7.2,7.25,7.3,7.35,7.4,7.45,7.5,7.55,7.6,7.65,7.7,7.75,7.8,7.85,7.9,7.95,8,8.0500000000000007,8.1,8.15,8.1999999999999993,8.25,8.3000000000000007,8.35,8.4,8.4499999999999993,8.5]
[null,50,6.1,6.1499999999999995,6.1999999999999993,6.25,6.3,6.35,6.3999999999999995,6.4499999999999993,6.5,6.55,6.6,6.6499999999999995,6.6999999999999993,6.75,6.8,6.85,6.8999999999999995,6.9499999999999993,7,7.05,7.1,7.1499999999999995,7.1999999999999993,7.25,7.3,7.35,7.3999999999999995,7.4499999999999993,7.5,7.55,7.6,7.6499999999999995,7.6999999999999993,7.75,7.8,7.85,7.8999999999999995,7.9499999999999993,8,8.0500000000000007,8.1,8.15,8.1999999999999993,8.25,8.3000000000000007,8.35,8.4,8.4499999999999993,8.5,8.5500000000000007,8.6]
[]
[null,null,"Loge"]
[null,"Bouclier",0,1,2,3,4,5,6,7,8,9,10,11,12,13,14,15,16,17,18,19,20,21,22,23,24,25,26,27,28,29,30,31,32,33,34,35,36,37,38,39,40,41,42,43,44,45,46,47,48,49,50]
[null,0,{"$f":"1+$B66*0.1+0.3+C$11*0.15","v":1.3},{"$f":"1+$B66*0.1+0.3+D$11*0.15","v":1.45},1.6,1.75,1.9,2.0499999999999998,2.2000000000000002,2.35,2.5,2.65,2.8,2.95,3.0999999999999996,3.25,3.4000000000000004,3.55,3.7,3.8499999999999996,4,4.1500000000000004,4.3,4.45,4.5999999999999996,4.75,4.8999999999999995,5.05,5.2,5.35,5.5,5.6499999999999995,5.8,5.9499999999999993,6.1,6.25,6.3999999999999995,6.55,6.6999999999999993,6.85,7,7.1499999999999995,7.3,7.4499999999999993,7.6,7.75,7.8999999999999995,8.0500000000000007,8.1999999999999993,8.35,8.5,8.65,8.8000000000000007]
[null,1,1.4000000000000001,{"$f":"1+$B67*0.1+0.3+D$11*0.15","v":1.55},1.7000000000000002,1.85,2,2.1500000000000004,2.2999999999999998,2.4500000000000002,2.6,2.75,2.9000000000000004,3.05,3.2,3.35,3.5,3.6500000000000004,3.8,3.95,4.0999999999999996,4.25,4.4000000000000004,4.55,4.7,4.8499999999999996,5,5.15,5.3,5.45,5.6000000000000005,5.75,5.9,6.05,6.2,6.3500000000000005,6.5,6.65,6.8,6.95,7.1000000000000005,7.25,7.4,7.55,7.7,7.8500000000000005,8,8.15,8.2999999999999989,8.4499999999999993,8.6,8.75,8.9]
[null,2,1.5,1.65,1.8,1.95,2.1,2.25,2.4,2.5499999999999998,2.7,2.8499999999999996,3,3.15,3.3,3.45,3.6,3.75,3.9,4.05,4.1999999999999993,4.3499999999999996,4.5,4.6500000000000004,4.8,4.9499999999999993,5.0999999999999996,5.25,5.4,5.55,5.7,5.85,6,6.1499999999999995,6.3,6.45,6.6,6.75,6.8999999999999995,7.05,7.2,7.35,7.5,7.6499999999999995,7.8,7.95,8.1,8.25,8.3999999999999986,8.5500000000000007,8.6999999999999993,8.85,9]
[null,3,1.6,1.75,1.9000000000000001,2.0499999999999998,2.2000000000000002,2.35,2.5,2.6500000000000004,2.8,2.95,3.1,3.25,3.4,3.55,3.7,3.85,4,4.1500000000000004,4.3,4.45,4.5999999999999996,4.75,4.9000000000000004,5.05,5.1999999999999993,5.35,5.5,5.65,5.8000000000000007,5.9499999999999993,6.1,6.25,6.4,6.5500000000000007,6.6999999999999993,6.85,7,7.15,7.3000000000000007,7.4499999999999993,7.6,7.75,7.9,8.0500000000000007,8.1999999999999993,8.35,8.5,8.65,8.7999999999999989,8.9499999999999993,9.1]
[null,4,1.7,1.8499999999999999,2,2.15,2.2999999999999998,2.4500000000000002,2.5999999999999996,2.75,2.9,3.05,3.2,3.3499999999999996,3.5,3.65,3.8,3.95,4.0999999999999996,4.25,4.3999999999999995,4.55,4.7,4.8499999999999996,5,5.1499999999999995,5.3,5.45,5.6,5.75,5.9,6.05,6.2,6.35,6.5,6.65,6.8,6.95,7.1,7.25,7.4,7.55,7.7,7.85,8,8.15,8.2999999999999989,8.4499999999999993,8.6,8.75,8.8999999999999986,9.0499999999999989,9.1999999999999993]
[null,5,1.8,1.95,2.1,2.25,2.4,2.5499999999999998,2.7,2.85,3,3.15,3.3,3.45,3.5999999999999996,3.75,3.9000000000000004,4.05,4.2,4.3499999999999996,4.5,4.6500000000000004,4.8,{"$f":"1+$B71*0.1+0.3+X$11*0.15","v":4.95},5.0999999999999996,5.25,5.3999999999999995,5.55,5.7,5.85,6,6.1499999999999995,6.3,6.4499999999999993,6.6,6.75,6.8999999999999995,7.05,7.1999999999999993,7.35,7.5,7.6499999999999995,7.8,7.9499999999999993,8.1,8.25,8.4,8.5500000000000007,8.6999999999999993,8.85,9,9.15,9.3000000000000007]
[null,6,1.9000000000000001,2.0500000000000003,2.2000000000000002,2.35,2.5,2.6500000000000004,2.8,2.95,3.1,3.25,3.4000000000000004,3.55,3.7,3.85,4,4.1500000000000004,4.3,4.45,4.5999999999999996,4.75,4.9000000000000004,5.05,5.2,5.35,5.5,5.65,5.8,5.95,6.1000000000000005,6.25,6.4,6.55,6.7,6.8500000000000005,7,7.15,7.3,7.45,7.6000000000000005,7.75,7.9,8.0499999999999989,8.1999999999999993,8.35,8.5,8.65,8.7999999999999989,8.9499999999999993,9.1,9.25,9.4]
[null,7,2,2.15,2.2999999999999998,2.4500000000000002,2.6,2.75,2.9,3.05,3.2,3.3499999999999996,3.5,3.65,3.8,3.95,4.0999999999999996,4.25,4.4000000000000004,4.55,4.6999999999999993,4.8499999999999996,5,5.15,5.3,5.4499999999999993,5.6,5.75,5.9,6.05,6.2,6.35,6.5,6.6499999999999995,6.8,6.95,7.1,7.25,7.3999999999999995,7.55,7.7,7.85,8,8.1499999999999986,8.3000000000000007,8.4499999999999993,8.6,8.75,8.8999999999999986,9.0500000000000007,9.1999999999999993,9.35,9.5]
[null,8,2.1,2.25,2.4,2.5499999999999998,2.7,2.85,3,3.1500000000000004,3.3,3.45,3.6,3.75,3.9,4.05,4.2,4.3499999999999996,4.5,4.6500000000000004,4.8,4.95,5.0999999999999996,5.25,5.4,5.55,5.6999999999999993,5.85,6,6.15,6.3000000000000007,6.4499999999999993,6.6,6.75,6.9,7.0500000000000007,7.1999999999999993,7.35,7.5,7.65,7.8000000000000007,7.9499999999999993,8.1,8.25,8.4,8.5500000000000007,8.6999999999999993,8.85,9,9.15,9.2999999999999989,9.4499999999999993,9.6]
[null,9,2.1999999999999997,2.3499999999999996,2.4999999999999996,2.6499999999999995,2.8,2.9499999999999997,3.0999999999999996,3.25,3.3999999999999995,3.55,3.6999999999999997,3.8499999999999996,3.9999999999999996,4.1499999999999995,4.3,4.4499999999999993,4.5999999999999996,4.75,4.8999999999999995,5.05,5.1999999999999993,5.35,5.5,5.6499999999999995,5.7999999999999989,5.9499999999999993,6.1,6.25,6.4,6.5499999999999989,6.6999999999999993,6.85,7,7.15,7.2999999999999989,7.4499999999999993,7.6,7.75,7.9,8.0499999999999989,8.1999999999999993,8.35,8.5,8.65,8.7999999999999989,8.9499999999999993,9.1,9.25,9.3999999999999986,9.5499999999999989,9.6999999999999993]
[null,10,2.2999999999999998,2.4499999999999997,2.5999999999999996,2.75,2.9,3.05,3.1999999999999997,3.3499999999999996,3.5,3.6499999999999995,3.8,3.9499999999999997,4.0999999999999996,4.25,4.4000000000000004,4.55,4.6999999999999993,4.8499999999999996,5,5.15,5.3,5.4499999999999993,5.6,5.75,5.8999999999999995,6.05,{"$f":"1+$B76*0.1+0.3+AC$11*0.15","v":6.1999999999999993},6.35,6.5,6.6499999999999995,6.8,6.9499999999999993,7.1,7.25,7.3999999999999995,7.55,7.6999999999999993,7.85,8,8.1499999999999986,8.3000000000000007,8.4499999999999993,8.6,8.75,8.8999999999999986,9.0500000000000007,9.1999999999999993,9.35,9.5,9.6499999999999986,9.8000000000000007]
[null,11,2.4,2.5499999999999998,2.6999999999999997,2.8499999999999996,3,3.15,3.3,3.45,3.5999999999999996,3.75,3.9,4.05,4.1999999999999993,4.3499999999999996,4.5,4.6500000000000004,4.8,4.9499999999999993,5.0999999999999996,5.25,5.4,5.55,5.6999999999999993,5.85,6,6.15,6.3,6.4499999999999993,6.6,6.75,6.9,7.0499999999999989,7.1999999999999993,7.35,7.5,7.65,7.7999999999999989,7.9499999999999993,8.1,8.25,8.4,8.5499999999999989,8.6999999999999993,8.85,9,9.15,9.2999999999999989,9.4499999999999993,9.6,9.75,9.9]
[null,12,2.5,2.65,2.8,2.95,3.1,3.25,3.4,3.55,3.7,3.8499999999999996,4,4.1500000000000004,4.3,4.45,4.5999999999999996,4.75,4.9000000000000004,5.05,5.1999999999999993,5.35,5.5,5.65,5.8,5.9499999999999993,6.1,6.25,6.4,6.55,6.7,6.85,7,7.1499999999999995,7.3,7.45,7.6,7.75,7.8999999999999995,8.0500000000000007,8.1999999999999993,8.35,8.5,8.6499999999999986,8.8000000000000007,8.9499999999999993,9.1,9.25,9.3999999999999986,9.5500000000000007,9.6999999999999993,9.85,10]
[null,13,2.5999999999999996,2.7499999999999996,2.8999999999999995,3.05,3.1999999999999997,3.3499999999999996,3.4999999999999996,3.6499999999999995,3.8,3.9499999999999993,4.0999999999999996,4.25,4.3999999999999995,4.55,4.6999999999999993,4.8499999999999996,5,5.1499999999999995,5.2999999999999989,5.4499999999999993,5.6,5.75,5.8999999999999995,6.0499999999999989,6.1999999999999993,6.35,6.5,6.6499999999999995,6.8,6.9499999999999993,7.1,7.2499999999999991,7.3999999999999995,7.55,7.6999999999999993,7.85,7.9999999999999991,8.1499999999999986,8.3000000000000007,8.4499999999999993,8.6,8.75,8.8999999999999986,9.0500000000000007,9.1999999999999993,9.35,9.5,9.6499999999999986,9.7999999999999989,9.9499999999999993,10.1]
[null,14,2.7,2.85,3,3.1500000000000004,3.3000000000000003,3.45,3.6,3.75,3.9000000000000004,4.05,4.2,4.3499999999999996,4.5,4.6500000000000004,4.8000000000000007,4.95,5.0999999999999996,5.25,5.4,5.5500000000000007,5.7,5.85,6,6.15,6.3,6.45,6.6,6.75,6.9,7.05,7.2,7.35,7.5,7.65,7.8,7.95,8.1,8.25,8.4,8.5500000000000007,8.6999999999999993,8.85,9,9.15,9.3000000000000007,9.4499999999999993,9.6,9.75,9.8999999999999986,10.050000000000001,10.199999999999999]
[null,15,2.8,2.9499999999999997,3.0999999999999996,3.25,3.4,3.55,3.6999999999999997,3.8499999999999996,4,4.1499999999999995,4.3,4.4499999999999993,4.5999999999999996,4.75,4.9000000000000004,5.05,5.1999999999999993,5.35,5.5,5.65,5.8,5.9499999999999993,6.1,6.25,6.3999999999999995,6.55,6.6999999999999993,6.85,7,7.1499999999999995,7.3,{"$f":"1+$B81*0.1+0.3+AH$11*0.15","v":7.4499999999999993},7.6,7.75,7.8999999999999995,8.0500000000000007,8.1999999999999993,8.35,8.5,8.6499999999999986,8.8000000000000007,8.9499999999999993,9.1,9.25,9.3999999999999986,9.5500000000000007,9.6999999999999993,9.85,10,10.149999999999999,10.3]
[null,16,2.9,3.05,3.1999999999999997,3.3499999999999996,3.5,3.65,3.8,3.95,4.0999999999999996,4.25,4.4000000000000004,4.55,4.6999999999999993,4.8499999999999996,5,5.15,5.3,5.4499999999999993,5.6,5.75,5.9,6.05,6.1999999999999993,6.35,6.5,6.65,6.8,6.9499999999999993,7.1,7.25,7.4,7.5499999999999989,7.6999999999999993,7.85,8,8.15,8.2999999999999989,8.4499999999999993,8.6,8.75,8.9,9.0499999999999989,9.1999999999999993,9.35,9.5,9.65,9.7999999999999989,9.9499999999999993,10.1,10.25,10.4]
[null,17,3,3.15,3.3,3.45,3.6,3.75,3.9,4.05,4.2,4.3499999999999996,4.5,4.6500000000000004,4.8,4.95,5.0999999999999996,5.25,5.4,5.55,5.6999999999999993,5.85,6,6.15,6.3,6.4499999999999993,6.6,6.75,6.9,7.05,7.2,7.35,7.5,7.6499999999999995,7.8,7.95,8.1,8.25,8.3999999999999986,8.5500000000000007,8.6999999999999993,8.85,9,9.1499999999999986,9.3000000000000007,9.4499999999999993,9.6,9.75,9.8999999999999986,10.050000000000001,10.199999999999999,10.35,10.5]
[null,18,3.0999999999999996,3.2499999999999996,3.3999999999999995,3.55,3.6999999999999997,3.8499999999999996,3.9999999999999996,4.1499999999999995,4.3,4.4499999999999993,4.5999999999999996,4.75,4.8999999999999995,5.05,5.1999999999999993,5.35,5.5,5.6499999999999995,5.7999999999999989,5.9499999999999993,6.1,6.25,6.3999999999999995,6.5499999999999989,6.6999999999999993,6.85,7,7.1499999999999995,7.3,7.4499999999999993,7.6,7.7499999999999991,7.8999999999999995,8.0500000000000007,8.1999999999999993,8.35,8.5,8.6499999999999986,8.8000000000000007,8.9499999999999993,9.1,9.25,9.3999999999999986,9.5500000000000007,9.6999999999999993,9.85,10,10.149999999999999,10.299999999999999,10.45,10.6]
[null,19,3.2,3.35,3.5,3.6500000000000004,3.8000000000000003,3.95,4.0999999999999996,4.25,4.4000000000000004,4.55,4.7,4.8499999999999996,5,5.15,5.3000000000000007,5.45,5.6,5.75,5.9,6.0500000000000007,6.2,6.35,6.5,6.65,6.8,6.95,7.1,7.25,7.4,7.55,7.7,7.85,8,8.15,8.3000000000000007,8.4499999999999993,8.6,8.75,8.9,9.0500000000000007,9.1999999999999993,9.35,9.5,9.65,9.8000000000000007,9.9499999999999993,10.1,10.25,10.399999999999999,10.55,10.7]
[null,20,3.3,3.4499999999999997,3.5999999999999996,3.75,3.9,4.05,4.1999999999999993,4.3499999999999996,4.5,4.6499999999999995,4.8,4.9499999999999993,5.0999999999999996,5.25,5.4,5.55,5.6999999999999993,5.85,6,6.15,6.3,6.4499999999999993,6.6,6.75,6.8999999999999995,7.05,7.1999999999999993,7.35,7.5,7.6499999999999995,7.8,7.9499999999999993,8.1,8.25,8.3999999999999986,8.5500000000000007,{"$f":"1+$B86*0.1+0.3+AM$11*0.15","v":8.6999999999999993},8.85,9,9.1499999999999986,9.3000000000000007,9.4499999999999993,9.6,9.75,9.8999999999999986,10.050000000000001,10.199999999999999,10.35,10.5,10.649999999999999,10.8]
[null,21,3.4,3.55,3.6999999999999997,3.8499999999999996,4,4.1500000000000004,4.3,4.45,4.5999999999999996,4.75,4.9000000000000004,5.05,5.1999999999999993,5.35,5.5,5.65,5.8,5.9499999999999993,6.1,6.25,6.4,6.55,6.6999999999999993,6.85,7,7.15,7.3,7.4499999999999993,7.6,7.75,7.9,8.0499999999999989,8.1999999999999993,8.35,8.5,8.65,8.7999999999999989,8.9499999999999993,9.1,9.25,9.4,9.5499999999999989,9.6999999999999993,9.85,10,10.15,10.299999999999999,10.45,10.6,10.75,10.9]
[null,22,3.5,3.65,3.8,3.95,4.0999999999999996,4.25,4.4000000000000004,4.55,4.7,4.8499999999999996,5,5.15,5.3,5.45,5.6,5.75,5.9,6.05,6.1999999999999993,6.35,6.5,6.65,6.8,6.9499999999999993,7.1,7.25,7.4,7.55,7.7,7.85,8,8.1499999999999986,8.3000000000000007,8.4499999999999993,8.6,8.75,8.8999999999999986,9.0500000000000007,9.1999999999999993,9.35,9.5,9.6499999999999986,9.8000000000000007,9.9499999999999993,10.1,10.25,10.399999999999999,10.55,10.7,10.85,11]
[null,23,3.6,3.75,3.9,4.05,4.2,4.3499999999999996,4.5,4.6500000000000004,4.8,4.95,5.0999999999999996,5.25,5.4,5.55,5.7,5.85,6,6.15,6.3,6.45,6.6,6.75,6.9,7.05,7.1999999999999993,7.35,7.5,7.65,7.8000000000000007,7.9499999999999993,8.1,8.25,8.4,8.5500000000000007,8.6999999999999993,8.85,9,9.15,9.3000000000000007,9.4499999999999993,9.6,9.75,9.9,10.050000000000001,10.199999999999999,10.35,10.5,10.65,10.799999999999999,10.95,11.1]
[null,24,3.7,3.85,4,4.1500000000000004,4.3,4.45,4.5999999999999996,4.75,4.9000000000000004,5.05,5.2,5.35,5.5,5.65,5.8000000000000007,5.95,6.1,6.25,6.4,6.5500000000000007,6.7,6.85,7,7.15,7.3,7.45,7.6,7.75,7.9,8.0500000000000007,8.1999999999999993,8.35,8.5,8.65,8.8000000000000007,8.9499999999999993,9.1,9.25,9.4,9.5500000000000007,9.6999999999999993,9.85,10,10.15,10.3,10.45,10.6,10.75,10.899999999999999,11.05,11.2]
[null,25,3.8,3.9499999999999997,4.0999999999999996,4.25,4.3999999999999995,4.55,4.6999999999999993,4.8499999999999996,5,5.1499999999999995,5.3,5.4499999999999993,5.6,5.75,5.9,6.05,6.1999999999999993,6.35,6.5,6.65,6.8,6.9499999999999993,7.1,7.25,7.3999999999999995,7.55,7.6999999999999993,7.85,8,8.1499999999999986,8.3000000000000007,8.4499999999999993,8.6,8.75,8.8999999999999986,9.0500000000000007,9.1999999999999993,9.35,9.5,9.6499999999999986,9.8000000000000007,{"$f":"1+$B91*0.1+0.3+AR$11*0.15","v":9.9499999999999993},10.1,10.25,10.399999999999999,10.55,10.7,10.85,11,11.149999999999999,11.3]
[null,26,3.9,4.05,4.2,4.3499999999999996,4.5,4.6500000000000004,4.8,4.95,5.0999999999999996,5.25,5.4,5.55,5.6999999999999993,5.85,6,6.15,6.3,6.4499999999999993,6.6,6.75,6.9,7.05,7.1999999999999993,7.35,7.5,7.65,7.8,7.9499999999999993,8.1,8.25,8.4,8.5499999999999989,8.6999999999999993,8.85,9,9.15,9.2999999999999989,9.4499999999999993,9.6,9.75,9.9,10.049999999999999,10.199999999999999,10.35,10.5,10.65,10.799999999999999,10.95,11.1,11.25,11.4]
[null,27,4,4.1500000000000004,4.3,4.45,4.5999999999999996,4.75,4.9000000000000004,5.05,5.2,5.35,5.5,5.65,5.8,5.95,6.1,6.25,6.4,6.55,6.6999999999999993,6.85,7,7.15,7.3,7.4499999999999993,7.6,7.75,7.9,8.0500000000000007,8.1999999999999993,8.35,8.5,8.6499999999999986,8.8000000000000007,8.9499999999999993,9.1,9.25,9.3999999999999986,9.5500000000000007,9.6999999999999993,9.85,10,10.149999999999999,10.3,10.45,10.6,10.75,10.899999999999999,11.05,11.2,11.35,11.5]
[null,28,4.1000000000000005,4.2500000000000009,4.4000000000000004,4.5500000000000007,4.7,4.8500000000000005,5,5.15,5.3000000000000007,5.45,5.6000000000000005,5.75,5.9,6.0500000000000007,6.2000000000000011,6.3500000000000005,6.5,6.65,6.8000000000000007,6.9500000000000011,7.1000000000000005,7.25,7.4,7.5500000000000007,7.7,7.8500000000000005,8,8.15,8.3000000000000007,8.4499999999999993,8.6000000000000014,8.75,8.9,9.0500000000000007,9.1999999999999993,9.3500000000000014,9.5,9.65,9.8000000000000007,9.9499999999999993,10.100000000000001,10.25,10.4,10.55,10.7,10.850000000000001,11,11.15,11.3,11.45,11.600000000000001]
[null,29,4.2,4.3500000000000005,4.5,4.6500000000000004,4.8,4.95,5.0999999999999996,5.25,5.4,5.55,5.7,5.85,6,6.15,6.3000000000000007,6.45,6.6,6.75,6.9,7.0500000000000007,7.2,7.35,7.5,7.65,7.8,7.95,8.1,8.25,8.4,8.5500000000000007,8.6999999999999993,8.85,9,9.15,9.3000000000000007,9.4499999999999993,9.6,9.75,9.9,10.050000000000001,10.199999999999999,10.35,10.5,10.65,10.8,10.95,11.1,11.25,11.399999999999999,11.55,11.7]
[null,30,4.3,4.45,4.5999999999999996,4.75,4.8999999999999995,5.05,5.1999999999999993,5.35,5.5,5.6499999999999995,5.8,5.9499999999999993,6.1,6.25,6.4,6.55,6.6999999999999993,6.85,7,7.15,7.3,7.4499999999999993,7.6,7.75,7.8999999999999995,8.0500000000000007,8.1999999999999993,8.35,8.5,8.6499999999999986,8.8000000000000007,8.9499999999999993,9.1,9.25,9.3999999999999986,9.5500000000000007,9.6999999999999993,9.85,10,10.149999999999999,10.3,10.45,10.6,10.75,10.899999999999999,11.05,{"$f":"1+$B96*0.1+0.3+AW$11*0.15","v":11.2},11.35,11.5,11.649999999999999,11.8]
[null,31,4.3999999999999995,4.55,4.6999999999999993,4.8499999999999996,4.9999999999999991,5.1499999999999995,5.2999999999999989,5.4499999999999993,5.6,5.7499999999999991,5.8999999999999995,6.0499999999999989,6.1999999999999993,6.35,6.5,6.6499999999999995,6.7999999999999989,6.9499999999999993,7.1,7.25,7.3999999999999995,7.5499999999999989,7.6999999999999993,7.85,7.9999999999999991,8.1499999999999986,8.2999999999999989,8.4499999999999993,8.6,8.75,8.8999999999999986,9.0499999999999989,9.1999999999999993,9.35,9.5,9.6499999999999986,9.7999999999999989,9.9499999999999993,10.1,10.25,10.399999999999999,10.549999999999999,10.7,10.85,11,11.149999999999999,11.299999999999999,11.45,11.599999999999998,11.75,11.899999999999999]
[null,32,{"$f":"1+$B98*0.1+0.3+C$11*0.15","v":4.5},4.6500000000000004,4.8,4.95,5.0999999999999996,5.25,5.4,5.55,5.7,5.85,6,6.15,6.3,6.45,6.6,6.75,6.9,7.05,7.1999999999999993,7.35,7.5,7.65,7.8,7.9499999999999993,8.1,8.25,8.4,8.5500000000000007,8.6999999999999993,8.85,9,9.1499999999999986,9.3000000000000007,9.4499999999999993,9.6,9.75,9.8999999999999986,10.050000000000001,10.199999999999999,10.35,10.5,10.649999999999999,10.8,10.95,11.1,11.25,11.399999999999999,11.55,11.7,11.85,12]
[null,33,4.6000000000000005,4.7500000000000009,4.9000000000000004,5.0500000000000007,5.2,5.3500000000000005,5.5,5.65,5.8000000000000007,5.95,6.1000000000000005,6.25,6.4,6.5500000000000007,6.7000000000000011,6.8500000000000005,7,7.15,7.3000000000000007,7.4500000000000011,7.6000000000000005,7.75,7.9,8.0500000000000007,8.1999999999999993,8.3500000000000014,8.5,8.65,8.8000000000000007,8.9499999999999993,9.1000000000000014,9.25,9.4,9.5500000000000007,9.6999999999999993,9.8500000000000014,10,10.15,10.3,10.45,10.600000000000001,10.75,10.9,11.05,11.2,11.350000000000001,11.5,11.65,11.8,11.95,12.100000000000001]
[null,34,4.7,4.8500000000000005,5,5.15,5.3,5.45,5.6,5.75,5.9,6.05,6.2,6.35,6.5,6.65,6.8000000000000007,6.95,7.1,7.25,7.4,7.5500000000000007,7.7,7.85,8,8.15,8.3000000000000007,8.4499999999999993,8.6,8.75,8.9,9.0500000000000007,9.1999999999999993,9.35,9.5,9.65,9.8000000000000007,9.9499999999999993,10.1,10.25,10.4,10.55,10.7,10.85,11,11.15,11.3,11.45,11.6,11.75,11.899999999999999,12.05,12.2]
[null,35,4.8,4.95,5.0999999999999996,5.25,5.3999999999999995,5.55,5.6999999999999993,5.85,6,6.1499999999999995,6.3,6.4499999999999993,6.6,6.75,6.9,7.05,7.1999999999999993,7.35,7.5,7.65,7.8,7.9499999999999993,8.1,8.25,8.3999999999999986,8.5500000000000007,8.6999999999999993,8.85,9,9.1499999999999986,9.3000000000000007,9.4499999999999993,9.6,9.75,9.8999999999999986,10.050000000000001,10.199999999999999,10.35,10.5,10.649999999999999,10.8,10.95,11.1,11.25,11.399999999999999,11.55,11.7,11.85,12,12.149999999999999,12.3]
[null,36,4.8999999999999995,{"$f":"1+$B102*0.1+0.3+D$11*0.15","v":5.05},5.1999999999999993,5.35,5.4999999999999991,5.6499999999999995,5.7999999999999989,5.9499999999999993,6.1,6.2499999999999991,6.3999999999999995,6.5499999999999989,6.6999999999999993,6.85,7,7.1499999999999995,7.2999999999999989,7.4499999999999993,7.6,7.75,7.8999999999999995,8.0499999999999989,8.1999999999999993,8.35,8.5,8.6499999999999986,8.7999999999999989,8.9499999999999993,9.1,9.25,9.3999999999999986,9.5499999999999989,9.6999999999999993,9.85,10,10.149999999999999,10.299999999999999,10.45,10.6,10.75,10.899999999999999,11.049999999999999,11.2,11.35,11.5,11.649999999999999,11.799999999999999,11.95,12.099999999999998,12.25,12.399999999999999]
[null,37,5,5.15,5.3,5.45,5.6,5.75,5.9,6.05,6.2,6.35,6.5,6.65,6.8,6.95,7.1,7.25,7.4,7.55,7.6999999999999993,7.85,8,8.15,8.3000000000000007,8.4499999999999993,8.6,8.75,8.9,9.0500000000000007,9.1999999999999993,9.35,9.5,9.6499999999999986,9.8000000000000007,9.9499999999999993,10.1,10.25,10.399999999999999,10.55,10.7,10.85,11,11.149999999999999,11.3,11.45,11.6,11.75,11.899999999999999,12.05,12.2,12.35,12.5]
[null,38,5.1000000000000005,5.2500000000000009,5.4,5.5500000000000007,5.7,5.8500000000000005,6,6.15,6.3000000000000007,6.45,6.6000000000000005,6.75,6.9,7.0500000000000007,7.2000000000000011,7.3500000000000005,7.5,7.65,7.8000000000000007,7.9500000000000011,8.1000000000000014,8.25,8.4,8.5500000000000007,8.6999999999999993,8.8500000000000014,9,9.15,9.3000000000000007,9.4499999999999993,9.6000000000000014,9.75,9.9,10.050000000000001,10.199999999999999,10.350000000000001,10.5,10.65,10.8,10.95,11.100000000000001,11.25,11.4,11.55,11.7,11.850000000000001,12,12.15,12.3,12.45,12.600000000000001]
[null,39,5.2,5.3500000000000005,5.5,5.65,5.8,5.95,6.1,6.25,6.4,6.55,6.7,6.85,7,7.15,7.3000000000000007,7.45,7.6,7.75,7.9,8.0500000000000007,8.1999999999999993,8.35,8.5,8.65,8.8000000000000007,8.9499999999999993,9.1,9.25,9.4,9.5500000000000007,9.6999999999999993,9.85,10,10.15,10.3,10.45,10.6,10.75,10.9,11.05,11.2,11.35,11.5,11.65,11.8,11.95,12.1,12.25,12.399999999999999,12.55,12.7]
[null,40,5.3,5.45,5.6,5.75,5.8999999999999995,6.05,6.1999999999999993,6.35,6.5,6.6499999999999995,6.8,6.9499999999999993,7.1,7.25,7.4,7.55,7.6999999999999993,7.85,8,8.15,8.3000000000000007,8.4499999999999993,8.6,8.75,8.8999999999999986,9.0500000000000007,9.1999999999999993,9.35,9.5,9.6499999999999986,9.8000000000000007,9.9499999999999993,10.1,10.25,10.399999999999999,10.55,10.7,10.85,11,11.149999999999999,11.3,11.45,11.6,11.75,11.899999999999999,12.05,12.2,12.35,12.5,12.649999999999999,12.8]
[null,41,5.4,5.5500000000000007,5.7,5.8500000000000005,6,6.15,{"$f":"1+$B107*0.1+0.3+I$11*0.15","v":6.3000000000000007},6.45,6.6000000000000005,6.75,6.9,7.0500000000000007,7.2,7.3500000000000005,7.5,7.65,7.8000000000000007,7.95,8.1,8.25,8.4,8.5500000000000007,8.6999999999999993,8.85,9,9.15,9.3000000000000007,9.4499999999999993,9.6000000000000014,9.75,9.9,10.050000000000001,10.199999999999999,10.350000000000001,10.5,10.65,10.8,10.95,11.100000000000001,11.25,11.4,11.55,11.7,11.850000000000001,12,12.15,12.3,12.45,12.6,12.75,12.9]
[null,42,5.5,5.65,5.8,5.95,6.1,6.25,6.4,6.55,6.7,6.85,7,7.15,7.3,7.45,7.6,7.75,7.9,8.0500000000000007,8.1999999999999993,8.35,8.5,8.65,8.8000000000000007,8.9499999999999993,9.1,9.25,9.4,9.5500000000000007,9.6999999999999993,9.85,10,10.149999999999999,10.3,10.45,10.6,10.75,10.899999999999999,11.05,11.2,11.35,11.5,11.649999999999999,11.8,11.95,12.1,12.25,12.399999999999999,12.55,12.7,12.85,13]
[null,43,5.6,5.75,5.8999999999999995,6.05,6.1999999999999993,6.35,6.5,6.6499999999999995,6.8,6.9499999999999993,7.1,7.25,7.3999999999999995,7.55,7.6999999999999993,7.85,8,8.1499999999999986,8.2999999999999989,8.4499999999999993,8.6,8.75,8.8999999999999986,9.0499999999999989,9.1999999999999993,9.35,9.5,9.6499999999999986,9.8000000000000007,9.9499999999999993,10.1,10.25,10.399999999999999,10.55,10.7,10.85,11,11.149999999999999,11.3,11.45,11.6,11.75,11.899999999999999,12.05,12.2,12.35,12.5,12.649999999999999,12.799999999999999,12.95,13.1]
[null,44,5.7,5.8500000000000005,6,6.15,6.3,6.45,6.6,6.75,6.9,7.05,7.2,7.35,7.5,7.65,7.8000000000000007,7.95,8.1,8.25,8.4,8.5500000000000007,8.6999999999999993,8.85,9,9.15,9.3000000000000007,9.4499999999999993,9.6,9.75,9.9,10.050000000000001,10.199999999999999,10.35,10.5,10.65,10.8,10.95,11.1,11.25,11.4,11.55,11.7,11.85,12,12.15,12.3,12.45,12.6,12.75,12.899999999999999,13.05,13.2]
[null,45,5.8,5.95,6.1,6.25,6.3999999999999995,6.55,6.6999999999999993,6.85,7,7.1499999999999995,7.3,7.4499999999999993,7.6,7.75,7.9,8.0500000000000007,8.1999999999999993,8.35,8.5,8.65,8.8000000000000007,8.9499999999999993,9.1,9.25,9.3999999999999986,9.5500000000000007,9.6999999999999993,9.85,10,10.149999999999999,10.3,10.45,10.6,10.75,10.899999999999999,11.05,11.2,11.35,11.5,11.649999999999999,11.8,11.95,12.1,12.25,12.399999999999999,12.55,12.7,12.85,13,13.149999999999999,13.3]
[null,46,5.9,6.0500000000000007,6.2,6.3500000000000005,6.5,6.65,6.8000000000000007,6.95,7.1000000000000005,7.25,7.4,{"$f":"1+$B112*0.1+0.3+N$11*0.15","v":7.5500000000000007},7.7,7.8500000000000005,8,8.15,8.3000000000000007,8.4499999999999993,8.6,8.75,8.9,9.0500000000000007,9.1999999999999993,9.35,9.5,9.65,9.8000000000000007,9.9499999999999993,10.100000000000001,10.25,10.4,10.55,10.7,10.850000000000001,11,11.15,11.3,11.45,11.600000000000001,11.75,11.9,12.05,12.2,12.350000000000001,12.5,12.65,12.8,12.95,13.1,13.25,13.4]
[null,47,6,6.15,6.3,6.45,6.6,6.75,6.9,7.05,7.2,7.35,7.5,7.65,7.8,7.95,8.1,8.25,8.4,8.5500000000000007,8.6999999999999993,8.85,9,9.15,9.3000000000000007,9.4499999999999993,9.6,9.75,9.9,10.050000000000001,10.199999999999999,10.35,10.5,10.649999999999999,10.8,10.95,11.1,11.25,11.399999999999999,11.55,11.7,11.85,12,12.149999999999999,12.3,12.45,12.6,12.75,12.899999999999999,13.05,13.2,13.35,13.5]
[null,48,6.1000000000000005,6.2500000000000009,6.4,6.5500000000000007,6.7,6.8500000000000005,7,7.15,7.3000000000000007,7.45,7.6000000000000005,7.75,7.9,8.0500000000000007,8.2000000000000011,8.3500000000000014,8.5,8.65,8.8000000000000007,8.9500000000000011,9.1000000000000014,9.25,9.4,9.5500000000000007,9.6999999999999993,9.8500000000000014,10,10.15,10.3,10.45,10.600000000000001,10.75,10.9,11.05,11.2,11.350000000000001,11.5,11.65,11.8,11.95,12.100000000000001,12.25,12.4,12.55,12.7,12.850000000000001,13,13.15,13.3,13.45,13.600000000000001]
[null,49,6.2,6.3500000000000005,6.5,6.65,6.8,6.95,7.1,7.25,7.4,7.55,7.7,7.85,8,8.15,8.3000000000000007,8.4499999999999993,8.6,8.75,8.9,9.0500000000000007,9.1999999999999993,9.35,9.5,9.65,9.8000000000000007,9.9499999999999993,10.1,10.25,10.4,10.55,10.7,10.85,11,11.15,11.3,11.45,11.6,11.75,11.9,12.05,12.2,12.35,12.5,12.65,12.8,12.95,13.1,13.25,13.399999999999999,13.55,13.7]
[null,50,6.3,6.45,6.6,6.75,6.8999999999999995,7.05,7.1999999999999993,7.35,7.5,7.6499999999999995,7.8,7.9499999999999993,8.1,8.25,8.4,8.5500000000000007,8.6999999999999993,8.85,9,9.15,9.3000000000000007,9.4499999999999993,9.6,9.75,9.8999999999999986,10.050000000000001,10.199999999999999,10.35,10.5,10.649999999999999,10.8,10.95,11.1,11.25,11.399999999999999,11.55,11.7,11.85,12,12.149999999999999,12.3,12.45,12.6,12.75,12.899999999999999,13.05,13.2,13.35,13.5,13.649999999999999,13.8]

{"sheet":"tdp","index":4,"n_rows":102,"n_cols":28,"rows_kept":102,"cut":false,"hidden":false,"merged":[]}
["TDP","ouv","jsn","sn","ne","js","so","con","art","arte","se","tk","tu","tue",null,"ouvri","jsn","sn","ne ","js","so","con","art","arte ","se","tk","tu","tue"]
[null,null,null,null,null,null,null,null,null,null,null,null,null,null,null,60,300,450,570,740,1000,1410,1440,1520,1450,1860,2740,2740]
[1,{"$f":"P2*0.9^(A3)","v":54},{"$f":"Q2*0.9^(A3)","v":270},{"$f":"R3*0.9^(A3)","v":405},{"$f":"S3*0.9^(A3)","v":513},{"$f":"T3*0.9^(A3)","v":666},{"$f":"U3*0.9^(A3)","v":900},{"$f":"V3*0.9^(A3)","v":1269},{"$f":"W3*0.9^(A3)","v":1296},{"$f":"X3*0.9^(A3)","v":1368},{"$f":"Y3*0.9^(A3)","v":1305},{"$f":"Z3*0.9^(A3)","v":1674},{"$f":"AA3*0.9^(A3)","v":2466},{"$f":"AB3*0.9^(A3)","v":2466},null,60,300,450,570,740,1000,1410,1440,1520,1450,1860,2740,2740]
[2,{"$f":"P3*0.9^(A4)","v":48.6},{"$f":"Q3*0.9^(A4)","v":243.00000000000003},{"$f":"R4*0.9^(A4)","v":364.5},{"$f":"S4*0.9^(A4)","v":461.70000000000005},{"$f":"T4*0.9^(A4)","v":599.40000000000009},{"$f":"U4*0.9^(A4)","v":810},{"$f":"V4*0.9^(A4)","v":1142.1000000000001},{"$f":"W4*0.9^(A4)","v":1166.4000000000001},{"$f":"X4*0.9^(A4)","v":1231.2},{"$f":"Y4*0.9^(A4)","v":1174.5},{"$f":"Z4*0.9^(A4)","v":1506.6000000000001},{"$f":"AA4*0.9^(A4)","v":2219.4},{"$f":"AB4*0.9^(A4)","v":2219.4},null,60,300,450,570,740,1000,1410,1440,1520,1450,1860,2740,2740]
[3,43.740000000000009,218.70000000000002,328.05000000000007,415.53000000000003,539.46,729.00000000000011,1027.8900000000001,1049.7600000000002,1108.0800000000002,1057.0500000000002,1355.9400000000003,1997.4600000000003,1997.4600000000003,null,60,300,450,570,740,1000,1410,1440,1520,1450,1860,2740,2740]
[4,39.366000000000007,196.83000000000004,295.24500000000006,373.97700000000009,485.51400000000007,656.10000000000014,925.10100000000023,944.78400000000022,997.27200000000016,951.34500000000014,1220.3460000000002,1797.7140000000004,1797.7140000000004,null,60,300,450,570,740,1000,1410,1440,1520,1450,1860,2740,2740]
[5,35.429400000000008,177.14700000000005,265.72050000000007,336.5793000000001,436.96260000000012,590.49000000000024,832.59090000000026,850.30560000000025,897.54480000000024,856.21050000000025,1098.3114000000003,1617.9426000000005,1617.9426000000005,null,60,300,450,570,740,1000,1410,1440,1520,1450,1860,2740,2740]
[6,31.88646000000001,159.43230000000005,239.14845000000008,302.92137000000008,393.26634000000013,531.44100000000014,749.33181000000025,765.27504000000022,807.79032000000029,770.58945000000028,988.48026000000027,1456.1483400000004,1456.1483400000004,null,60,300,450,570,740,1000,1410,1440,1520,1450,1860,2740,2740]
[7,28.697814000000008,143.48907000000003,215.23360500000007,272.62923300000006,353.93970600000011,478.29690000000016,674.39862900000014,688.7475360000002,727.01128800000015,693.53050500000018,889.63223400000027,1310.5335060000004,1310.5335060000004,null,60,300,450,570,740,1000,1410,1440,1520,1450,1860,2740,2740]
[8,25.828032600000011,129.14016300000006,193.71024450000007,245.3663097000001,318.54573540000013,430.46721000000014,606.95876610000028,619.87278240000023,654.31015920000027,624.17745450000018,800.66901060000032,1179.4801554000005,1179.4801554000005,null,60,300,450,570,740,1000,1410,1440,1520,1450,1860,2740,2740]
[9,23.245229340000009,116.22614670000004,174.33922005000005,220.82967873000007,286.69116186000008,387.42048900000015,546.26288949000025,557.88550416000021,588.87914328000022,561.7597090500002,720.60210954000024,1061.5321398600004,1061.5321398600004,null,60,300,450,570,740,1000,1410,1440,1520,1450,1860,2740,2740]
[10,20.920706406000008,104.60353203000004,156.90529804500008,198.7467108570001,258.02204567400014,348.67844010000016,491.63660054100023,502.09695374400025,529.99122895200026,505.58373814500021,648.54189858600023,955.3789258740004,955.3789258740004,null,60,300,450,570,740,1000,1410,1440,1520,1450,1860,2740,2740]
[11,18.828635765400008,94.143178827000057,141.21476824050006,178.87203977130011,232.21984110660011,313.81059609000016,442.47294048690026,451.88725836960026,476.99210605680025,455.02536433050022,583.68770872740026,859.84103328660046,859.84103328660046,null,60,300,450,570,740,1000,1410,1440,1520,1450,1860,2740,2740]
[12,16.945772188860008,84.728860944300052,127.09329141645007,160.9848357941701,208.99785699594011,282.42953648100018,398.22564643821022,406.69853253264023,429.29289545112027,409.52282789745021,525.31893785466036,773.85692995794045,773.85692995794045,null,60,300,450,570,740,1000,1410,1440,1520,1450,1860,2740,2740]
[13,15.251194969974012,76.255974849870057,114.38396227480509,144.88635221475312,188.09807129634615,254.1865828329002,358.40308179438927,366.02867927937626,386.36360590600827,368.5705451077053,472.78704406919434,696.47123696214646,696.47123696214646,null,60,300,450,570,740,1000,1410,1440,1520,1450,1860,2740,2740]
[14,13.726075472976609,68.630377364883046,102.94556604732456,130.39771699327778,169.28826416671151,228.76792454961014,322.56277361495029,329.4258113514386,347.7272453154074,331.71349059693472,425.50833966227486,626.82411326593183,626.82411326593183,null,60,300,450,570,740,1000,1410,1440,1520,1450,1860,2740,2740]
[15,12.353467925678947,61.767339628394737,92.651009442592112,117.35794529395,152.35943775004034,205.89113209464912,290.30649625345529,296.48323021629471,312.95452078386666,298.54214153724121,382.95750569604735,564.14170193933865,564.14170193933865,null,60,300,450,570,740,1000,1410,1440,1520,1450,1860,2740,2740]
[16,11.118121133111055,55.590605665555273,83.38590849833291,105.62215076455502,137.12349397503635,185.30201888518425,261.27584662810978,266.83490719466533,281.65906870548002,268.68792738351715,344.6617551264427,507.7275317454048,507.7275317454048,null,60,300,450,570,740,1000,1410,1440,1520,1450,1860,2740,2740]
[17,10.00630901979995,50.03154509899975,75.047317648499615,95.059935688099515,123.41114457753271,166.77181699666582,235.14826196529881,240.15141647519877,253.49316183493204,241.81913464516543,310.19557961379843,456.95477857086433,456.95477857086433,null,60,300,450,570,740,1000,1410,1440,1520,1450,1860,2740,2740]
[18,9.0056781178199543,45.028390589099772,67.54258588364965,85.553942119289559,111.07003011977943,150.09463529699923,211.63343576876892,216.1362748276789,228.14384565143882,217.63722118064888,279.17602165241857,411.25930071377792,411.25930071377792,null,60,300,450,570,740,1000,1410,1440,1520,1450,1860,2740,2740]
[19,8.105110306037961,40.525551530189801,60.788327295284702,76.998547907360617,99.963027107801508,135.08517176729933,190.47009219189206,194.52264734491104,205.329461086295,195.87349906258405,251.25841948717678,370.13337064240017,370.13337064240017,null,60,300,450,570,740,1000,1410,1440,1520,1450,1860,2740,2740]
[20,7.2945992754341642,36.472996377170823,54.709494565756231,69.298693116624563,89.966724397021366,121.5766545905694,171.42308297270287,175.07038261041995,184.79651497766551,176.28614915632565,226.13257753845909,333.12003357816019,333.12003357816019,null,60,300,450,570,740,1000,1410,1440,1520,1450,1860,2740,2740]
[21,6.5651393478907485,32.82569673945374,49.238545109180613,62.368823804962112,80.970051957319228,109.41898913151248,154.28077467543258,157.56334434937796,166.31686347989896,158.65753424069308,203.5193197846132,299.80803022034416,299.80803022034416,null,60,300,450,570,740,1000,1410,1440,1520,1450,1860,2740,2740]
[22,5.9086254131016744,29.543127065508372,44.314690598262558,56.131941424465907,72.873046761587318,98.477090218361241,138.85269720788935,141.80700991444019,149.68517713190909,142.7917808166238,183.16738780615191,269.8272271983098,269.8272271983098,null,60,300,450,570,740,1000,1410,1440,1520,1450,1860,2740,2740]
[23,5.3177628717915066,26.588814358957531,39.883221538436302,50.518747282019312,65.585742085428578,88.629381196525102,124.96742748710041,127.62630892299616,134.71665941871817,128.5126027349614,164.85064902553671,242.8445044784788,242.8445044784788,null,60,300,450,570,740,1000,1410,1440,1520,1450,1860,2740,2740]
[24,4.7859865846123562,23.929932923061781,35.894899384592669,45.466872553817382,59.02716787688572,79.766443076872605,112.47068473839036,114.86367803069655,121.24499347684635,115.66134246146527,148.36558412298302,218.56005403063091,218.56005403063091,null,60,300,450,570,740,1000,1410,1440,1520,1450,1860,2740,2740]
[25,4.3073879261511205,21.536939630755604,32.305409446133403,40.920185298435648,53.124451089197152,71.789798769185339,101.22361626455134,103.37731022762689,109.12049412916173,104.09520821531875,133.52902571068475,196.70404862756783,196.70404862756783,null,60,300,450,570,740,1000,1410,1440,1520,1450,1860,2740,2740]
[26,3.8766491335360089,19.383245667680043,29.074868501520069,36.828166768592084,47.812005980277441,64.610818892266821,91.101254638096208,93.039579204864211,98.208444716245566,93.685687393786878,120.17612313961628,177.03364376481107,177.03364376481107,null,60,300,450,570,740,1000,1410,1440,1520,1450,1860,2740,2740]
[27,3.4889842201824082,17.44492110091204,26.167381651368061,33.14535009173288,43.030805382249703,58.149737003040137,81.991129174286598,83.7356212843778,88.387600244621012,84.317118654408205,108.15851082565466,159.33027938832998,159.33027938832998,null,60,300,450,570,740,1000,1410,1440,1520,1450,1860,2740,2740]
[28,3.1400857981641677,15.700428990820837,23.550643486231259,29.830815082559592,38.727724844024735,52.334763302736128,73.792016256857934,75.362059155940017,79.548840220158908,75.885406788967387,97.3426597430892,143.39725144949699,143.39725144949699,null,60,300,450,570,740,1000,1410,1440,1520,1450,1860,2740,2740]
[29,2.8260772183477512,14.130386091738757,21.195579137608135,26.847733574303636,34.854952359622267,47.101286972462518,66.412814631172154,67.825853240346021,71.593956198143033,68.296866110070653,87.608393768780289,129.05752630454731,129.05752630454731,null,60,300,450,570,740,1000,1410,1440,1520,1450,1860,2740,2740]
[30,2.543469496512976,12.717347482564879,19.07602122384732,24.16296021687327,31.369457123660037,42.391158275216263,59.77153316805493,61.043267916311422,64.434560578328728,61.467179499063583,78.84755439190225,116.15177367409257,116.15177367409257,null,60,300,450,570,740,1000,1410,1440,1520,1450,1860,2740,2740]
[31,2.289122546861678,11.445612734308391,17.168419101462586,21.746664195185943,28.232511411294031,38.152042447694633,53.794379851249438,54.938941124680277,57.991104520495846,55.320461549157223,70.962798952712021,104.53659630668331,104.53659630668331,null,60,300,450,570,740,1000,1410,1440,1520,1450,1860,2740,2740]
[32,2.0602102921755105,10.301051460877554,15.45157719131633,19.571997775667352,25.409260270164634,34.336838202925179,48.414941866124501,49.445047012212257,52.19199406844627,49.788415394241511,63.866519057440833,94.082936676014981,94.082936676014981,null,60,300,450,570,740,1000,1410,1440,1520,1450,1860,2740,2740]
[33,1.8541892629579597,9.2709463147897981,13.906419472184696,17.614797998100617,22.868334243148169,30.90315438263266,43.57344767951205,44.50054231099103,46.972794661601647,44.809573854817359,57.479867151696752,84.674643008413483,84.674643008413483,null,60,300,450,570,740,1000,1410,1440,1520,1450,1860,2740,2740]
[34,1.6687703366621638,8.3438516833108185,12.515777524966227,15.853318198290555,20.581500818833351,27.812838944369396,39.216102911560846,40.050488079891927,42.275515195441479,40.328616469335621,51.731880436527071,76.20717870757214,76.20717870757214,null,60,300,450,570,740,1000,1410,1440,1520,1450,1860,2740,2740]
[35,1.5018933029959474,7.5094665149797377,11.264199772469606,14.267986378461501,18.523350736950018,25.031555049932457,35.294492620404768,36.045439271902737,38.047963675897336,36.295754822402067,46.55869239287437,68.586460836814936,68.586460836814936,null,60,300,450,570,740,1000,1410,1440,1520,1450,1860,2740,2740]
[36,1.3517039726963527,6.758519863481764,10.137779795222645,12.841187740615352,16.671015663255016,22.528399544939212,31.765043358364291,32.440895344712466,34.243167308307605,32.666179340161861,41.902823153586937,61.727814753133444,61.727814753133444,null,60,300,450,570,740,1000,1410,1440,1520,1450,1860,2740,2740]
[37,1.2165335754267177,6.0826678771335887,9.1240018157003835,11.557068966553818,15.003914096929519,20.275559590445294,28.588539022527865,29.196805810241226,30.818850577476848,29.399561406145679,37.71254083822825,55.555033277820108,55.555033277820108,null,60,300,450,570,740,1000,1410,1440,1520,1450,1860,2740,2740]
[38,1.0948802178840458,5.4744010894202288,8.2116016341303428,10.401362069898436,13.503522687236565,18.248003631400763,25.729685120275075,26.277125229217098,27.736965519729161,26.459605265531106,33.941286754405418,49.999529950038095,49.999529950038095,null,60,300,450,570,740,1000,1410,1440,1520,1450,1860,2740,2740]
[39,{"$f":"P40*0.9^(A41)","v":0.98539219609564133},4.9269609804782064,7.3904414707173096,9.3612258629085918,12.153170418512909,16.423203268260689,23.156716608247571,23.649412706295394,24.963268967756246,23.813644738977999,30.54715807896488,44.999576955034286,44.999576955034286,null,60,300,450,570,740,1000,1410,1440,1520,1450,1860,2740,2740]
[40,0.88685297648607719,4.4342648824303863,6.651397323645579,8.4251032766177332,10.937853376661618,14.780882941434619,20.841044947422812,21.284471435665854,22.466942070980622,21.432280265080198,27.492442271068391,40.49961925953086,40.49961925953086,null,60,300,450,570,740,1000,1410,1440,1520,1450,1860,2740,2740]
[41,0.79816767883746942,3.9908383941873473,5.9862575912810208,7.58259294895596,9.8440680389954576,13.302794647291158,18.756940452680531,19.156024292099268,20.220247863882559,19.289052238572179,24.743198043961552,36.449657333577775,36.449657333577775,null,60,300,450,570,740,1000,1410,1440,1520,1450,1860,2740,2740]
[42,0.71835091095372261,3.5917545547686132,5.3876318321529197,6.8243336540603643,8.8596612350959116,11.972515182562043,16.88124640741248,17.240421862889342,18.198223077494305,17.360147014714961,22.268878239565399,32.804691600219996,32.804691600219996,null,60,300,450,570,740,1000,1410,1440,1520,1450,1860,2740,2740]
[43,0.64651581985835038,3.232579099291752,4.8488686489376276,6.1419002886543286,7.9736951115863217,10.775263664305839,15.193121766671235,15.516379676600408,16.378400769744875,15.624132313243468,20.041990415608861,29.524222440198002,29.524222440198002,null,60,300,450,570,740,1000,1410,1440,1520,1450,1860,2740,2740]
[44,0.5818642378725154,2.909321189362577,4.3639817840438653,5.527710259788897,7.1763256004276901,9.697737297875257,13.673809590004112,13.96474170894037,14.740560692770391,14.061719081919122,18.037791374047977,26.571800196178206,26.571800196178206,null,60,300,450,570,740,1000,1410,1440,1520,1450,1860,2740,2740]
[45,0.52367781408526404,2.61838907042632,3.9275836056394797,4.9749392338100078,6.4586930403849223,8.7279635680877323,12.306428631003703,12.568267538046335,13.266504623493354,12.655547173727212,16.234012236643185,23.914620176560391,23.914620176560391,null,60,300,450,570,740,1000,1410,1440,1520,1450,1860,2740,2740]
[46,0.47131003267673743,2.3565501633836874,3.5348252450755311,4.4774453104290055,5.812823736346429,7.8551672112789577,11.07578576790333,11.311440784241698,11.939854161144016,11.389992456354488,14.610611012978861,21.523158158904344,21.523158158904344,null,60,300,450,570,740,1000,1410,1440,1520,1450,1860,2740,2740]
[47,0.42417902940906371,2.1208951470453186,3.1813427205679781,4.0297007793861059,5.2315413627117859,7.0696504901510622,9.968207191112997,10.180296705817529,10.745868745029615,10.25099321071904,13.149549911680976,19.370842343013912,19.370842343013912,null,60,300,450,570,740,1000,1410,1440,1520,1450,1860,2740,2740]
[48,0.38176112646815746,1.9088056323407872,2.8632084485111808,3.6267307014474959,4.7083872264406086,6.3626854411359579,8.9713864720017007,9.1622670352357787,9.6712818705266557,9.2258938896471392,11.834594920512881,17.433758108712524,17.433758108712524,null,60,300,450,570,740,1000,1410,1440,1520,1450,1860,2740,2740]
[49,0.34358501382134171,1.7179250691067085,2.5768876036600625,3.2640576313027463,4.2375485037965479,5.7264168970223617,8.0742478248015299,8.2460403317122015,8.7041536834739901,8.3033045006824242,10.651135428461593,15.690382297841271,15.690382297841271,null,60,300,450,570,740,1000,1410,1440,1520,1450,1860,2740,2740]
[50,0.30922651243920751,1.5461325621960373,2.319198843294056,2.937651868172471,3.8137936534168921,5.1537752073201251,7.2668230423213762,7.4214362985409794,7.83373831512659,7.4729740506141811,9.5860218856154322,14.121344068057143,14.121344068057143,null,60,300,450,570,740,1000,1410,1440,1520,1450,1860,2740,2740]
[51,0.27830386119528683,1.3915193059764341,2.0872789589646512,2.6438866813552249,3.4324142880752038,4.6383976865881138,6.5401407380892396,6.679292668686883,7.0503644836139321,6.7256766455527641,8.6274196970538917,12.70920966125143,12.70920966125143,null,60,300,450,570,740,1000,1410,1440,1520,1450,1860,2740,2740]
[52,0.25047347507575818,1.2523673753787907,1.8785510630681861,2.3794980132197026,3.0891728592676841,4.1745579179293024,5.8861266642803169,6.0113634018181958,6.3453280352525399,6.0531089809974885,7.764677727348503,11.438288695126289,11.438288695126289,null,60,300,450,570,740,1000,1410,1440,1520,1450,1860,2740,2740]
[53,0.22542612756818237,1.1271306378409118,1.6906959567613677,2.1415482118977325,2.7802555733409156,3.7571021261363726,5.2975139978522856,5.4102270616363768,5.7107952317272863,5.4477980828977399,6.9882099546136534,10.294459825613661,10.294459825613661,null,60,300,450,570,740,1000,1410,1440,1520,1450,1860,2740,2740]
[54,0.20288351481136413,1.0144175740568206,1.521626361085231,1.9273933907079592,2.5022300160068243,3.3813919135227355,4.7677625980670566,4.8692043554727391,5.1397157085545579,4.903018274607966,6.289388959152288,9.2650138430522944,9.2650138430522944,null,60,300,450,570,740,1000,1410,1440,1520,1450,1860,2740,2740]
[55,0.18259516333022771,0.91297581665113847,1.3694637249767077,1.7346540516371631,2.2520070144061415,3.0432527221704615,4.2909863382603506,4.3822839199254648,4.625744137699102,4.4127164471471696,5.6604500632370582,8.3385124587470649,8.3385124587470649,null,60,300,450,570,740,1000,1410,1440,1520,1450,1860,2740,2740]
[56,0.16433564699720493,0.82167823498602466,1.2325173524790369,1.5611886464734468,2.0268063129655274,2.7389274499534157,3.8618877044343161,3.9440555279329184,4.163169723929192,3.9714448024324525,5.0944050569133532,7.5046612128723584,7.5046612128723584,null,60,300,450,570,740,1000,1410,1440,1520,1450,1860,2740,2740]
[57,0.14790208229748444,0.73951041148742225,1.1092656172311335,1.4050697818261022,1.8241256816689748,2.4650347049580743,3.4756989339908846,3.5496499751396269,3.7468527515362728,3.5743003221892073,4.5849645512220176,6.7541950915851237,6.7541950915851237,null,60,300,450,570,740,1000,1410,1440,1520,1450,1860,2740,2740]
[58,0.13311187406773603,0.66555937033868007,0.99833905550802016,1.2645628036434922,1.6417131135020775,2.218531234462267,3.1281290405917965,3.1946849776256645,3.3721674763826459,3.216870289970287,4.126468096099817,6.0787755824266121,6.0787755824266121,null,60,300,450,570,740,1000,1410,1440,1520,1450,1860,2740,2740]
[59,0.11980068666096243,0.59900343330481221,0.8985051499572182,1.1381065232791432,1.47754180215187,1.9966781110160405,2.8153161365326174,2.8752164798630986,3.0349507287443815,2.8951832609732588,3.7138212864898352,5.4708980241839509,5.4708980241839509,null,60,300,450,570,740,1000,1410,1440,1520,1450,1860,2740,2740]
[60,0.1078206179948662,0.53910308997433098,0.80865463496149648,1.0242958709512289,1.3297876219366831,1.7970102999144366,2.5337845228793556,2.5876948318767887,2.7314556558699437,2.6056649348759331,3.3424391578408521,4.9238082217655563,4.9238082217655563,null,60,300,450,570,740,1000,1410,1440,1520,1450,1860,2740,2740]
[61,9.7038556195379572E-2,0.48519278097689789,0.72778917146534683,0.92186628385610603,1.1968088597430149,1.617309269922993,2.28040607059142,2.3289253486891099,2.4583100902829491,2.3450984413883398,3.0081952420567668,4.4314273995890003,4.4314273995890003,null,60,300,450,570,740,1000,1410,1440,1520,1450,1860,2740,2740]
[62,8.7334700575841626E-2,0.43667350287920814,0.65501025431881221,0.82967965547049538,1.0771279737687134,1.4555783429306937,2.0523654635322783,2.0960328138201989,2.2124790812546546,2.1105885972495058,2.7073757178510904,3.9882846596301009,3.9882846596301009,null,60,300,450,570,740,1000,1410,1440,1520,1450,1860,2740,2740]
[63,7.8601230518257459E-2,0.39300615259128729,0.58950922888693091,0.74671168992344583,0.96941517639184194,1.3100205086376242,1.8471289171790501,1.886429532438179,1.991231173129189,1.8995297375245552,2.4366381460659809,3.5894561936670906,3.5894561936670906,null,60,300,450,570,740,1000,1410,1440,1520,1450,1860,2740,2740]
[64,7.0741107466431724E-2,0.35370553733215859,0.53055830599823794,0.67204052093110134,0.87247365875265792,1.179018457773862,1.6624160254611453,1.6977865791943614,1.7921080558162703,1.7095767637721,2.1929743314593835,3.2305105743003817,3.2305105743003817,null,60,300,450,570,740,1000,1410,1440,1520,1450,1860,2740,2740]
[65,6.3666996719788552E-2,0.31833498359894274,0.47750247539841412,0.60483646883799125,0.7852262928773921,1.0611166119964759,1.4961744229150309,1.5280079212749251,1.6128972502346433,1.53861908739489,1.9736768983134449,2.9074595168703437,2.9074595168703437,null,60,300,450,570,740,1000,1410,1440,1520,1450,1860,2740,2740]
[66,{"$f":"P67*0.9^(A68)","v":5.7300297047809694E-2},{"$f":"Q67*0.9^(A68)","v":0.2865014852390485},{"$f":"R68*0.9^(A68)","v":0.4297522278585727},{"$f":"S68*0.9^(A68)","v":0.5443528219541921},{"$f":"T68*0.9^(A68)","v":0.70670366358965298},{"$f":"U68*0.9^(A68)","v":0.95500495079682823},{"$f":"V68*0.9^(A68)","v":1.3465569806235278},{"$f":"W68*0.9^(A68)","v":1.3752071291474328},{"$f":"X68*0.9^(A68)","v":1.4516075252111791},{"$f":"Y68*0.9^(A68)","v":1.3847571786554009},{"$f":"Z68*0.9^(A68)","v":1.7763092084821006},{"$f":"AA68*0.9^(A68)","v":2.6167135651833093},{"$f":"AB68*0.9^(A68)","v":2.6167135651833093},null,60,300,450,570,740,1000,1410,1440,1520,1450,1860,2740,2740]
[67,5.1570267343028733E-2,0.25785133671514365,0.38677700507271551,0.48991753975877295,0.63603329723068769,0.85950445571714551,1.2119012825611752,1.2376864162326895,1.3064467726900613,1.2462814607898609,1.5986782876338907,2.3550422086649787,2.3550422086649787,null,60,300,450,570,740,1000,1410,1440,1520,1450,1860,2740,2740]
[68,4.6413240608725863E-2,0.23206620304362929,0.34809930456544397,0.44092578578289571,0.57242996750761899,0.77355401014543101,1.0907111543050578,1.1139177746094207,1.1758020954210551,1.1216533147108749,1.4388104588705017,2.119537987798481,2.119537987798481,null,60,300,450,570,740,1000,1410,1440,1520,1450,1860,2740,2740]
[69,4.1771916547853276E-2,0.20885958273926639,0.31328937410889957,0.39683320720460613,0.51518697075685704,0.69619860913088794,0.98164003887455198,1.0025259971484786,1.0582218858789496,1.0094879832397876,1.2949294129834517,1.9075841890186329,1.9075841890186329,null,60,300,450,570,740,1000,1410,1440,1520,1450,1860,2740,2740]
[70,3.7594724893067949E-2,0.18797362446533974,0.28196043669800963,0.35714988648414553,0.46366827368117136,0.62657874821779913,0.88347603498709681,0.90227339743363077,0.95239969729105478,0.90853918491580876,1.1654364716851064,1.7168257701167697,1.7168257701167697,null,60,300,450,570,740,1000,1410,1440,1520,1450,1860,2740,2740]
[71,3.3835252403761153E-2,0.16917626201880576,0.25376439302820863,0.32143489783573098,0.41730144631305421,0.56392087339601926,0.79512843148838708,0.81204605769026772,0.85715972756194925,0.8176852664242279,1.0488928245165958,1.5451431931050927,1.5451431931050927,null,60,300,450,570,740,1000,1410,1440,1520,1450,1860,2740,2740]
[72,3.0451727163385043E-2,0.1522586358169252,0.22838795372538781,0.28929140805215792,0.37557130168174885,0.50752878605641738,0.71561558833954853,0.73084145192124106,0.77144375480575444,0.73591673978180516,0.94400354206493631,1.3906288737945836,1.3906288737945836,null,60,300,450,570,740,1000,1410,1440,1520,1450,1860,2740,2740]
[73,2.7406554447046538E-2,0.13703277223523269,0.20554915835284904,0.26036226724694211,0.33801417151357399,0.45677590745077562,0.64405402950559365,0.65775730672911692,0.69429937932517893,0.66232506580362471,0.84960318785844269,1.2515659864151252,1.2515659864151252,null,60,300,450,570,740,1000,1410,1440,1520,1450,1860,2740,2740]
[74,2.4665899002341885E-2,0.12332949501170944,0.18499424251756416,0.23432604052224792,0.30421275436221662,0.41109831670569813,0.57964862655503435,0.59198157605620527,0.6248694413926611,0.59609255922326221,0.76464286907259849,1.1264093877736128,1.1264093877736128,null,60,300,450,570,740,1000,1410,1440,1520,1450,1860,2740,2740]
[75,2.2199309102107701E-2,0.1109965455105385,0.16649481826580775,0.21089343647002315,0.27379147892599498,0.36998848503512832,0.52168376389953097,0.53278341845058486,0.56238249725339506,0.53648330330093608,0.68817858216533878,1.0137684489962517,1.0137684489962517,null,60,300,450,570,740,1000,1410,1440,1520,1450,1860,2740,2740]
[76,1.9979378191896931E-2,9.9896890959484647E-2,0.14984533643922698,0.18980409282302085,0.24641233103339547,0.33298963653161551,0.46951538750957789,0.47950507660552633,0.50614424752805554,0.48283497297084249,0.61936072394880481,0.91239160409662645,0.91239160409662645,null,60,300,450,570,740,1000,1410,1440,1520,1450,1860,2740,2740]
[77,1.7981440372707238E-2,8.9907201863536193E-2,0.1348608027953043,0.17082368354071878,0.22177109793005595,0.29969067287845397,0.42256384875862013,0.43155456894497374,0.45552982277525006,0.43455147567375829,0.5574246515539244,0.82115244368696394,0.82115244368696394,null,60,300,450,570,740,1000,1410,1440,1520,1450,1860,2740,2740]
[78,1.6183296335436515E-2,8.0916481677182572E-2,0.12137472251577386,0.15374131518664688,0.19959398813705034,0.26972160559060859,0.3803074638827581,0.38839911205047639,0.40997684049772504,0.39109632810638245,0.50168218639853202,0.7390371993182675,0.7390371993182675,null,60,300,450,570,740,1000,1410,1440,1520,1450,1860,2740,2740]
[79,1.4564966701892864E-2,7.2824833509464323E-2,0.10923725026419648,0.1383671836679822,0.17963458932334531,0.24274944503154772,0.3422767174944823,0.34955920084542874,0.36897915644795254,0.35198669529574422,0.45151396775867875,0.66513347938644074,0.66513347938644074,null,60,300,450,570,740,1000,1410,1440,1520,1450,1860,2740,2740]
[80,1.310847003170358E-2,6.5542350158517892E-2,9.8313525237776839E-2,0.124530465301184,0.1616711303910108,0.21847450052839298,0.30804904574503411,0.31460328076088589,0.33208124080315732,0.31678802576616982,0.40636257098281092,0.5986201314477968,0.5986201314477968,null,60,300,450,570,740,1000,1410,1440,1520,1450,1860,2740,2740]
[81,1.1797623028533221E-2,5.8988115142666109E-2,8.8482172713999163E-2,0.11207741877106561,0.14550401735190974,0.19662705047555371,0.2772441411705307,0.28314295268479733,0.29887311672284161,0.28510922318955284,0.36572631388452986,0.53875811830301712,0.53875811830301712,null,60,300,450,570,740,1000,1410,1440,1520,1450,1860,2740,2740]
[82,1.06178607256799E-2,5.3089303628399497E-2,7.9633955442599241E-2,0.10086967689395904,0.13095361561671875,0.17696434542799833,0.24951972705347764,0.25482865741631761,0.26898580505055747,0.25659830087059754,0.32915368249607685,0.48488230647271541,0.48488230647271541,null,60,300,450,570,740,1000,1410,1440,1520,1450,1860,2740,2740]
[83,9.5560746531119095E-3,4.7780373265559554E-2,7.1670559898339328E-2,9.0782709204563147E-2,0.11785825405504689,0.15926791088519851,0.22456775434812989,0.22934579167468586,0.24208722454550172,0.23093847078353782,0.29623831424646924,0.43639407582544393,0.43639407582544393,null,60,300,450,570,740,1000,1410,1440,1520,1450,1860,2740,2740]
[84,8.6004671878007199E-3,4.30023359390036E-2,6.45035039085054E-2,8.170443828410684E-2,0.10607242864954221,0.14334111979667866,0.20211097891331692,0.20641121250721728,0.21787850209095155,0.20784462370518406,0.26661448282182232,0.39275466824289951,0.39275466824289951,null,60,300,450,570,740,1000,1410,1440,1520,1450,1860,2740,2740]
[85,7.7404204690206483E-3,3.8702102345103247E-2,5.8053153517654867E-2,7.3533994455696167E-2,9.5465185784588E-2,0.1290070078170108,0.18189988102198523,0.18577009125649557,0.19609065188185643,0.18706016133466569,0.23995303453964012,0.35347920141860961,0.35347920141860961,null,60,300,450,570,740,1000,1410,1440,1520,1450,1860,2740,2740]
[86,6.9663784221185845E-3,3.483189211059292E-2,5.2247838165889383E-2,6.6180595010126547E-2,8.5918667206129201E-2,0.11610630703530973,0.16370989291978671,0.16719308213084602,0.17648158669367081,0.16835414520119912,0.21595773108567612,0.31813128127674867,0.31813128127674867,null,60,300,450,570,740,1000,1410,1440,1520,1450,1860,2740,2740]
[87,6.2697405799067253E-3,3.1348702899533627E-2,4.7023054349300437E-2,5.956253550911389E-2,7.7326800485516281E-2,0.10449567633177875,0.14733890362780805,0.1504737739177614,0.15883342802430372,0.15151873068107921,0.19436195797710848,0.28631815314907377,0.28631815314907377,null,60,300,450,570,740,1000,1410,1440,1520,1450,1860,2740,2740]
[88,5.6427665219160534E-3,2.8213832609580266E-2,4.2320748914370397E-2,5.3606281958202509E-2,6.9594120436964654E-2,9.4046108698600889E-2,0.13260501326502724,0.13542639652598529,0.14295008522187336,0.13636685761297129,0.17492576217939765,0.25768633783416645,0.25768633783416645,null,60,300,450,570,740,1000,1410,1440,1520,1450,1860,2740,2740]
[89,5.0784898697244481E-3,2.539244934862224E-2,3.808867402293336E-2,4.8245653762382254E-2,6.2634708393268193E-2,8.4641497828740794E-2,0.11934451193852454,0.12188375687338675,0.12865507669968601,0.12273017185167416,0.15743318596145789,0.2319177040507498,0.2319177040507498,null,60,300,450,570,740,1000,1410,1440,1520,1450,1860,2740,2740]
[90,4.5706408827520043E-3,2.2853204413760018E-2,3.4279806620640028E-2,4.3421088386144037E-2,5.6371237553941383E-2,7.6177348045866733E-2,0.10741006074467209,0.10969538118604809,0.11578956902971743,0.11045715466650675,0.14168986736531211,0.20872593364567485,0.20872593364567485,null,60,300,450,570,740,1000,1410,1440,1520,1450,1860,2740,2740]
[91,4.1135767944768037E-3,2.0567883972384016E-2,3.0851825958576024E-2,3.9078979547529633E-2,5.073411379854724E-2,6.8559613241280057E-2,9.6669054670204882E-2,9.8725843067443281E-2,0.10421061212674568,9.941143919985608E-2,0.12752088062878089,0.18785334028110734,0.18785334028110734,null,60,300,450,570,740,1000,1410,1440,1520,1450,1860,2740,2740]
[92,3.7022191150291235E-3,1.8511095575145617E-2,2.7766643362718425E-2,3.5171081592776675E-2,4.5660702418692523E-2,6.1703651917152061E-2,8.7002149203184401E-2,8.8853258760698967E-2,9.3789550914071124E-2,8.9470295279870479E-2,0.11476879256590283,0.16906800625299664,0.16906800625299664,null,60,300,450,570,740,1000,1410,1440,1520,1450,1860,2740,2740]
[93,3.3319972035262112E-3,1.6659986017631058E-2,2.4989979026446583E-2,3.1653973433499009E-2,4.109463217682327E-2,5.5533286725436858E-2,7.830193428286597E-2,7.996793288462907E-2,8.4410595822664025E-2,8.0523265751883441E-2,0.10329191330931255,0.15216120562769697,0.15216120562769697,null,60,300,450,570,740,1000,1410,1440,1520,1450,1860,2740,2740]
[94,2.9987974831735898E-3,1.499398741586795E-2,2.2490981123801924E-2,2.8488576090149105E-2,3.6985168959140946E-2,4.9979958052893167E-2,7.0471740854579371E-2,7.1971139596166162E-2,7.5969536240397609E-2,7.2470939176695087E-2,9.2962721978381291E-2,0.13694508506492728,0.13694508506492728,null,60,300,450,570,740,1000,1410,1440,1520,1450,1860,2740,2740]
[95,2.6989177348562309E-3,1.3494588674281155E-2,2.0241883011421734E-2,2.5639718481134194E-2,3.3286652063226847E-2,4.4981962247603854E-2,6.3424566769121435E-2,6.4774025636549548E-2,6.8372582616357855E-2,6.5223845259025581E-2,8.3666449780543162E-2,0.12325057655843455,0.12325057655843455,null,60,300,450,570,740,1000,1410,1440,1520,1450,1860,2740,2740]
[96,2.4290259613706081E-3,1.214512980685304E-2,1.821769471027956E-2,2.3075746633020779E-2,2.9957986856904168E-2,4.0483766022843468E-2,5.7082110092209294E-2,5.8296623072894599E-2,6.1535324354722074E-2,5.8701460733123031E-2,7.5299804802488851E-2,0.1109255189025911,0.1109255189025911,null,60,300,450,570,740,1000,1410,1440,1520,1450,1860,2740,2740]
[97,2.1861233652335477E-3,1.0930616826167737E-2,1.6395925239251607E-2,2.0768171969718703E-2,2.6962188171213753E-2,3.6435389420559128E-2,5.1373899082988367E-2,5.2466960765605142E-2,5.538179191924987E-2,5.2831314659810731E-2,6.7769824322239977E-2,9.9832967012332005E-2,9.9832967012332005E-2,null,60,300,450,570,740,1000,1410,1440,1520,1450,1860,2740,2740]
[98,1.967511028710193E-3,9.8375551435509641E-3,1.4756332715326446E-2,1.8691354772746832E-2,2.4265969354092379E-2,3.2791850478503214E-2,4.6236509174689529E-2,4.7220264689044625E-2,4.9843612727324883E-2,4.7548183193829661E-2,6.0992841890015977E-2,8.9849670311098806E-2,8.9849670311098806E-2,null,60,300,450,570,740,1000,1410,1440,1520,1450,1860,2740,2740]
[99,1.7707599258391736E-3,8.853799629195868E-3,1.3280699443793802E-2,1.682221929547215E-2,2.1839372418683139E-2,2.9512665430652892E-2,4.1612858257220581E-2,4.2498238220140164E-2,4.4859251454592394E-2,4.2793364874446696E-2,5.4893557701014381E-2,8.0864703279988931E-2,8.0864703279988931E-2,null,60,300,450,570,740,1000,1410,1440,1520,1450,1860,2740,2740]
[100,1.5936839332552563E-3,7.9684196662762816E-3,1.1952629499414422E-2,1.5139997365924935E-2,1.9655435176814829E-2,2.6561398887587604E-2,3.745157243149852E-2,3.8248414398126152E-2,4.0373326309133158E-2,3.8514028387002026E-2,4.9404201930912946E-2,7.2778232951990041E-2,7.2778232951990041E-2,null,60,300,450,570,740,1000,1410,1440,1520,1450,1860,2740,2740]

{"sheet":"Data","index":5,"n_rows":18,"n_cols":7,"rows_kept":18,"cut":false,"hidden":false,"merged":[]}
[]
[]
[]
[null,"Type d'unité","Att","Def","Vie","Nom 1","Nom 2"]
[null,"Jeune Soldate Naine",3,2,8,"Jeune Soldate Naine","Jeunes Soldates Naines"]
[null,"Soldate Naine",5,4,10,"Soldate Naine","Soldates Naines"]
[null,"Naine d'Elite",7,6,13,"Naine d'Elite","Naines d'Elites"]
[null,"Jeune Soldate",10,9,16,"Jeune Soldate","Jeunes Soldates"]
[null,"Soldate",15,14,20,"Soldate","Soldates"]
[null,"Concierge",1,25,30,"Concierge","Concierges"]
[null,"Concierge d'élite",1,35,40,"Concierge d'élite","Concierges d'élites"]
[null,"Artilleuse",30,15,10,"Artilleuse","Artilleuses"]
[null,"Artilleuse d'élite",35,18,12,"Artilleuse d'élite","Artilleuses d'élites"]
[null,"Soldate d'élite",24,23,27,"Soldate d'élite","Soldates d'élites"]
[null,"Tank",55,1,35,"Tank","Tanks"]
[null,"Tank d'élite",80,1,50,"Tank d'élite","Tanks d'élites"]
[null,"Tueuse",50,50,50,"Tueuse","Tueuses"]
[null,"Tueuse d'élite",55,55,55,"Tueuse d'élite","Tueuses d'élites"]

{"sheet":"Révisions","index":6,"n_rows":13,"n_cols":4,"rows_kept":13,"cut":false,"hidden":false,"merged":[[12,1,13,1],[12,2,13,2],[12,3,13,3],[7,1,9,1],[7,2,9,2],[7,3,9,3],[10,1,11,1],[10,2,11,2],[10,3,11,3]]}
[null,"sonde et XP :"]
[null,"Version","Date","Release note"]
[null,"1.00","2013-01-19","Création (amélioration/automatisation d'un fichier d'ilidan), pour le \"très vieux\" que j'avais fait autrefois je ne le retrouve plus^^"]
[null,"1.01","2013-01-22","Modifications de certaines formules pour éliminer des fonctions non compatibles avec certaines versions d'excel."]
[null,"1.02","2013-02-09"," - Suppression de \"ARRONDI.AU.MULTIPLE\" pour des raisons de compatibilité inter-version d'excel.\n - Correction du nombre de point de vie de base des Tanks.\n - Prise en compte de la possibilité que la sonde n'ai pas tué que des JSN.\n - Suppression des unités ennemies tuées lors de la sonde.\n - Possibilité de corriger le nombre d'unité (pour tenir compte des pontes depuis le RC par exemple).\n - Ajout de mises en forme conditionnelles (alerte en rouge si nombre de JSN ou FdF insuffisants).\n - Ajout des feuilles \"Manuel\", \"Multiplicateurs de vie\" et \"Révisions\"."]
[]
[null,"armée :"]
[null,"2.0","2013-11-20","calcul automatisé du % pour la ponte en fonction de l'armée actuelle, afin d'éviter de faire des calculs \nMise en place et modification TDP VA VC nombre d'ouvrière\nModification du texte par copie/colle pour transmission par mp, rendu plus lisible"]
[]
[]
[null,"2.1","23 nov. 2013","Calul automatisé du temps de ponte en fonction du pourcentage efficace par catégorie de fourmis en vu du temps de ponte actuel"]
[]
[null,"2.2","24 nov. 2013","Mise en place de plusieur sujet de ponte\nAjout de prévision d'objectif de ponte d'armée et colonne restant à pondre pour atteindre l'objectif de manière automatisée"]