{"text_format":"1","workbook":"xlsx","n_sheets":7,"sheets":["Armée","Auto sur sonde","Manuel","Multiplicateurs vie","tdp","Data","Révisions"],"not_rendered":{"charts":0,"images":0,"macros":0,"external_links":0,"defined_names":0,"comments":0,"pivot_tables":0},"unopened":[],"bounds":{"document_bytes":16777216,"sheet_cells":100000,"rows_first":2000,"rows_last":500,"rows_between":2000,"halvings":0,"cell_chars":16384,"cell_head_chars":4096},"cells_cut":0,"cells_raw":0,"read":"whole","date_system":"1900"}

{"sheet":"Armée","index":0,"n_rows":99,"n_cols":62,"rows_kept":99,"cut":false,"hidden":false,"merged":[[60,20,60,22],[60,23,60,24],[33,5,33,17],[37,8,37,13],[4,22,18,24],[5,26,6,29],[17,50,17,51],[17,48,17,49],[17,46,17,47],[17,44,17,45],[17,42,17,43],[17,40,17,41],[17,52,17,53],[17,54,17,55],[17,56,17,57],[17,58,17,59],[17,60,17,61],[2,3,2,24],[2,31,2,33],[3,31,3,33],[4,6,4,11],[5,6,5,11],[6,6,6,11],[4,12,4,13],[5,12,5,13],[6,12,6,13],[7,12,7,13],[8,12,8,13],[9,12,9,13],[10,12,10,13],[11,12,11,13],[12,12,12,13],[13,12,13,13],[14,12,14,13],[15,12,15,13],[16,12,16,13],[17,12,17,13],[18,12,18,13],[13,6,13,11],[14,6,14,11],[15,6,15,11],[10,6,10,11],[11,6,11,11],[12,6,12,11],[7,6,7,11],[8,6,8,11],[9,6,9,11],[23,2,23,3],[23,11,23,16],[24,2,24,3],[22,31,23,33],[25,2,25,3],[25,7,25,9],[25,11,25,16],[16,6,16,11],[17,6,17,11],[18,6,18,11],[18,31,19,33],[22,1,22,3],[22,7,22,9],[22,11,22,16],[22,20,22,21],[22,23,22,24],[20,31,21,33],[17,31,17,33],[24,11,24,16],[24,20,24,21],[24,23,24,24],[29,2,29,3],[30,2,30,3],[31,2,31,3],[31,5,31,18],[31,20,31,21],[31,23,31,24],[26,2,26,3],[26,11,26,16],[24,31,24,33],[27,2,27,3],[28,2,28,3],[28,7,28,9],[28,11,29,16],[27,20,27,21],[27,23,27,24],[30,23,30,24],[30,20,30,21],[34,2,34,3],[34,5,36,18],[34,20,34,21],[34,23,34,24],[35,2,35,3],[35,20,35,21],[35,23,35,24],[36,2,36,3],[32,2,32,3],[32,5,32,18],[32,20,32,21],[32,23,32,24],[33,2,33,3],[33,20,33,21],[33,23,33,24],[36,20,36,21],[36,23,36,24],[37,20,37,21],[37,23,37,24],[38,2,38,3],[38,5,38,8],[38,19,39,19],[38,20,39,21],[38,23,39,24],[39,2,39,3],[39,5,39,8],[43,20,44,24],[44,6,44,8],[45,6,45,8],[46,6,46,8],[46,20,47,24],[47,6,47,8],[40,1,40,3],[41,1,41,3],[41,6,41,8],[41,9,41,11],[41,20,42,24],[42,6,42,8],[40,20,40,21],[40,23,40,24],[56,6,56,8],[56,20,57,24],[57,6,57,8],[48,6,48,8],[48,20,49,24],[49,6,49,8],[50,6,50,8],[50,20,50,24],[51,6,51,8],[51,20,52,24],[52,6,52,8],[1,40,2,61],[9,35,9,39],[58,20,59,22],[58,23,59,24],[71,7,71,8],[25,20,25,21],[25,23,25,24],[28,20,28,21],[28,23,28,24],[65,7,65,8],[66,7,66,8],[67,7,67,8],[68,5,68,8],[69,7,69,8],[70,7,70,8],[59,5,59,7],[60,5,60,6],[61,5,61,7],[62,5,62,7],[64,7,64,8],[53,6,53,8],[53,20,54,24],[54,6,54,8],[55,6,55,8]]}
[]
[null,null,null,null,null,null,null,null,null,null,null,null,null,null,null,null,null,null,null,null,null,null,null,null,null,null,null,null,null,null,null,null,null,null,null,null,null,null,null,null,"TABLEAU DE REFERENCE SELON LE POURCENTAGE QUE VOUS DEVEZ PONDRE ET EN FONCTION DE VOTRE TEMPS DE PONTE RENSEIGNE\n (Exprimé en sec puis Jr-hr-min environ)"]
[null,"DATE :",null,"2013-11-24",null,null,null,null,null,null,null,null,null,null,null,null,null,null,null,null,null,null,null,null,null,null,null,null,null,null,null,"tableau de calcul perso"]
[null,"(2) voir tableau de calcul perso avant de remplir",null,null,null,"(1) à effectuer en 1er"]
[null,"OBJECTIF d'ARMEE SOUHAITEE\n(notez ici)",null,"Reste à pondre/ sur votre prévision initiale",null,"Actuellement j'ai : \n(notez si dessous)","En ponte lancée N°1 de\n(notez si dessous)",null,null,null,null,null,"En ponte lancée N°2 de\n(notez si dessous)",null,"En ponte lancée N°3 de\n(notez si dessous)",null,"dénomination :",null,"TOTAL FINAL \nAPRES PONTE",null,"votre armée totale comporte actuellement ",null,"\n\nidéal de ponte \n(selon i-sork)\n\n\n-Début de serveur-\n\nChasseur :\nSur 100% de JSN\n80 à 90% de JS\n20 à 30% d'ARTI\n\n",null,null,null,null,null,null,null,null,"calcul perso :","sur","soit pour",null,null,null,null,null,null,null,"temps de ponte actuel de base","en ponte actuellement pour la jsn en sec","conversion en heure min  ","temps en sec pour 90% ","temps en h/m/s pour 90%","temps en sec pour 80% ","temps en h/m/s pour 80%","temps en sec pour 70% ","temps en h/m/s pour 70%","temps en sec pour 60% ","temps en h/m/s pour 60%","temps en sec pour 50% ","temps en h/m/s pour 50%","temps en sec pour 40% ","temps en h/m/s pour 40%","temps en sec pour 30% ","temps en h/m/s pour 30%","temps en sec pour 20% ","temps en h/m/s pour 20%","temps en sec pour 10% ","temps en h/m/s pour 10%"]
[null,0,null,{"$f":"B6-S6","v":0},null,0,0,null,null,null,null,null,0,null,0,null,"jeunes Soldate naines",null,{"$f":"SUM(F6:O6)","v":0},null,{"$f":"100","v":100},"%",null,null,null,null,"modifier total JSN SOUHAITE",null,null,null,">>","JSN = >>",1,0,"<ici",null,null,null,null,null,"jeunes Soldate naines",{"$f":"VLOOKUP(X59,tdp!A3:C102,3,FALSE)","v":{"$error":"#N/A"}},{"$f":"AP6*G6","v":{"$error":"#N/A"}},{"$f":"INT(AQ6/3600/24)&\"j \"&MOD(INT(AQ6/3600),24)&\"h \"&MOD(INT(AQ6/60),60)&\"m \"","v":{"$error":"#N/A"}}]
[null,0,null,0,null,0,0,null,null,null,null,null,0,null,0,null,"Soldates Naines",null,{"$f":"SUM(F7:O7)","v":0},null,{"$f":"S7*100/S6","v":{"$error":"#DIV/0!"}},"%",null,null,null,null,null,null,null,null,null,"vous devez pondre","en%","vous aurez",null,null,null,null,null,null,"Soldates Naines",{"$f":"VLOOKUP(X59,tdp!A3:D102,4,FALSE)","v":{"$error":"#N/A"}},null,null,{"$f":"AP7*AF8","v":{"$error":"#N/A"}},{"$f":"INT(AS7/3600/24)&\"j \"&MOD(INT(AS7/3600),24)&\"h \"&MOD(INT(AS7/60),60)&\"min env\"","v":{"$error":"#N/A"}},{"$f":"AP7*AF9","v":{"$error":"#N/A"}},{"$f":"INT(AU7/3600/24)&\"j \"&MOD(INT(AU7/3600),24)&\"h \"&MOD(INT(AU7/60),60)&\"min env\"","v":{"$error":"#N/A"}},{"$f":"AP7*AF10","v":{"$error":"#N/A"}},{"$f":"INT(AW7/3600/24)&\"j \"&MOD(INT(AW7/3600),24)&\"h \"&MOD(INT(AW7/60),60)&\"min env\"","v":{"$error":"#N/A"}},{"$f":"AP7*AF11","v":{"$error":"#N/A"}},{"$f":"INT(AY7/3600/24)&\"j \"&MOD(INT(AY7/3600),24)&\"h \"&MOD(INT(AY7/60),60)&\"min env\"","v":{"$error":"#N/A"}},{"$f":"AP7*AF12","v":{"$error":"#N/A"}},{"$f":"INT(BA7/3600/24)&\"j \"&MOD(INT(BA7/3600),24)&\"h \"&MOD(INT(BA7/60),60)&\"min env\"","v":{"$error":"#N/A"}},{"$f":"AP7*AF13","v":{"$error":"#N/A"}},{"$f":"INT(BC7/3600/24)&\"j \"&MOD(INT(BC7/3600),24)&\"h \"&MOD(INT(BC7/60),60)&\"min env\"","v":{"$error":"#N/A"}},{"$f":"AP7*AF14","v":{"$error":"#N/A"}},{"$f":"INT(BE7/3600/24)&\"j \"&MOD(INT(BE7/3600),24)&\"h \"&MOD(INT(BE7/60),60)&\"min env\"","v":{"$error":"#N/A"}},{"$f":"AP7*AF15","v":{"$error":"#N/A"}},{"$f":"INT(BG7/3600/24)&\"j \"&MOD(INT(BG7/3600),24)&\"h \"&MOD(INT(BG7/60),60)&\"min env\"","v":{"$error":"#N/A"}},{"$f":"AP7*AF16","v":{"$error":"#N/A"}},{"$f":"INT(BI7/3600/24)&\"j \"&MOD(INT(BI7/3600),24)&\"h \"&MOD(INT(BI7/60),60)&\"min env\"","v":{"$error":"#N/A"}}]
[null,0,null,0,null,0,0,null,null,null,null,null,0,null,0,null,"Naines d'Elites",null,0,null,{"$f":"S8*100/S6","v":{"$error":"#DIV/0!"}},"%",null,null,null,null,null,null,null,null,null,{"$f":"AH8-AF23","v":0},0.9,{"$f":"AH6*90/100","v":0},"←",null,null,null,null,null,"Naines d'Elites",{"$f":"VLOOKUP(X59,tdp!A3:E102,5,FALSE)","v":{"$error":"#N/A"}},null,null,{"$f":"AP8*AF8","v":{"$error":"#N/A"}},{"$f":"INT(AS8/3600/24)&\"j \"&MOD(INT(AS8/3600),24)&\"h \"&MOD(INT(AS8/60),60)&\"min env\"","v":{"$error":"#N/A"}},{"$f":"AP8*AF9","v":{"$error":"#N/A"}},{"$f":"INT(AU8/3600/24)&\"j \"&MOD(INT(AU8/3600),24)&\"h \"&MOD(INT(AU8/60),60)&\"min env\"","v":{"$error":"#N/A"}},{"$f":"AP8*AF10","v":{"$error":"#N/A"}},{"$f":"INT(AW8/3600/24)&\"j \"&MOD(INT(AW8/3600),24)&\"h \"&MOD(INT(AW8/60),60)&\"min env\"","v":{"$error":"#N/A"}},{"$f":"AP8*AF11","v":{"$error":"#N/A"}},{"$f":"INT(AY8/3600/24)&\"j \"&MOD(INT(AY8/3600),24)&\"h \"&MOD(INT(AY8/60),60)&\"min env\"","v":{"$error":"#N/A"}},{"$f":"AP8*AF12","v":{"$error":"#N/A"}},{"$f":"INT(BA8/3600/24)&\"j \"&MOD(INT(BA8/3600),24)&\"h \"&MOD(INT(BA8/60),60)&\"min env\"","v":{"$error":"#N/A"}},{"$f":"AP8*AF13","v":{"$error":"#N/A"}},{"$f":"INT(BC8/3600/24)&\"j \"&MOD(INT(BC8/3600),24)&\"h \"&MOD(INT(BC8/60),60)&\"min env\"","v":{"$error":"#N/A"}},{"$f":"AP8*AF14","v":{"$error":"#N/A"}},{"$f":"INT(BE8/3600/24)&\"j \"&MOD(INT(BE8/3600),24)&\"h \"&MOD(INT(BE8/60),60)&\"min env\"","v":{"$error":"#N/A"}},{"$f":"AP8*AF15","v":{"$error":"#N/A"}},{"$f":"INT(BG8/3600/24)&\"j \"&MOD(INT(BG8/3600),24)&\"h \"&MOD(INT(BG8/60),60)&\"min env\"","v":{"$error":"#N/A"}},{"$f":"AP8*AF16","v":{"$error":"#N/A"}},{"$f":"INT(BI8/3600/24)&\"j \"&MOD(INT(BI8/3600),24)&\"h \"&MOD(INT(BI8/60),60)&\"min env\"","v":{"$error":"#N/A"}}]
[null,0,null,{"$f":"B9-S9","v":0},null,0,0,null,null,null,null,null,0,null,0,null,"Jeunes Soldates",null,0,null,{"$f":"S9*100/S6","v":{"$error":"#DIV/0!"}},"%",null,null,null,null,null,null,null,null,null,{"$f":"AH9-AF23","v":0},0.8,{"$f":"AH6*80/100","v":0},"←",null,null,null,null,null,"Jeunes Soldates",{"$f":"VLOOKUP(X59,tdp!A3:F102,6,FALSE)","v":{"$error":"#N/A"}},null,null,{"$f":"AP9*AF8","v":{"$error":"#N/A"}},{"$error":"#N/A"},{"$f":"AP9*AF9","v":{"$error":"#N/A"}},{"$error":"#N/A"},{"$f":"AP9*AF10","v":{"$error":"#N/A"}},{"$error":"#N/A"},{"$f":"AP9*AF11","v":{"$error":"#N/A"}},{"$error":"#N/A"},{"$f":"AP9*AF12","v":{"$error":"#N/A"}},{"$error":"#N/A"},{"$f":"AP9*AF13","v":{"$error":"#N/A"}},{"$error":"#N/A"},{"$f":"AP9*AF14","v":{"$error":"#N/A"}},{"$error":"#N/A"},{"$f":"AP9*AF15","v":{"$error":"#N/A"}},{"$error":"#N/A"},{"$f":"AP9*AF16","v":{"$error":"#N/A"}},{"$error":"#N/A"}]
[null,0,null,0,null,0,0,null,null,null,null,null,0,null,0,null,"Soldates",null,0,null,{"$f":"F10*100/S6","v":{"$error":"#DIV/0!"}},"%",null,null,null,null,null,null,null,null,null,{"$f":"AH10-AF23","v":0},0.7,{"$f":"AH6*70/100","v":0},"←","Conversion EN Tps",null,null,null,null,"Soldates",{"$f":"VLOOKUP(X59,tdp!A3:G102,7,FALSE)","v":{"$error":"#N/A"}},null,null,{"$f":"AP10*AF8","v":{"$error":"#N/A"}},{"$error":"#N/A"},{"$f":"AP10*AF9","v":{"$error":"#N/A"}},{"$error":"#N/A"},{"$f":"AP10*AF10","v":{"$error":"#N/A"}},{"$error":"#N/A"},{"$f":"AP10*AF11","v":{"$error":"#N/A"}},{"$error":"#N/A"},{"$f":"AP10*AF12","v":{"$error":"#N/A"}},{"$error":"#N/A"},{"$f":"AP10*AF13","v":{"$error":"#N/A"}},{"$error":"#N/A"},{"$f":"AP10*AF14","v":{"$error":"#N/A"}},{"$error":"#N/A"},{"$f":"AP10*AF15","v":{"$error":"#N/A"}},{"$error":"#N/A"},{"$f":"AP10*AF16","v":{"$error":"#N/A"}},{"$error":"#N/A"}]
{"$rows_left_out":90}
{"sheet":"Auto sur sonde","index":1,"n_rows":54,"n_cols":18,"rows_kept":54,"cut":false,"hidden":false,"merged":[[52,2,52,3],[52,4,52,5],[53,2,53,3],[53,4,53,5],[49,2,49,3],[49,4,49,5],[50,2,50,3],[50,4,50,5],[45,2,45,3],[45,4,45,5],[51,2,51,3],[51,4,51,5],[46,2,46,3],[46,4,46,5],[47,2,47,3],[47,4,47,5],[48,2,48,3],[48,4,48,5],[44,2,44,3],[44,4,44,5],[44,7,44,9],[43,7,43,10],[39,7,39,10],[40,2,40,3],[40,4,40,5],[40,7,40,9],[41,2,41,3],[41,4,41,5],[42,2,42,3],[42,4,42,5],[43,2,43,3],[35,6,38,6],[38,2,38,3],[38,4,38,5],[39,2,39,3],[39,4,39,5],[43,4,43,5],[27,3,27,5],[27,6,27,7],[29,1,29,2],[29,6,29,7],[26,4,26,5],[26,6,26,7],[26,1,26,2],[25,1,25,2],[25,4,25,5],[16,8,16,9],[5,13,5,16],[21,8,21,10],[7,8,7,11],[15,8,15,10],[17,8,17,10],[14,8,14,9],[15,11,15,12],[30,6,30,7],[18,8,18,9],[25,6,25,7],[19,8,19,10],[7,17,7,21],[0,1,0,11],[13,8,13,9],[4,1,4,11],[12,8,12,9],[1,1,1,4],[3,1,3,11],[5,1,5,4],[8,8,8,11]]}
[null,"ANALYSE  RC de sonde et CALCUL D'OPTI XP"]
[null,"Rapport de sonde :"]
[]
[null,"  \n\nVous attaquez la fourmilière de polak60\n\nTroupes en attaque:100 Jeunes Soldates Naines.\nTroupes en défense:40 156 Jeunes Soldates Naines, 7 328 Soldates Naines, 5 347 Naines d'Elites, 34 291 Jeunes Soldates, 12 274 Soldates, 9 450 Concierges, 9 403 Artilleuses, 247 Artilleuses d'élites, 585 Soldates d'élites.\n\nVous infligez 300(+360) dégâts et tuez 31 ennemies.\nL’ennemie inflige 1 017 357(+1 119 093) dégâts à vos fourmis et en tue 100.\n\nVous avez infiltré l’ennemi. Les informations sont bien rentrées... mais pas vos soldates !\nVos troupes ont échoué\n\n"]
[null,"Supprimez le contenu de la cellule, puis copier un RC de sonde, qui a échoué (vous n'avez pas tué tous les ennemis^^) dans la cellule (et non sur la cellule -> double clic pour avoir le curseur texte)"]
[null,"Ennemi :",null,null,null,null,null,null,null,null,null,null,null,"Extraction des données du RC :"]
[]
[null,"Type d'unité","Nb unité","Att HB","Def HB","Vie HB","Modifier nb unité",null,"Mode d'emploi :",null,null,null,null,"Nb unité","Nb tué","Position","Suivant","Texte à Analyser"]
[null,"Jeune Soldate Naine",{"$f":"IF(G9>0,G9,N9-O9)","v":40125},{"$f":"Data!C5*$N9","v":120468},{"$f":"Data!D5*$N9","v":80312},{"$f":"Data!E5*$N9","v":321248},null,null,null,null,null,null,null,{"$f":"IF((P9>0),VALUE(SUBSTITUTE(MID(R9,1,(P9-1)),\" \",\"\")),0)","v":40156},{"$f":"MIN(Q$26-0,N9)","v":31},{"$f":"IF(ISERROR(SEARCH(Data!F5,R9)),IF(ISERROR(SEARCH(Data!G5,R9)),0,SEARCH(Data!G5,R9)),SEARCH(Data!F5,R9))","v":8},{"$f":"IF(ISERROR(SEARCH(\",\",R9,P9)),IF(ISERROR(SEARCH(\".\",R9,P9)),0,(SEARCH(\".\",R9,P9)+2)),(SEARCH(\",\",R9,P9)+2))","v":32},{"$f":"MID(B4,(SEARCH(\"Troupes en défense\",B4)+19),SEARCH(\".\",MID(B4,(SEARCH(\"Troupes en défense\",B4)+19),1000)))","v":"40 156 Jeunes Soldates Naines, 7 328 Soldates Naines, 5 347 Naines d'Elites, 34 291 Jeunes Soldates, 12 274 Soldates, 9 450 Concierges, 9 403 Artilleuses, 247 Artilleuses d'élites, 585 Soldates d'élites."}]
[null,"Soldate Naine",null,{"$f":"Data!C6*$N10","v":36640},{"$f":"Data!D6*$N10","v":29312},{"$f":"Data!E6*$N10","v":73280},null,null,"1/ Copier le RC de la sonde",null,null,null,null,{"$f":"IF((P10>0),VALUE(SUBSTITUTE(MID(R10,1,(P10-1)),\" \",\"\")),0)","v":7328},{"$f":"MIN(Q$26-SUM(O$9:O9),N10)","v":0},{"$f":"IF(ISERROR(SEARCH(Data!F6,R10)),IF(ISERROR(SEARCH(Data!G6,R10)),0,SEARCH(Data!G6,R10)),SEARCH(Data!F6,R10))","v":7},24,{"$f":"IF(((P9+Q9)>0),MID(R9,Q9,5000),R9)","v":"7 328 Soldates Naines, 5 347 Naines d'Elites, 34 291 Jeunes Soldates, 12 274 Soldates, 9 450 Concierges, 9 403 Artilleuses, 247 Artilleuses d'élites, 585 Soldates d'élites."}]
{"$rows_left_out":45}
{"sheet":"Manuel","index":2,"n_rows":57,"n_cols":17,"rows_kept":57,"cut":false,"hidden":false,"merged":[[11,16,11,20],[12,16,12,20],[19,16,19,20],[20,16,20,20],[21,16,21,20],[13,16,13,20],[14,16,14,20],[15,16,15,20],[16,16,16,20],[17,16,17,20],[18,16,18,20],[0,1,0,11],[50,9,50,11],[51,9,51,12],[52,9,52,11],[38,6,40,7],[14,8,14,9],[42,9,42,12],[48,9,48,12],[49,9,49,12],[18,8,18,10],[27,10,27,11],[1,1,1,4],[4,1,4,11],[5,1,5,4],[8,8,8,11],[3,1,3,11],[7,8,7,11],[5,14,5,16],[24,6,24,7],[12,8,12,12],[13,8,13,12],[19,8,19,10],[16,11,16,12],[11,8,11,12],[16,8,16,10],[17,8,17,10],[15,8,15,9],[10,8,10,12],[9,8,9,12],[7,16,7,20],[8,16,8,20],[9,16,9,20],[10,16,10,20],[29,1,29,2],[28,1,28,2],[24,4,24,5],[32,1,32,2],[29,6,29,7],[26,4,26,5],[26,6,26,7],[26,1,26,2],[25,1,25,2],[24,1,24,2],[43,9,43,12],[43,2,43,3],[43,4,43,5],[44,9,44,11],[41,2,41,3],[41,4,41,5],[42,2,42,3],[42,4,42,5],[44,2,44,3],[44,4,44,5],[47,2,47,3],[47,4,47,5],[46,9,46,11],[45,9,45,12],[46,2,46,3],[45,2,45,3],[45,4,45,5],[54,4,54,5],[49,2,49,3],[49,4,49,5],[50,2,50,3],[50,4,50,5],[51,2,51,3],[51,4,51,5],[24,8,24,11],[26,10,26,11],[27,6,27,7],[28,4,28,7],[25,8,25,11],[27,4,27,5],[56,2,56,3],[56,4,56,5],[30,6,30,7],[26,8,26,9],[27,8,27,9],[53,2,53,3],[53,4,53,5],[55,2,55,3],[55,4,55,5],[52,2,52,3],[52,4,52,5],[48,2,48,3],[48,4,48,5],[46,4,46,5],[54,2,54,3]]}
[null,"Petit tableur pour calculer une opti d'Xp..."]
[null,"Import d'armée :"]
[]
[null,"40 156 Jeunes Soldates Naines, 7 328 Soldates Naines, 5 347 Naines d'Elites, 34 291 Jeunes Soldates, 12 274 Soldates, 9 450 Concierges, 9 403 Artilleuses, 247 Artilleuses d'élites, 585 Soldates d'élites.\n"]
[null,"Supprimez le contenu de la cellule, puis copier une armée, unités séparées par des virgules ou points."]
[null,"Ennemi :",null,null,null,null,null,null,null,null,null,null,null,null,"Extraction des données armée :"]
[]
[null,"Type d'unité","Nb unité","Nb unité","Att HB","Def HB","Vie HB",null,"Mode d'emploi :",null,null,null,null,null,"Position","Suivant","Texte à Analyser"]
[null,"Jeune Soldate Naine",null,{"$f":"IF(C9=0,IF((O9>0),VALUE(SUBSTITUTE(MID(Q9,1,(O9-1)),\" \",\"\")),0),C9)","v":40156},{"$f":"Data!C5*$D9","v":120468},{"$f":"Data!D5*$D9","v":80312},{"$f":"Data!E5*$D9","v":321248},null,null,null,null,null,null,null,{"$f":"IF(ISERROR(SEARCH(Data!F5,Q9)),IF(ISERROR(SEARCH(Data!G5,Q9)),0,SEARCH(Data!G5,Q9)),SEARCH(Data!F5,Q9))","v":8},{"$f":"IF(ISERROR(SEARCH(\",\",Q9,O9)),IF(ISERROR(SEARCH(\".\",Q9,O9)),0,(SEARCH(\".\",Q9,O9)+2)),(SEARCH(\",\",Q9,O9)+2))","v":32},{"$f":"B4","v":"40 156 Jeunes Soldates Naines, 7 328 Soldates Naines, 5 347 Naines d'Elites, 34 291 Jeunes Soldates, 12 274 Soldates, 9 450 Concierges, 9 403 Artilleuses, 247 Artilleuses d'élites, 585 Soldates d'élites.\n"}]
[null,"Soldate Naine",null,{"$f":"IF(C10=0,IF((O10>0),VALUE(SUBSTITUTE(MID(Q10,1,(O10-1)),\" \",\"\")),0),C10)","v":7328},{"$f":"Data!C6*$D10","v":36640},{"$f":"Data!D6*$D10","v":29312},{"$f":"Data!E6*$D10","v":73280},null,"1/ Copier l'armée ou remplir le nombre d'unité",null,null,null,null,null,{"$f":"IF(ISERROR(SEARCH(Data!F6,Q10)),IF(ISERROR(SEARCH(Data!G6,Q10)),0,SEARCH(Data!G6,Q10)),SEARCH(Data!F6,Q10))","v":7},24,{"$f":"IF(((O9+P9)>0),MID(Q9,P9,5000),Q9)","v":"7 328 Soldates Naines, 5 347 Naines d'Elites, 34 291 Jeunes Soldates, 12 274 Soldates, 9 450 Concierges, 9 403 Artilleuses, 247 Artilleuses d'élites, 585 Soldates d'élites.\n"}]
{"$rows_left_out":48}
{"sheet":"Multiplicateurs vie","index":3,"n_rows":116,"n_cols":53,"rows_kept":116,"cut":false,"hidden":false,"merged":[[9,2,9,52],[63,2,63,52],[0,1,0,20],[1,1,1,4],[1,5,1,8],[4,1,4,2],[1,9,1,26],[3,1,3,2],[6,1,6,2],[7,1,7,2]]}
[null,"Combinaisons bouclier/dôme et bouclier/loge (plus bas dans la page) => multiplicateur de vie"]
[null,"Multiplicateur :",null,null,null,2.5,null,null,null," Saisissez ici le multiplicateur de vie trouvé sur une sonde pour voir les combinaison bouclier/dôme ou bouclier/loge possibles\n (selon le lieu de la sonde)."]
[]
[null,"Bouclier :",null,{"$f":"ROUND(($F$2-1-0.1-D5*0.05)*100,0)/10","v":14},{"$f":"D4-1","v":13},{"$f":"E4-1","v":12},11,10,9,8,7,6,5,4,3,2,1,0,-1,-2,-3,-4,-5,-6,-7,-8,-9,-10,-11,-12,-13,-14,-15,-16,-17,-18,-19,-20,-21,-22,-23,-24,-25,-26,-27,-28,-29,-30,-31,-32,-33,-34,-35]
[null,"Dôme :",null,{"$f":"IF(ROUND($F$2*10,0)/10=$F$2,0,1)","v":0},{"$f":"($F$2-1-0.1*E4-0.1)/0.05","v":1.9999999999999989},3.999999999999996,5.9999999999999982,8,10,11.999999999999998,13.999999999999998,15.999999999999998,18,20,21.999999999999996,23.999999999999996,25.999999999999996,27.999999999999996,30,31.999999999999996,34,35.999999999999993,37.999999999999993,40,42,43.999999999999993,45.999999999999993,47.999999999999993,50,52,53.999999999999993,56,57.999999999999993,60,62,63.999999999999993,{"$f":"($F$2-1-0.1*AK4-0.1)/0.05","v":66},68,70,72,74,76,78,79.999999999999986,82,84.000000000000014,86.000000000000014,88,90,92,94.000000000000014,96.000000000000014,98]
[]
[null,"Bouclier :",null,{"$f":"ROUND(($F$2-1-0.3-D8*0.15)*100,0)/10","v":12},{"$f":"D7-3","v":9},{"$f":"E7-3","v":6},3,0,-3,-6,-9,-12,-15,-18,-21,-24,-27,-30,-33,-36,-39,-42,-45,-48,-51,-54,-57,-60,-63,-66,-69,-72,-75,-78,-81,-84,-87,-90,-93,-96,-99,-102,-105,-108,-111,-114,-117,-120,-123,-126,-129,-132,-135]
[null,"Loge :",null,{"$f":"IF(ROUND($F$2*10,0)/10=$F$2,0,1)","v":0},{"$f":"($F$2-1-0.1*E7-0.3)/0.15","v":2},{"$f":"($F$2-1-0.1*F7-0.3)/0.15","v":3.9999999999999991},6,8,10,12,14.000000000000002,16.000000000000004,18.000000000000004,20,22.000000000000004,24.000000000000004,26.000000000000004,28.000000000000004,30.000000000000007,32,34.000000000000007,36.000000000000007,38,40.000000000000007,42.000000000000007,44.000000000000007,46.000000000000007,48,50.000000000000007,52.000000000000014,54,55.999999999999993,58,60,61.999999999999993,64,66,68,70,72.000000000000014,74,76,78,80,82.000000000000014,84,86,88,90,92.000000000000014,94,96,98]
[]
[null,null,"Dôme"]
{"$rows_left_out":107}
{"sheet":"tdp","index":4,"n_rows":102,"n_cols":28,"rows_kept":102,"cut":false,"hidden":false,"merged":[]}
["TDP","ouv","jsn","sn","ne","js","so","con","art","arte","se","tk","tu","tue",null,"ouvri","jsn","sn","ne ","js","so","con","art","arte ","se","tk","tu","tue"]
[null,null,null,null,null,null,null,null,null,null,null,null,null,null,null,60,300,450,570,740,1000,1410,1440,1520,1450,1860,2740,2740]
[1,{"$f":"P2*0.9^(A3)","v":54},{"$f":"Q2*0.9^(A3)","v":270},{"$f":"R3*0.9^(A3)","v":405},{"$f":"S3*0.9^(A3)","v":513},{"$f":"T3*0.9^(A3)","v":666},{"$f":"U3*0.9^(A3)","v":900},{"$f":"V3*0.9^(A3)","v":1269},{"$f":"W3*0.9^(A3)","v":1296},{"$f":"X3*0.9^(A3)","v":1368},{"$f":"Y3*0.9^(A3)","v":1305},{"$f":"Z3*0.9^(A3)","v":1674},{"$f":"AA3*0.9^(A3)","v":2466},{"$f":"AB3*0.9^(A3)","v":2466},null,60,300,450,570,740,1000,1410,1440,1520,1450,1860,2740,2740]
[2,{"$f":"P3*0.9^(A4)","v":48.6},{"$f":"Q3*0.9^(A4)","v":243.00000000000003},{"$f":"R4*0.9^(A4)","v":364.5},{"$f":"S4*0.9^(A4)","v":461.70000000000005},{"$f":"T4*0.9^(A4)","v":599.40000000000009},{"$f":"U4*0.9^(A4)","v":810},{"$f":"V4*0.9^(A4)","v":1142.1000000000001},{"$f":"W4*0.9^(A4)","v":1166.4000000000001},{"$f":"X4*0.9^(A4)","v":1231.2},{"$f":"Y4*0.9^(A4)","v":1174.5},{"$f":"Z4*0.9^(A4)","v":1506.6000000000001},{"$f":"AA4*0.9^(A4)","v":2219.4},{"$f":"AB4*0.9^(A4)","v":2219.4},null,60,300,450,570,740,1000,1410,1440,1520,1450,1860,2740,2740]
[3,43.740000000000009,218.70000000000002,328.05000000000007,415.53000000000003,539.46,729.00000000000011,1027.8900000000001,1049.7600000000002,1108.0800000000002,1057.0500000000002,1355.9400000000003,1997.4600000000003,1997.4600000000003,null,60,300,450,570,740,1000,1410,1440,1520,1450,1860,2740,2740]
[4,39.366000000000007,196.83000000000004,295.24500000000006,373.97700000000009,485.51400000000007,656.10000000000014,925.10100000000023,944.78400000000022,997.27200000000016,951.34500000000014,1220.3460000000002,1797.7140000000004,1797.7140000000004,null,60,300,450,570,740,1000,1410,1440,1520,1450,1860,2740,2740]
[5,35.429400000000008,177.14700000000005,265.72050000000007,336.5793000000001,436.96260000000012,590.49000000000024,832.59090000000026,850.30560000000025,897.54480000000024,856.21050000000025,1098.3114000000003,1617.9426000000005,1617.9426000000005,null,60,300,450,570,740,1000,1410,1440,1520,1450,1860,2740,2740]
[6,31.88646000000001,159.43230000000005,239.14845000000008,302.92137000000008,393.26634000000013,531.44100000000014,749.33181000000025,765.27504000000022,807.79032000000029,770.58945000000028,988.48026000000027,1456.1483400000004,1456.1483400000004,null,60,300,450,570,740,1000,1410,1440,1520,1450,1860,2740,2740]
[7,28.697814000000008,143.48907000000003,215.23360500000007,272.62923300000006,353.93970600000011,478.29690000000016,674.39862900000014,688.7475360000002,727.01128800000015,693.53050500000018,889.63223400000027,1310.5335060000004,1310.5335060000004,null,60,300,450,570,740,1000,1410,1440,1520,1450,1860,2740,2740]
[8,25.828032600000011,129.14016300000006,193.71024450000007,245.3663097000001,318.54573540000013,430.46721000000014,606.95876610000028,619.87278240000023,654.31015920000027,624.17745450000018,800.66901060000032,1179.4801554000005,1179.4801554000005,null,60,300,450,570,740,1000,1410,1440,1520,1450,1860,2740,2740]
{"$rows_left_out":93}
{"sheet":"Data","index":5,"n_rows":18,"n_cols":7,"rows_kept":18,"cut":false,"hidden":false,"merged":[]}
[]
[]
[]
[null,"Type d'unité","Att","Def","Vie","Nom 1","Nom 2"]
[null,"Jeune Soldate Naine",3,2,8,"Jeune Soldate Naine","Jeunes Soldates Naines"]
[null,"Soldate Naine",5,4,10,"Soldate Naine","Soldates Naines"]
[null,"Naine d'Elite",7,6,13,"Naine d'Elite","Naines d'Elites"]
[null,"Jeune Soldate",10,9,16,"Jeune Soldate","Jeunes Soldates"]
[null,"Soldate",15,14,20,"Soldate","Soldates"]
[null,"Concierge",1,25,30,"Concierge","Concierges"]
{"$rows_left_out":9}
{"sheet":"Révisions","index":6,"n_rows":13,"n_cols":4,"rows_kept":13,"cut":false,"hidden":false,"merged":[[12,1,13,1],[12,2,13,2],[12,3,13,3],[7,1,9,1],[7,2,9,2],[7,3,9,3],[10,1,11,1],[10,2,11,2],[10,3,11,3]]}
[null,"sonde et XP :"]
[null,"Version","Date","Release note"]
[null,"1.00","2013-01-19","Création (amélioration/automatisation d'un fichier d'ilidan), pour le \"très vieux\" que j'avais fait autrefois je ne le retrouve plus^^"]
[null,"1.01","2013-01-22","Modifications de certaines formules pour éliminer des fonctions non compatibles avec certaines versions d'excel."]
[null,"1.02","2013-02-09"," - Suppression de \"ARRONDI.AU.MULTIPLE\" pour des raisons de compatibilité inter-version d'excel.\n - Correction du nombre de point de vie de base des Tanks.\n - Prise en compte de la possibilité que la sonde n'ai pas tué que des JSN.\n - Suppression des unités ennemies tuées lors de la sonde.\n - Possibilité de corriger le nombre d'unité (pour tenir compte des pontes depuis le RC par exemple).\n - Ajout de mises en forme conditionnelles (alerte en rouge si nombre de JSN ou FdF insuffisants).\n - Ajout des feuilles \"Manuel\", \"Multiplicateurs de vie\" et \"Révisions\"."]
[]
[null,"armée :"]
[null,"2.0","2013-11-20","calcul automatisé du % pour la ponte en fonction de l'armée actuelle, afin d'éviter de faire des calculs \nMise en place et modification TDP VA VC nombre d'ouvrière\nModification du texte par copie/colle pour transmission par mp, rendu plus lisible"]
[]
[]
{"$rows_left_out":3}