{"text_format":"1","workbook":"xlsx","n_sheets":8,"sheets":["caisse","banque","Résultat","paramètres","Feuil1","tb","calculs_graphique","prévisions"],"not_rendered":{"charts":12,"images":14,"macros":1,"external_links":3,"defined_names":80,"comments":0,"pivot_tables":0},"unopened":[],"bounds":{"document_bytes":16777216,"sheet_cells":100000,"rows_first":2000,"rows_last":500,"rows_between":2000,"halvings":0,"cell_chars":16384,"cell_head_chars":4096},"cells_cut":0,"cells_raw":0,"read":"whole","date_system":"1900"}

{"sheet":"caisse","index":0,"n_rows":3012,"n_cols":10,"rows_kept":3012,"cut":false,"hidden":false,"merged":[[3,2,4,5],[1,2,1,5]]}
[]
[null,null,{"$f":"paramètres!I12","v":"Programme de gestion des moyens financiers"}]
[]
[null,null,"journal caisse"]
[]
[]
[]
[null,"date","réference","catégorie","désignations","recettes","dépenses"]
[null,{"$f":"debutjanvier","v":"2014-01-01"},null,"solde",null,{"$f":"paramètres!H27","v":0},null,{"$f":"paramètres!DN7","v":"2014-01-01"}]
[null,null,null,null,null,null,null,{"$f":"paramètres!DN39","v":"2014-01-31"},{"$f":"IFERROR(IF(B10<debutjanvier,(\"\"),IF(B10<=finjanvier,(janvier),IF(B10<=finfevrier,(février),IF(B10<=fimars,(mars),IF(B10<=finavril,(avril),IF(B10<=finmai,(mai),IF(B10<=finjuin,(juin),IF(B10<=finjuillet,(juillet),IF(B10<=finaout,(aout),IF(B10<=finseptembre,(septembre),IF(B10<=finoctobre,(octobre),IF(B10<=finnovembre,(novembree),IF(B10<=findécembre,(décembre)))))))))))))),\" \")","v":""},"janvier"]
[null,null,null,null,null,null,null,{"$f":"paramètres!DN67","v":41698},"","février"]
[null,null,null,null,null,null,null,{"$f":"paramètres!DN99","v":"2014-03-31"},"","mars"]
[null,null,null,null,null,null,null,{"$f":"paramètres!DN129","v":"2014-04-30"},"","avril"]
[null,null,null,null,null,null,null,{"$f":"paramètres!DN160","v":"2014-05-31"},"","mai"]
[null,null,null,null,null,null,null,{"$f":"paramètres!DN190","v":"2014-06-30"},"","juin"]
{"$rows_left_out":2998}
{"sheet":"banque","index":1,"n_rows":3015,"n_cols":9,"rows_kept":3015,"cut":false,"hidden":false,"merged":[[3,2,4,5],[1,2,1,5]]}
[]
[null,null,{"$f":"paramètres!I12","v":"Programme de gestion des moyens financiers"}]
[]
[null,null,"journal banque"]
[]
[]
[]
[null,"date","réference","catégorie","désignations","recettes","dépenses"]
[null,{"$f":"debutjanvier","v":"2014-01-01"},null,"solde",null,{"$f":"paramètres!K27","v":0}]
[null,null,null,null,null,null,null,null,{"$f":"IFERROR(IF(B10<debutjanvier,(\"\"),IF(B10<=finjanvier,(janvier),IF(B10<=finfevrier,(février),IF(B10<=fimars,(mars),IF(B10<=finavril,(avril),IF(B10<=finmai,(mai),IF(B10<=finjuin,(juin),IF(B10<=finjuillet,(juillet),IF(B10<=finaout,(aout),IF(B10<=finseptembre,(septembre),IF(B10<=finoctobre,(octobre),IF(B10<=finnovembre,(novembree),IF(B10<=findécembre,(décembre)))))))))))))),\" \")","v":""}]
[null,null,null,null,null,null,null,null,""]
[null,null,null,null,null,null,null,null,""]
[null,null,null,null,null,null,null,null,""]
[null,null,null,null,null,null,null,null,""]
[null,null,null,null,null,null,null,null,""]
{"$rows_left_out":3001}
{"sheet":"Résultat","index":2,"n_rows":106,"n_cols":27,"rows_kept":106,"cut":false,"hidden":false,"merged":[[3,4,4,8],[39,4,40,8],[1,4,1,8]]}
[]
[null,null,null,null,{"$f":"paramètres!I12","v":"Programme de gestion des moyens financiers"}]
[]
[null,null,null,null,"résultat de la période "]
[]
[]
[null,null,null,null,null,null,null,null,null,null,null,null,null,null,null,null,null,null,null,"tresorerie",1500]
[null,null,null,null,null,"Tableau des comptes de resultat ",null,null,"         D","         C",null,{"$f":"J59","v":0},null,null,null,null,null,null,null,"seuil",3000]
[null,null,null,"charges ",null,null,null,null,null,null,null,null,null,null,null,null,null,null,null,"%",{"$f":"(U7/U8)*2/3","v":0.33333333333333331}]
[null,null,null,null,{"$f":"paramètres!E14","v":"Loyer-logement "},null,null,{"$f":"IFERROR((I10/I25),C10)","v":0},{"$f":"SUMIFS(dépenses1,categorie1,E10)+SUMIFS(dépenses3,categorie2,E10)","v":0}]
[null,null,null,null,{"$f":"paramètres!E15","v":"Alimentation (courses )"},null,null,{"$f":"IFERROR((I11/I25),C11)","v":0},0,null,null,{"$f":"J58","v":0}]
[null,null,null,null,{"$f":"paramètres!E16","v":"Droits de scolarité payés; Fournitures scolaires"},null,null,{"$f":"IFERROR((I12/I25),C12)","v":0},0]
[null,null,null,null,{"$f":"paramètres!E17","v":"Frais de transport en commun"},null,null,{"$f":"IFERROR((I13/I25),C13)","v":0},0,null,null,null,null,null,null,null,null,null,null,null,null,null,null,null,null,"trésorerie future"]
[null,null,null,null,{"$f":"paramètres!E18","v":"Voyage pendant les vacances"},null,null,{"$f":"IFERROR((I14/I25),C14)","v":0},0]
[null,null,null,null,{"$f":"paramètres!E19","v":"Économies"},null,null,{"$f":"IFERROR((I15/I25),C15)","v":0},0,null,null,null,null,null,null,null,null,null,null,"tresorerie",{"$f":"J35","v":0},{"$f":"paramètres!I22","v":0},null,null,null,{"$f":"U15+paramètres!N50","v":0}]
{"$rows_left_out":92}
{"sheet":"paramètres","index":3,"n_rows":418,"n_cols":175,"rows_kept":418,"cut":false,"hidden":false,"merged":[[46,8,46,9],[33,7,39,7],[40,7,46,7],[39,8,39,9],[1,3,1,5],[42,123,42,125],[7,3,7,5],[30,3,30,5],[3,3,4,5],[23,123,23,125],[13,3,14,3],[11,8,11,9],[16,8,16,9],[21,8,21,9],[10,8,10,9],[15,8,15,9],[20,8,20,9],[25,8,25,9],[22,8,22,10],[4,131,4,133],[4,149,4,151],[4,118,4,119],[4,120,4,121],[5,123,5,125]]}
[]
[null,null,null,"Programme conçu par Abderrahmane NEGAB (neg.abder@yahoo.fr)"]
[]
[null,null,null,"paramètres "]
[null,null,null,null,null,null,null,null,null,null,null,null,null,null,null,null,null,null,null,null,null,null,null,null,null,null,null,null,null,null,null,null,null,null,null,null,null,null,null,null,null,null,null,null,null,null,null,null,null,null,null,null,null,null,null,null,null,null,null,null,null,null,null,null,null,null,null,null,null,null,null,null,null,null,null,null,null,null,null,null,null,null,null,null,null,null,null,null,null,null,null,null,null,null,null,null,null,null,null,null,null,null,null,null,null,null,null,null,null,null,null,null,null,null,null,null,null,null,null,null,null,null,null,null,null,null,null,null,null,null,null,null,null,null,null,null,null,null,null,null,null,null,null,null,null,null,null,null,null,"banque",null,null,null,null,null,null,null,null,null,null,null,null,null,null,null,null,null,"caisse ",null,null,null,null,null,null,"banque"]
[null,null,null,null,null,null,null,null,null,"caisse",null,null,null,null,null,null,null,null,null,null,null,null,null,null,null,null,null,null,null,null,null,"banque",null,null,null,null,null,null,null,null,null,null,null,null,null,null,null,null,null,null,null,null,null,null,null,null,null,null,null,null,null,null,null,null,null,null,null,null,null,null,null,null,null,null,null,null,null,null,null,null,null,null,null,null,null,null,null,null,null,null,null,null,null,null,null,null,null,null,null,null,null,null,null,null,null,null,null,null,null,null,null,null,null,null,null,null,null,"date"]
[null,null,null,null,null,null,null,null,"date",1,2,3,5,5,6,7,8,9,10,11,12,13,14,15,16,17,18,19,20,null,null,null,null,null,null,null,null,null,null,null,null,null,null,null,null,null,null,null,null,null,null,null,null,null,null,null,null,null,null,null,null,null,null,null,null,null,null,null,null,null,null,null,null,null,null,null,null,null,null,null,null,null,null,null,null,null,null,null,null,null,null,null,null,null,null,null,null,null,null,null,null,null,null,null,null,null,null,null,null,null,null,null,null,null,null,null,null,{"$f":"VLOOKUP(I17,DW9:DZ119,4,FALSE)","v":"2014-01-01"}]
[null,null,null,null,null,null,null,null,null,{"$f":"E9","v":"Aides financières (subvention, bourse, emprunt) "},{"$f":"E10","v":"Salaire après déduction d’impôts pour un emploi"},{"$f":"E11","v":"Aide financière de la famille"},{"$f":"E12","v":"recouvrement des créances"},{"$f":"E13","v":"Autre (pension alimentaire, aide sociale, dons, etc.)"},{"$f":"E14","v":"Loyer-logement "},{"$f":"E15","v":"Alimentation (courses )"},{"$f":"E16","v":"Droits de scolarité payés; Fournitures scolaires"},{"$f":"E17","v":"Frais de transport en commun"},{"$f":"E18","v":"Voyage pendant les vacances"},{"$f":"E19","v":"Économies"},{"$f":"E20","v":"Téléphone mobile, Internet, câble"},{"$f":"E21","v":"Repas pris à l’extérieur"},{"$f":"E22","v":"Habillement"},{"$f":"E23","v":"Loisirs (cinéma, rendez-vous, concerts)"},{"$f":"E24","v":"Assurances (voiture, santé, locative, agios)"},{"$f":"E25","v":"prêts à des amis"},{"$f":"E26","v":"Rembourssement Emprunt "},{"$f":"E27","v":"transfert banque"},{"$f":"E28","v":"Autres"},null,null,{"$f":"J8","v":"Aides financières (subvention, bourse, emprunt) "},{"$f":"K8","v":"Salaire après déduction d’impôts pour un emploi"},"Aide financière de la famille","recouvrement des créances","Autre (pension alimentaire, aide sociale, dons, etc.)","Loyer-logement ","Alimentation (courses )","Droits de scolarité payés; Fournitures scolaires","Frais de transport en commun","Voyage pendant les vacances","Économies","Téléphone mobile, Internet, câble","Repas pris à l’extérieur","Habillement","Loisirs (cinéma, rendez-vous, concerts)","Assurances (voiture, santé, locative, agios)","prêts à des amis","Rembourssement Emprunt ","transfert banque","Autres",null,null,null,null,null,null,null,null,null,null,null,null,null,null,null,null,null,null,null,null,null,null,null,null,null,null,null,null,null,null,null,null,null,null,null,null,null,null,null,null,null,null,null,null,null,null,null,null,null,null,null,null,null,null,null,null,null,null,null,null,null,null,null,null,null,null,{"$f":"DN7+0","v":"2014-01-01"},null,null,null,null,null,null,null,null,null,null,null,"2010-01-01"]
[null,null,null,"recettes","Aides financières (subvention, bourse, emprunt) ",null,null,null,{"$f":"caisse!B9","v":41640},{"$f":"IF(caisse!D9=recettea,(caisse!F9),(0))","v":0},{"$f":"IF(caisse!D9=recetteb,(caisse!F9),(0))","v":0},{"$f":"IF(caisse!D9=recettec,(caisse!F9),(0))","v":0},{"$f":"IF(caisse!D9=recettedd,(caisse!F9),(0))","v":0},{"$f":"IF(caisse!D9=recettee,(caisse!F9),(0))","v":0},{"$f":"IF(caisse!D9=depens6,(caisse!G9),(0))","v":0},{"$f":"IF(caisse!D9=depense7,(caisse!G9),(0))","v":0},{"$f":"IF(caisse!D9=depense8,(caisse!G9),(0))","v":0},{"$f":"IF(caisse!D9=depense9,(caisse!G9),(0))","v":0},{"$f":"IF(caisse!D9=depense10,(caisse!G9),(0))","v":0},{"$f":"IF(caisse!D9=depense11,(caisse!G9),(0))","v":0},{"$f":"IF(caisse!D9=depense12,(caisse!G9),(0))","v":0},{"$f":"IF(caisse!D9=depense13,(caisse!G9),(0))","v":0},{"$f":"IF(caisse!D9=depense14,(caisse!G9),(0))","v":0},{"$f":"IF(caisse!D9=depense15,(caisse!G9),(0))","v":0},{"$f":"IF(caisse!D9=depense16,(caisse!G9),(0))","v":0},{"$f":"IF(caisse!D9=depense17,(caisse!G9),(0))","v":0},{"$f":"IF(caisse!D9=depense18,(caisse!G9),(0))","v":0},{"$f":"IF(caisse!D9=depense19,(caisse!G9),(0))","v":0},{"$f":"IF(caisse!D9=depense20,(caisse!G9),(0))","v":0},null,null,{"$f":"IF(banque!D9=recettea,(banque!F9),(0))","v":0},{"$f":"IF(banque!D9=recetteb,(banque!F9),(0))","v":0},{"$f":"IF(banque!D9=recettec,(banque!F9),(0))","v":0},{"$f":"IF(banque!D9=recettedd,(banque!F9),(0))","v":0},{"$f":"IF(banque!D9=recettee,(banque!F9),(0))","v":0},{"$f":"IF(banque!D9=depens6,(banque!G9),(0))","v":0},{"$f":"IF(banque!D9=depense7,(banque!G9),(0))","v":0},{"$f":"IF(banque!D9=depense8,(banque!G9),(0))","v":0},{"$f":"IF(banque!D9=depense9,(banque!G9),(0))","v":0},{"$f":"IF(banque!D9=depense10,(banque!G9),(0))","v":0},{"$f":"IF(banque!D9=depense11,(banque!G9),(0))","v":0},{"$f":"IF(banque!D9=depense12,(banque!G9),(0))","v":0},{"$f":"IF(banque!D9=depense13,(banque!G9),(0))","v":0},{"$f":"IF(banque!D9=depense14,(banque!G9),(0))","v":0},{"$f":"IF(banque!D9=depense15,(banque!G9),(0))","v":0},{"$f":"IF(banque!D9=depense16,(banque!G9),(0))","v":0},{"$f":"IF(banque!D9=depense17,(banque!G9),(0))","v":0},{"$f":"IF(banque!D9=depense18,(banque!G9),(0))","v":0},{"$f":"IF(banque!D9=depense19,(banque!G9),(0))","v":0},{"$f":"IF(banque!D9=depense20,(banque!G9),(0))","v":0},null,null,null,null,null,null,null,null,null,null,null,null,null,null,null,null,null,null,null,null,null,null,null,null,null,null,null,null,null,null,null,null,null,null,null,null,null,null,null,null,null,null,null,null,null,null,null,null,null,null,null,null,null,null,null,null,null,null,null,null,null,null,null,null,null,null,{"$f":"DN8+1","v":"2014-01-02"},null,null,null,null,null,null,null,null,2010,{"$f":"DZ8+59","v":"2010-03-01"},{"$f":"DZ9+59","v":"2010-03-01"},{"$f":"DZ8","v":"2010-01-01"}]
[null,null,null,null,"Salaire après déduction d’impôts pour un emploi",null,null,null,null,null,null,null,null,null,null,null,null,null,null,null,null,null,null,null,null,null,null,null,null,null,null,null,null,null,null,null,null,null,null,null,null,null,null,null,null,null,null,null,null,null,null,null,null,null,null,null,null,null,null,null,null,null,null,null,null,null,null,null,null,null,null,null,null,null,null,null,null,null,null,null,null,null,null,null,null,null,null,null,null,null,null,null,null,null,null,null,null,null,null,null,null,null,null,null,null,null,null,null,null,null,null,null,null,null,null,null,null,{"$f":"DN9+1","v":"2014-01-03"},null,null,null,null,null,null,null,null,{"$f":"DW9+1","v":2011},{"$f":"DZ10+59","v":"2011-03-01"},{"$f":"DZ10+59","v":"2011-03-01"},{"$f":"DZ9+365","v":"2011-01-01"}]
[null,null,null,null,"Aide financière de la famille",null,null,null,"Nom",null,null,null,null,null,null,null,null,null,null,null,null,null,null,null,null,null,null,null,null,null,null,null,null,null,null,null,null,null,null,null,null,null,null,null,null,null,null,null,null,null,null,null,null,null,null,null,null,null,null,null,null,null,null,null,null,null,null,null,null,null,null,null,null,null,null,null,null,null,null,null,null,null,null,null,null,null,null,null,null,null,null,null,null,null,null,null,null,null,null,null,null,null,null,null,null,null,null,null,null,null,null,null,null,null,null,null,null,"2014-01-04",null,null,null,null,null,null,null,null,{"$f":"DW10+1","v":2012},{"$f":"DZ11+59","v":"2012-02-29"},{"$f":"DZ11+60","v":"2012-03-01"},{"$f":"DZ10+365","v":"2012-01-01"}]
[null,null,null,null,"recouvrement des créances",null,null,null,"Programme de gestion des moyens financiers",null,null,null,null,null,null,null,null,null,null,null,null,null,null,null,null,null,null,null,null,null,null,null,null,null,null,null,null,null,null,null,null,null,null,null,null,null,null,null,null,null,null,null,null,null,null,null,null,null,null,null,null,null,null,null,null,null,null,null,null,null,null,null,null,null,null,null,null,null,null,null,null,null,null,null,null,null,null,null,null,null,null,null,null,null,null,null,null,null,null,null,null,null,null,null,null,null,null,null,null,null,null,null,null,null,null,null,null,"2014-01-05",null,null,null,null,null,null,null,null,2013,"2013-03-01","2013-03-01",{"$f":"DZ11+366","v":"2013-01-01"}]
[null,null,null,null,"Autre (pension alimentaire, aide sociale, dons, etc.)",null,null,null,null,null,null,null,null,null,null,null,null,null,null,null,null,null,null,null,null,null,null,null,null,null,null,null,null,null,null,null,null,null,null,null,null,null,null,null,null,null,null,null,null,null,null,null,null,null,null,null,null,null,null,null,null,null,null,null,null,null,null,null,null,null,null,null,null,null,null,null,null,null,null,null,null,null,null,null,null,null,null,null,null,null,null,null,null,null,null,null,null,null,null,null,null,null,null,null,null,null,null,null,null,null,null,null,null,null,null,null,null,"2014-01-06",null,null,null,null,null,null,null,null,2014,"2014-03-01","2014-03-01","2014-01-01"]
[null,null,null,"Logement et alimentation","Loyer-logement ",null,null,null,null,null,null,null,null,null,null,null,null,null,null,null,null,null,null,null,null,null,null,null,null,null,null,null,null,null,null,null,null,null,null,null,null,null,null,null,null,null,null,null,null,null,null,null,null,null,null,null,null,null,null,null,null,null,null,null,null,null,null,null,null,null,null,null,null,null,null,null,null,null,null,null,null,null,null,null,null,null,null,null,null,null,null,null,null,null,null,null,null,null,null,null,null,null,null,null,null,null,null,null,null,null,null,null,null,null,null,null,null,"2014-01-07",null,null,null,null,null,null,null,null,2015,"2015-03-01","2015-03-01","2015-01-01"]
[null,null,null,null,"Alimentation (courses )",null,null,null,null,null,null,null,null,null,null,null,null,null,null,null,null,null,null,null,null,null,null,null,null,null,null,null,null,null,null,null,null,null,null,null,null,null,null,null,null,null,null,null,null,null,null,null,null,null,null,null,null,null,null,null,null,null,null,null,null,null,null,null,null,null,null,null,null,null,null,null,null,null,null,null,null,null,null,null,null,null,null,null,null,null,null,null,null,null,null,null,null,null,null,null,null,null,null,null,null,null,null,null,null,null,null,null,null,null,null,null,null,"2014-01-08",null,null,null,null,null,null,null,null,2016,"2016-02-29",{"$f":"DZ15+60","v":"2016-03-01"},"2016-01-01"]
{"$rows_left_out":404}
{"sheet":"Feuil1","index":4,"n_rows":302,"n_cols":3,"rows_kept":302,"cut":false,"hidden":false,"merged":[]}
[]
[]
[]
[]
[null,null,"Guide d’utilisation du Programme GMF"]
[null,null,"Auteur : Abderrahmane NEGAB"]
[null,null,"neg.abder@yahoo.fr"]
[]
[]
[]
[]
[]
[null,null,"Présentation "]
[null,null,"                     Le programme GMF est un outil d'aide à la gestion de trésorerie. Il est facile à utiliser et ne demande pas de grandes connaissances en comptabilité. Il s'adresse à toute  personne ayant un budget à gérer. \nCe programme est un outil qui vous aidera à mieux gérer votre trésorerie. Il est personnalisable en fonction de vos activités et s'adapte à vos situations. C'est un outil de production de documents qui reflèteront l'image de votre trésorerie et l'état de vos finances. Cet outil constitue un support d'aide à la prise de décision et à la constitution des budgets prévisionnels. \n\n\n\n"]
[]
{"$rows_left_out":288}
{"sheet":"tb","index":5,"n_rows":124,"n_cols":62,"rows_kept":124,"cut":false,"hidden":false,"merged":[[95,4,95,10],[3,5,4,10],[1,5,1,10],[7,7,7,8],[56,4,56,10]]}
[]
[null,null,null,null,null,{"$f":"Résultat!$E$2","v":"Programme de gestion des moyens financiers"}]
[]
[null,null,null,null,null,"Tableau de bord",null,null,null,null,null,null,null,null,null,null,null,null,null,null,null,null,null,null,null,null,null,null,null,null,null,null,null,null,null,null,null,null,null,null,null,null,null,null,null,null,null,null,null,null,null,null,null,null,null,null,null,null,null,null,null,14]
[]
[]
[]
[{"$f":"\"\"","v":""},null,null,null,null,null,null,{"$f":"Q33","v":"ANNEE"}]
[""]
[""]
["",{"$f":"calculs_graphique!$D$6","v":"Revenus Année :"},null,null,null,{"$f":"calculs_graphique!$D$7","v":"Dépenses Année :"},null,null,null,null,null,null,null,{"$f":"calculs_graphique!$D$8","v":"Trésorerie Année :"}]
["",{"$f":"\" \"&calculs_graphique!$F$6","v":"  €"},null,null,null,{"$f":"\" \"&calculs_graphique!$F$7","v":"  €"},null,null,null,null,null,null,null,{"$f":"\" \"&calculs_graphique!$F$8","v":"  €"}]
[""]
[""]
[""]
{"$rows_left_out":110}
{"sheet":"calculs_graphique","index":6,"n_rows":50,"n_cols":29,"rows_kept":50,"cut":false,"hidden":true,"merged":[]}
["***Cette feuille doit rester MASQUÉE***"]
[]
[null,null,null,{"$f":"IFERROR(LOWER(TEXT(VALUE(PériodeSélectionnée&\" 1\"),\"mmmm\")),\"Année\")","v":"Année"}]
[]
[null,null,null,"Titres de graphiques dynamiques"]
[null,null,null,{"$f":"\"Revenus \" &D3&\" :\"","v":"Revenus Année :"},null,{"$f":"TEXT(INDEX(Résultat!$D$77:$P$77,,PériodeSélectionnéeColonne),\"# ### €\")","v":" €"}]
[null,null,null,{"$f":"\"Dépenses \"&D3&\" :\"","v":"Dépenses Année :"},null,{"$f":"TEXT(INDEX(Résultat!$D$106:$P$106,,PériodeSélectionnéeColonne),\"# ### €\")","v":" €"}]
[null,null,null,{"$f":"\"Trésorerie \" &D3& \" :\"","v":"Trésorerie Année :"},{"$f":"INDEX(tb!D35:P35,ValeurBarreDéfilement)","v":0},{"$f":"TEXT(E8,\"# ### €\")","v":" €"}]
[]
[]
[]
[null,null,null,{"$f":"LOWER(tb!D34)","v":"janv "},{"$f":"LOWER(tb!E34)","v":"fevrier"},{"$f":"LOWER(tb!F34)","v":"mars"},{"$f":"LOWER(tb!G34)","v":"avril"},{"$f":"LOWER(tb!H34)","v":"mai"},{"$f":"LOWER(tb!I34)","v":"juin"},{"$f":"LOWER(tb!J34)","v":"juillet"},{"$f":"LOWER(tb!K34)","v":"août"},{"$f":"LOWER(tb!L34)","v":"septembre"},{"$f":"LOWER(tb!M34)","v":"octobre"},{"$f":"LOWER(tb!N34)","v":"novembre"},{"$f":"LOWER(tb!O34)","v":"décembre"},{"$f":"LOWER(tb!P34)","v":"année "}]
[null,null,"Barre de défilement : ",13]
[null,null,"Graphique de trésorerie : ",{"$f":"IF(PériodeSélectionnée=Résultat!D$71,IF(Résultat!$D$68:$P$68>=0,Résultat!$D$68:$P$68,NA()),NA())","v":{"$error":"#N/A"}},{"$f":"IF(PériodeSélectionnée=Résultat!E$71,IF(Résultat!$D$68:$P$68>=0,Résultat!$D$68:$P$68,NA()),NA())","v":{"$error":"#N/A"}},{"$f":"IF(PériodeSélectionnée=Résultat!F$71,IF(Résultat!$D$68:$P$68>=0,Résultat!$D$68:$P$68,NA()),NA())","v":{"$error":"#N/A"}},{"$f":"IF(PériodeSélectionnée=Résultat!G$71,IF(Résultat!$D$68:$P$68>=0,Résultat!$D$68:$P$68,NA()),NA())","v":{"$error":"#N/A"}},{"$f":"IF(PériodeSélectionnée=Résultat!H$71,IF(Résultat!$D$68:$P$68>=0,Résultat!$D$68:$P$68,NA()),NA())","v":{"$error":"#N/A"}},{"$f":"IF(PériodeSélectionnée=Résultat!I$71,IF(Résultat!$D$68:$P$68>=0,Résultat!$D$68:$P$68,NA()),NA())","v":{"$error":"#N/A"}},{"$f":"IF(PériodeSélectionnée=Résultat!J$71,IF(Résultat!$D$68:$P$68>=0,Résultat!$D$68:$P$68,NA()),NA())","v":{"$error":"#N/A"}},{"$f":"IF(PériodeSélectionnée=Résultat!K$71,IF(Résultat!$D$68:$P$68>=0,Résultat!$D$68:$P$68,NA()),NA())","v":{"$error":"#N/A"}},{"$f":"IF(PériodeSélectionnée=Résultat!L$71,IF(Résultat!$D$68:$P$68>=0,Résultat!$D$68:$P$68,NA()),NA())","v":{"$error":"#N/A"}},{"$f":"IF(PériodeSélectionnée=Résultat!M$71,IF(Résultat!$D$68:$P$68>=0,Résultat!$D$68:$P$68,NA()),NA())","v":{"$error":"#N/A"}},{"$f":"IF(PériodeSélectionnée=Résultat!N$71,IF(Résultat!$D$68:$P$68>=0,Résultat!$D$68:$P$68,NA()),NA())","v":{"$error":"#N/A"}},{"$f":"IF(PériodeSélectionnée=Résultat!O$71,IF(Résultat!$D$68:$P$68>=0,Résultat!$D$68:$P$68,NA()),NA())","v":{"$error":"#N/A"}},{"$f":"IF(PériodeSélectionnée=Résultat!P$71,IF(Résultat!$D$68:$P$68>=0,Résultat!$D$68:$P$68,NA()),NA())","v":{"$error":"#N/A"}}]
[null,null,"Cumulé : ",{"$f":"IF(PériodeSélectionnée=Résultat!D$71,IF(Résultat!$D$68:$P$68<0,Résultat!$D$68:$P$68,NA()),NA())","v":{"$error":"#N/A"}},{"$f":"IF(PériodeSélectionnée=Résultat!E$71,IF(Résultat!$D$68:$P$68<0,Résultat!$D$68:$P$68,NA()),NA())","v":{"$error":"#N/A"}},{"$f":"IF(PériodeSélectionnée=Résultat!F$71,IF(Résultat!$D$68:$P$68<0,Résultat!$D$68:$P$68,NA()),NA())","v":{"$error":"#N/A"}},{"$f":"IF(PériodeSélectionnée=Résultat!G$71,IF(Résultat!$D$68:$P$68<0,Résultat!$D$68:$P$68,NA()),NA())","v":{"$error":"#N/A"}},{"$f":"IF(PériodeSélectionnée=Résultat!H$71,IF(Résultat!$D$68:$P$68<0,Résultat!$D$68:$P$68,NA()),NA())","v":{"$error":"#N/A"}},{"$f":"IF(PériodeSélectionnée=Résultat!I$71,IF(Résultat!$D$68:$P$68<0,Résultat!$D$68:$P$68,NA()),NA())","v":{"$error":"#N/A"}},{"$f":"IF(PériodeSélectionnée=Résultat!J$71,IF(Résultat!$D$68:$P$68<0,Résultat!$D$68:$P$68,NA()),NA())","v":{"$error":"#N/A"}},{"$f":"IF(PériodeSélectionnée=Résultat!K$71,IF(Résultat!$D$68:$P$68<0,Résultat!$D$68:$P$68,NA()),NA())","v":{"$error":"#N/A"}},{"$f":"IF(PériodeSélectionnée=Résultat!L$71,IF(Résultat!$D$68:$P$68<0,Résultat!$D$68:$P$68,NA()),NA())","v":{"$error":"#N/A"}},{"$f":"IF(PériodeSélectionnée=Résultat!M$71,IF(Résultat!$D$68:$P$68<0,Résultat!$D$68:$P$68,NA()),NA())","v":{"$error":"#N/A"}},{"$f":"IF(PériodeSélectionnée=Résultat!N$71,IF(Résultat!$D$68:$P$68<0,Résultat!$D$68:$P$68,NA()),NA())","v":{"$error":"#N/A"}},{"$f":"IF(PériodeSélectionnée=Résultat!O$71,IF(Résultat!$D$68:$P$68<0,Résultat!$D$68:$P$68,NA()),NA())","v":{"$error":"#N/A"}},{"$f":"IF(PériodeSélectionnée=Résultat!P$71,IF(Résultat!$D$68:$P$68<0,Résultat!$D$68:$P$68,NA()),NA())","v":{"$error":"#N/A"}}]
{"$rows_left_out":36}
{"sheet":"prévisions","index":7,"n_rows":45,"n_cols":17,"rows_kept":45,"cut":false,"hidden":false,"merged":[[3,4,4,10],[1,4,1,10]]}
[]
[null,null,null,null,{"$f":"Résultat!E2","v":"Programme de gestion des moyens financiers"}]
[]
[null,null,null,null,"budget prévisionnel "]
[]
[]
[null,"Trésorerie mensuelle nette",null,"Janvier ","Février","Mars","Avril","Mai","Juin","Juillet","Août","Septembre","Octobre","Novembre","Décembre","ANNEE"]
[null,"Trésorerie",null,{"$f":"D17-D45+D42","v":0},{"$f":"E17-E45+E42","v":0},0,0,0,0,0,0,0,0,0,0,{"$f":"SUM(D8:O8)","v":0}]
[null,"Trésorerie cumulée",null,{"$f":"D8","v":0},{"$f":"D9+E8","v":0},{"$f":"E9+F8","v":0},0,0,0,0,0,0,0,0,0]
[]
[null,"REVENUS MENSUELS",null,{"$f":"D7","v":"Janvier "},{"$f":"E7","v":"Février"},"Mars","Avril","Mai","Juin","Juillet","Août","Septembre","Octobre","Novembre","Décembre","ANNÉE  "]
[null,{"$f":"Résultat!B72","v":"Aides financières (subvention, bourse, emprunt) "},null,0,0,0,0,0,0,0,0,0,0,0,0,{"$f":"SUM(D12:O12)","v":0},{"$f":"Résultat!P72-prévisions!P12","v":0}]
[null,{"$f":"Résultat!B73","v":"Salaire après déduction d’impôts pour un emploi"},null,0,0,0,0,0,0,0,0,0,0,0,0,0,{"$f":"Résultat!P73-prévisions!P13","v":0}]
[null,{"$f":"Résultat!B74","v":"Aide financière de la famille"},null,0,0,0,0,0,0,0,0,0,0,0,0,0,{"$f":"Résultat!P74-prévisions!P14","v":0}]
[null,{"$f":"Résultat!B75","v":"recouvrement des créances"},null,0,0,0,0,0,0,0,0,0,0,0,0,0,{"$f":"Résultat!P75-prévisions!P15","v":0}]
{"$rows_left_out":30}