{"text_format":"1","workbook":"xlsx","n_sheets":12,"sheets":["QUOTAS DES LIV","qui livre qui","Matrice encodage","samedi","dimanche","lundi","mardi","mercredi","jeudi","vendredi","TDP","Importation"],"not_rendered":{"charts":0,"images":0,"macros":1,"external_links":0,"defined_names":0,"comments":0,"pivot_tables":0},"unopened":[],"bounds":{"document_bytes":16777216,"sheet_cells":100000,"rows_first":2000,"rows_last":500,"rows_between":2000,"halvings":0,"cell_chars":16384,"cell_head_chars":4096},"cells_cut":0,"cells_raw":0,"read":"whole","date_system":"1900"}

{"sheet":"QUOTAS DES LIV","index":0,"n_rows":11,"n_cols":50,"rows_kept":11,"cut":false,"hidden":false,"merged":[]}
["PSEUDO","Khonsou","tharsilla","chachadu44","chepa","wakash","vipere92","boody","trezepac","tweick","dolfijn","kiwi445","terminator3","aym35","ygrek","havok1","maromi","orev","calicelame","kirle","shuo","micktram","darkspread","hbing","ithaque","frite","blackeagle","ashday","majokajupo","houdihadu59","filou690","yodaDM","lokiii","oglala","lesinc","gropere","doudou59","banania","bastien14","darksnake","eliote","nonobcd82","pierrhout","wizz59780","misaxsan","anthony2306","whiteforest","elladan","TOTAL","verif"]
["tdp",{"$f":"VLOOKUP(B1,TDP!$A:$B,2,FALSE)","v":5.1000000000000004E-3},{"$f":"VLOOKUP(C1,TDP!$A:$B,2,FALSE)","v":5.1000000000000004E-3},{"$f":"VLOOKUP(D1,TDP!A:B,2,FALSE)","v":8.6E-3},{"$f":"VLOOKUP(E1,TDP!$A:$B,2,FALSE)","v":6.0000000000000001E-3},{"$f":"VLOOKUP(F1,TDP!$A:$B,2,FALSE)","v":7.7000000000000002E-3},{"$f":"VLOOKUP(G1,TDP!$A:$B,2,FALSE)","v":7.0000000000000001E-3},{"$f":"VLOOKUP(H1,TDP!$A:$B,2,FALSE)","v":4.0000000000000001E-3},{"$f":"VLOOKUP(I1,TDP!$A:$B,2,FALSE)","v":3.8E-3},{"$f":"VLOOKUP(J1,TDP!$A:$B,2,FALSE)","v":5.1000000000000004E-3},{"$f":"VLOOKUP(K1,TDP!$A:$B,2,FALSE)","v":7.0000000000000001E-3},{"$f":"VLOOKUP(L1,TDP!$A:$B,2,FALSE)","v":1.06E-2},{"$f":"VLOOKUP(M1,TDP!$A:$B,2,FALSE)","v":1.06E-2},{"$f":"VLOOKUP(N1,TDP!$A:$B,2,FALSE)","v":1.46E-2},{"$f":"VLOOKUP(O1,TDP!$A:$B,2,FALSE)","v":7.7000000000000002E-3},{"$f":"VLOOKUP(P1,TDP!$A:$B,2,FALSE)","v":8.6E-3},{"$f":"VLOOKUP(Q1,TDP!$A:$B,2,FALSE)","v":1.18E-2},{"$f":"VLOOKUP(R1,TDP!$A:$B,2,FALSE)","v":1.18E-2},{"$f":"VLOOKUP(S1,TDP!$A:$B,2,FALSE)","v":2.0999999999999999E-3},{"$f":"VLOOKUP(T1,TDP!$A:$B,2,FALSE)","v":1.18E-2},{"$f":"VLOOKUP(U1,TDP!$A:$B,2,FALSE)","v":1.46E-2},{"$f":"VLOOKUP(V1,TDP!$A:$B,2,FALSE)","v":2.0999999999999999E-3},{"$f":"VLOOKUP(W1,TDP!$A:$B,2,FALSE)","v":1.06E-2},{"$f":"VLOOKUP(X1,TDP!$A:$B,2,FALSE)","v":0.02},{"$f":"VLOOKUP(Y1,TDP!$A:$B,2,FALSE)","v":1.6199999999999999E-2},{"$f":"VLOOKUP(Z1,TDP!$A:$B,2,FALSE)","v":3.0499999999999999E-2},{"$f":"VLOOKUP(AA1,TDP!$A:$B,2,FALSE)","v":1.46E-2},{"$f":"VLOOKUP(AB1,TDP!$A:$B,2,FALSE)","v":2.47E-2},{"$f":"VLOOKUP(AC1,TDP!$A:$B,2,FALSE)","v":1.06E-2},{"$f":"VLOOKUP(AD1,TDP!$A:$B,2,FALSE)","v":5.0000000000000001E-3},{"$f":"VLOOKUP(AE1,TDP!$A:$B,2,FALSE)","v":0.02},{"$f":"VLOOKUP(AF1,TDP!$A:$B,2,FALSE)","v":9.5999999999999992E-3},{"$f":"VLOOKUP(AG1,TDP!$A:$B,2,FALSE)","v":2.7400000000000001E-2},{"$f":"VLOOKUP(AH1,TDP!$A:$B,2,FALSE)","v":1.3100000000000001E-2},{"$f":"VLOOKUP(AI1,TDP!$A:$B,2,FALSE)","v":8.6E-3},{"$f":"VLOOKUP(AJ1,TDP!$A:$B,2,FALSE)","v":5.0000000000000001E-3},{"$f":"VLOOKUP(AK1,TDP!$A:$B,2,FALSE)","v":1.6199999999999999E-2},{"$f":"VLOOKUP(AL1,TDP!$A:$B,2,FALSE)","v":2.2200000000000001E-2},{"$f":"VLOOKUP(AM1,TDP!$A:$B,2,FALSE)","v":0.01},{"$f":"VLOOKUP(AN1,TDP!$A:$B,2,FALSE)","v":2.7400000000000001E-2},{"$f":"VLOOKUP(AO1,TDP!$A:$B,2,FALSE)","v":2.2200000000000001E-2},{"$f":"VLOOKUP(AP1,TDP!$A:$B,2,FALSE)","v":2.47E-2},{"$f":"VLOOKUP(AQ1,TDP!$A:$B,2,FALSE)","v":2.7400000000000001E-2},{"$f":"VLOOKUP(AR1,TDP!$A:$B,2,FALSE)","v":2.47E-2},{"$f":"VLOOKUP(AS1,TDP!$A:$B,2,FALSE)","v":4.6399999999999997E-2},{"$f":"VLOOKUP(AT1,TDP!$A:$B,2,FALSE)","v":0.01},{"$f":"VLOOKUP(AU1,TDP!$A:$B,2,FALSE)","v":2.47E-2},{"$f":"VLOOKUP(AV1,TDP!$A:$B,2,FALSE)","v":0.01},{"$f":"SUM(B2:AV2)","v":0.64749999999999996}]
["1/tdp",{"$f":"1/B2","v":196.07843137254901},{"$f":"1/C2","v":196.07843137254901},{"$f":"1/D2","v":116.27906976744185},166.66666666666666,{"$f":"1/F2","v":129.87012987012986},{"$f":"1/G2","v":142.85714285714286},{"$f":"1/H2","v":250},263.15789473684208,196.07843137254901,142.85714285714286,94.339622641509436,94.339622641509436,68.493150684931507,129.87012987012986,116.27906976744185,84.745762711864415,84.745762711864415,476.1904761904762,84.745762711864415,68.493150684931507,476.1904761904762,94.339622641509436,50,61.728395061728399,32.786885245901637,68.493150684931507,40.48582995951417,94.339622641509436,200,50,104.16666666666667,36.496350364963504,76.33587786259541,116.27906976744185,200,61.728395061728399,45.045045045045043,100,36.496350364963504,45.045045045045043,40.48582995951417,36.496350364963504,40.48582995951417,21.551724137931036,100,40.48582995951417,100,{"$f":"SUM(B3:AV3)","v":5471.628198474994}]
["%/tdc ally",{"$f":"(B3*$AW$4)/$AW$3","v":3.5835481553223656},3.5835481553223656,2.1251273944353559,3.0460159320240101,2.3735189080706576,2.6108707988777233,4.5690238980360158,4.8094988400379108,3.5835481553223656,2.6108707988777233,1.7241599615230248,1.7241599615230248,1.251787369324936,2.3735189080706576,2.1251273944353559,1.548821660351192,1.548821660351192,8.7029026629257444,1.548821660351192,1.251787369324936,8.7029026629257444,1.7241599615230248,0.91380477960720319,1.1281540488977817,0.59921624892275616,1.251787369324936,0.73992289846737103,1.7241599615230248,3.6552191184288128,0.91380477960720319,1.9037599575150068,0.6670107880344549,1.3951218009270274,2.1251273944353559,3.6552191184288128,1.1281540488977817,0.82324754919567855,1.8276095592144064,0.6670107880344549,0.82324754919567855,0.73992289846737103,0.6670107880344549,0.73992289846737103,0.39388137052034622,1.8276095592144064,{"$f":"(AU3*$AW$4)/$AW$3","v":0.73992289846737103},{"$f":"(AV3*$AW$4)/$AW$3","v":1.8276095592144064},100,{"$f":"SUM(B4:AV4)","v":100.00000000000004}]
["tdc moyen",{"$f":"VLOOKUP(B1,'Matrice encodage'!$A:$I,9,FALSE)","v":2305002347.2857141},{"$f":"VLOOKUP(C1,'Matrice encodage'!$A:$I,9,FALSE)","v":2123998443},{"$f":"VLOOKUP(D1,'Matrice encodage'!$A:$I,9,FALSE)","v":1535136287},{"$f":"VLOOKUP(E1,'Matrice encodage'!$A:$I,9,FALSE)","v":1461977360.1428571},{"$f":"VLOOKUP(F1,'Matrice encodage'!$A:$I,9,FALSE)","v":8711238.8571428563},{"$f":"VLOOKUP(G1,'Matrice encodage'!$A:$I,9,FALSE)","v":27758206.428571429},{"$f":"VLOOKUP(H1,'Matrice encodage'!$A:$I,9,FALSE)","v":6419922.8571428573},{"$f":"VLOOKUP(I1,'Matrice encodage'!$A:$I,9,FALSE)","v":424784.85714285716},{"$f":"VLOOKUP(J1,'Matrice encodage'!$A:$I,9,FALSE)","v":2541484.1428571427},{"$f":"VLOOKUP(K1,'Matrice encodage'!$A:$I,9,FALSE)","v":1060036.857142857},{"$f":"VLOOKUP(L1,'Matrice encodage'!$A:$I,9,FALSE)","v":589206286.14285719},{"$f":"VLOOKUP(M1,'Matrice encodage'!$A:$I,9,FALSE)","v":326341257.85714287},{"$f":"VLOOKUP(N1,'Matrice encodage'!$A:$I,9,FALSE)","v":139741694.2857143},{"$f":"VLOOKUP(O1,'Matrice encodage'!$A:$I,9,FALSE)","v":76391262.428571433},{"$f":"VLOOKUP(P1,'Matrice encodage'!$A:$I,9,FALSE)","v":31785944.428571429},{"$f":"VLOOKUP(Q1,'Matrice encodage'!$A:$I,9,FALSE)","v":45452917},{"$f":"VLOOKUP(R1,'Matrice encodage'!$A:$I,9,FALSE)","v":25883043.285714287},{"$f":"VLOOKUP(S1,'Matrice encodage'!$A:$I,9,FALSE)","v":29328806.285714287},{"$f":"VLOOKUP(T1,'Matrice encodage'!$A:$I,9,FALSE)","v":42042379.142857142},{"$f":"VLOOKUP(U1,'Matrice encodage'!$A:$I,9,FALSE)","v":22661690.428571429},{"$f":"VLOOKUP(V1,'Matrice encodage'!$A:$I,9,FALSE)","v":15462249.714285715},{"$f":"VLOOKUP(W1,'Matrice encodage'!$A:$I,9,FALSE)","v":16135993.142857144},{"$f":"VLOOKUP(X1,'Matrice encodage'!$A:$I,9,FALSE)","v":40136826.142857142},{"$f":"VLOOKUP(Y1,'Matrice encodage'!$A:$I,9,FALSE)","v":13512705.714285715},{"$f":"VLOOKUP(Z1,'Matrice encodage'!$A:$I,9,FALSE)","v":11487885},{"$f":"VLOOKUP(AA1,'Matrice encodage'!$A:$I,9,FALSE)","v":4846558.4285714282},{"$f":"VLOOKUP(AB1,'Matrice encodage'!$A:$I,9,FALSE)","v":12897937.571428571},{"$f":"VLOOKUP(AC1,'Matrice encodage'!$A:$I,9,FALSE)","v":4775570.8571428573},{"$f":"VLOOKUP(AD1,'Matrice encodage'!$A:$I,9,FALSE)","v":5871042.1428571427},{"$f":"VLOOKUP(AE1,'Matrice encodage'!$A:$I,9,FALSE)","v":15196573},{"$f":"VLOOKUP(AF1,'Matrice encodage'!$A:$I,9,FALSE)","v":2707391},{"$f":"VLOOKUP(AG1,'Matrice encodage'!$A:$I,9,FALSE)","v":5000948.1428571427},{"$f":"VLOOKUP(AH1,'Matrice encodage'!$A:$I,9,FALSE)","v":5336541.4285714282},{"$f":"VLOOKUP(AI1,'Matrice encodage'!$A:$I,9,FALSE)","v":2309444},{"$f":"VLOOKUP(AJ1,'Matrice encodage'!$A:$I,9,FALSE)","v":3121704.5714285714},{"$f":"VLOOKUP(AK1,'Matrice encodage'!$A:$I,9,FALSE)","v":1591001.7142857143},{"$f":"VLOOKUP(AL1,'Matrice encodage'!$A:$I,9,FALSE)","v":1892724},{"$f":"VLOOKUP(AM1,'Matrice encodage'!$A:$I,9,FALSE)","v":1245149},{"$f":"VLOOKUP(AN1,'Matrice encodage'!$A:$I,9,FALSE)","v":1127219},{"$f":"VLOOKUP(AO1,'Matrice encodage'!$A:$I,9,FALSE)","v":743349.28571428568},{"$f":"VLOOKUP(AP1,'Matrice encodage'!$A:$I,9,FALSE)","v":683296},{"$f":"VLOOKUP(AQ1,'Matrice encodage'!$A:$I,9,FALSE)","v":620935},{"$f":"VLOOKUP(AR1,'Matrice encodage'!$A:$I,9,FALSE)","v":415182},{"$f":"VLOOKUP(AS1,'Matrice encodage'!$A:$I,9,FALSE)","v":367568},{"$f":"VLOOKUP(AT1,'Matrice encodage'!$A:$I,9,FALSE)","v":304172},{"$f":"VLOOKUP(AU1,'Matrice encodage'!$A:$I,9,FALSE)","v":268468},{"$f":"VLOOKUP(AV1,'Matrice encodage'!$A:$I,9,FALSE)","v":211067},{"$f":"SUM(B5:AV5)","v":8970134894.5714264}]
["ressources optenues",{"$f":"B5*48*6","v":663840676018.28564},{"$f":"C5*48*6","v":611711551584},442119250656,421049479721.14288,{"$f":"F5*48*6","v":2508836790.8571424},{"$f":"G5*48*6","v":7994363451.4285717},{"$f":"H5*48*6","v":1848937782.8571429},122338038.85714285,731947433.14285707,305290614.85714281,169691410409.14288,93986282262.857147,40245607954.285721,22000683579.428574,9154351995.4285717,13090440096,7454316466.2857151,8446696210.2857151,12108205193.142857,6526566843.4285717,4453127917.7142859,4647166025.1428576,11559405929.142857,3891659245.7142859,3308510880,1395808827.4285712,3714606020.5714288,1375364406.8571429,1690860137.1428571,4376613024,779728608,1440273065.1428571,1536923931.4285712,665119872,899050916.57142854,458208493.71428573,545104512,358602912,324639072,214084594.2857143,196789248,178829280,119572416,105859584,87601536,77318784,60787296,{"$f":"AW5*48*6","v":2583398849636.5708}]
["ressources avec %",{"$f":"($AW$6*B4)/100","v":92577341820.770554},{"$f":"($AW$6*C4)/100","v":92577341820.770554},54900516661.154617,78690740547.654953,61317460167.003868,67449206183.704247,118036110821.48244,124248537706.82361,92577341820.770554,67449206183.704247,44541928611.880165,44541928611.880165,32338660499.036289,61317460167.003868,54900516661.154617,40012240956.434723,40012240956.434723,224830687279.01419,40012240956.434723,32338660499.036289,224830687279.01419,44541928611.880165,23607222164.29649,29144718721.353687,15480145681.505894,32338660499.036289,19115159647.203636,44541928611.880165,94428888657.185959,23607222164.29649,49181712842.284355,17231549025.033932,36041560556.177834,54900516661.154617,94428888657.185959,29144718721.353687,21267767715.58242,47214444328.592979,17231549025.033932,21267767715.58242,19115159647.203636,17231549025.033932,19115159647.203636,10175526794.955383,47214444328.592979,19115159647.203636,{"$f":"($AW$6*AV4)/100","v":47214444328.592979},{"$f":"SUM(B7:AV7)","v":2583398849636.5698}]
["colo 36 ou 38%  perte",{"$f":"(B6*36)/100","v":238982643366.58282},{"$f":"(C6*38)/100","v":232450389601.92001},168005315249.28,159998802294.0343,953357980.52571416,3037858111.5428572,702596357.48571432,46488454.76571428,278140024.59428573,{"$f":"(K6*36)/100","v":109904621.34857142},null,null,null,null,null,null,null,null,null,null,null,null,null,null,null,null,null,null,null,null,null,null,null,null,null,null,null,null,null,null,null,null,null,null,null,null,null,null,{"$f":"SUM(B8:AV8)","v":804565496062.07996}]
["colo  gain",{"$f":"F8","v":953357980.52571416},{"$f":"G8","v":3037858111.5428572},{"$f":"J8","v":278140024.59428573},{"$f":"H8","v":702596357.48571432},{"$f":"B8","v":238982643366.58282},{"$f":"C8","v":232450389601.92001},{"$f":"E8","v":159998802294.0343},{"$f":"K8","v":109904621.34857142},{"$f":"D8","v":168005315249.28},{"$f":"I8","v":46488454.76571428},null,null,null,null,null,null,null,null,null,null,null,null,null,null,null,null,null,null,null,null,null,null,null,null,null,null,null,null,null,null,null,null,null,null,null,null,null,null,{"$f":"SUM(B9:AV9)","v":804565496062.07996}]
["doit livrer",{"$f":"(B6+B9)-(B7+B8)","v":333234048811.45801},{"$f":"(C6+C9)-(C7+C8)","v":289721678272.85229},219491558770.15967,183062533236.93933,179220662009.9104,169957688758.10147,43109032897.923294,null,{"$f":"(J6+J9)-(J7+J8)","v":75881780837.058014},null,{"$f":"(L6+L9)-(L7+L8)","v":125149481797.26273},{"$f":"(M6+M9)-(M7+M8)","v":49444353650.976982},7906947455.2494316,null,null,null,null,null,null,null,null,null,null,null,null,null,null,null,null,null,null,null,null,null,null,null,null,null,null,null,null,null,null,null,null,null,null,{"$f":"SUM(B10:AV10)","v":1676179766497.8921},{"$f":"AW10+AX8","v":2480745262559.9722}]
{"$rows_left_out":2}
{"sheet":"qui livre qui","index":1,"n_rows":45,"n_cols":13,"rows_kept":45,"cut":false,"hidden":false,"merged":[]}
[null,"tharsilla","chepa","khonsou","chachadu44","kiwi445","tweick","wakash","vipere92","boody","terminator3",null,"quotas"]
["trezepac",null,null,null,123.7,null,null,null,null,null,null,{"$f":"SUM(B2:K2)","v":123.7},{"$f":"HLOOKUP(A2,'QUOTAS DES LIV'!$A:$AV,11,FALSE)/1000000000","v":-124.06278350138361}]
["dolfijn",null,null,null,null,null,null,67.099999999999994,null,null,null,67.099999999999994,{"$f":"HLOOKUP(A3,'QUOTAS DES LIV'!$A:$AV,11,FALSE)/1000000000","v":-67.20733173542996}]
["Aym35",null,null,null,null,2.0009999999999999,null,null,null,null,null,2.0009999999999999,{"$f":"HLOOKUP(A4,'QUOTAS DES LIV'!$A:$AV,11,FALSE)/1000000000","v":0}]
["Ygrek",null,null,null,null,38.4,null,null,null,null,null,38.4,{"$f":"HLOOKUP(A5,'QUOTAS DES LIV'!$A:$AV,11,FALSE)/1000000000","v":-39.316776587575298}]
["havok1","*",null,null,null,null,null,null,44.1,null,null,44.1,{"$f":"HLOOKUP(A6,'QUOTAS DES LIV'!$A:$AV,11,FALSE)/1000000000","v":-45.746164665726042}]
["maromi",null,null,null,null,null,null,29.3,null,null,null,29.3,{"$f":"HLOOKUP(A7,'QUOTAS DES LIV'!$A:$AV,11,FALSE)/1000000000","v":-26.921800860434722}]
["orev",null,null,null,null,null,null,null,null,30.6,null,30.6,{"$f":"HLOOKUP(A8,'QUOTAS DES LIV'!$A:$AV,11,FALSE)/1000000000","v":-32.557924490149013}]
["kirle",null,null,null,null,null,null,32,null,null,null,32,{"$f":"HLOOKUP(A9,'QUOTAS DES LIV'!$A:$AV,11,FALSE)/1000000000","v":-27.904035763291866}]
["shuo",null,null,25.9,null,null,"*",null,null,null,null,25.9,{"$f":"HLOOKUP(A10,'QUOTAS DES LIV'!$A:$AV,11,FALSE)/1000000000","v":-25.812093655607718}]
{"$rows_left_out":36}
{"sheet":"Matrice encodage","index":2,"n_rows":50,"n_cols":9,"rows_kept":50,"cut":false,"hidden":false,"merged":[]}
["IMPORTATION","Samedi","Dimanche","Lundi","Mardi","Mercredi","Jeudi","Vendredi","MOYENNE"]
["khonsou",{"$f":"VLOOKUP(A2,samedi!A:B,2,FALSE)","v":2241820445},{"$f":"VLOOKUP(A2,dimanche!A:B,2,FALSE)","v":2241820445},{"$f":"VLOOKUP(A2,lundi!A:B,2,FALSE)","v":2241766155},{"$f":"VLOOKUP(A2,mardi!A:B,2,FALSE)","v":2368497217},{"$f":"VLOOKUP(A2,mercredi!A:B,2,FALSE)","v":2366640927},{"$f":"VLOOKUP(A2,jeudi!A:B,2,FALSE)","v":2378065321},{"$f":"VLOOKUP(A2,vendredi!A:B,2,FALSE)","v":2296405921},{"$f":"AVERAGE(D2,E2,F2,G2,H2,B2,C2)","v":2305002347.2857141}]
["tharsilla",{"$f":"VLOOKUP(A3,samedi!A:B,2,FALSE)","v":2123998443},{"$f":"VLOOKUP(A3,dimanche!A:B,2,FALSE)","v":2123998443},{"$f":"VLOOKUP(A3,lundi!A:B,2,FALSE)","v":2123998443},{"$f":"VLOOKUP(A3,mardi!A:B,2,FALSE)","v":2123998443},{"$f":"VLOOKUP(A3,mercredi!A:B,2,FALSE)","v":2123998443},{"$f":"VLOOKUP(A3,jeudi!A:B,2,FALSE)","v":2123998443},{"$f":"VLOOKUP(A3,vendredi!A:B,2,FALSE)","v":2123998443},{"$f":"AVERAGE(D3,E3,F3,G3,H3,B3,C3)","v":2123998443}]
["chachadu44",{"$f":"VLOOKUP(A4,samedi!A:B,2,FALSE)","v":1535136287},{"$f":"VLOOKUP(A4,dimanche!A:B,2,FALSE)","v":1535136287},{"$f":"VLOOKUP(A4,lundi!A:B,2,FALSE)","v":1535136287},{"$f":"VLOOKUP(A4,mardi!A:B,2,FALSE)","v":1535136287},{"$f":"VLOOKUP(A4,mercredi!A:B,2,FALSE)","v":1535136287},{"$f":"VLOOKUP(A4,jeudi!A:B,2,FALSE)","v":1535136287},{"$f":"VLOOKUP(A4,vendredi!A:B,2,FALSE)","v":1535136287},1535136287]
["chepa",{"$f":"VLOOKUP(A5,samedi!A:B,2,FALSE)","v":1496016592},{"$f":"VLOOKUP(A5,dimanche!A:B,2,FALSE)","v":1496016592},{"$f":"VLOOKUP(A5,lundi!A:B,2,FALSE)","v":1496016592},{"$f":"VLOOKUP(A5,mardi!A:B,2,FALSE)","v":1499805343},{"$f":"VLOOKUP(A5,mercredi!A:B,2,FALSE)","v":1426130474},{"$f":"VLOOKUP(A5,jeudi!A:B,2,FALSE)","v":1406300213},{"$f":"VLOOKUP(A5,vendredi!A:B,2,FALSE)","v":1413555715},1461977360.1428571]
["kiwi445",{"$f":"VLOOKUP(A6,samedi!A:B,2,FALSE)","v":721431277},{"$f":"VLOOKUP(A6,dimanche!A:B,2,FALSE)","v":721431277},{"$f":"VLOOKUP(A6,lundi!A:B,2,FALSE)","v":606482162},{"$f":"VLOOKUP(A6,mardi!A:B,2,FALSE)","v":606482162},{"$f":"VLOOKUP(A6,mercredi!A:B,2,FALSE)","v":499773021},{"$f":"VLOOKUP(A6,jeudi!A:B,2,FALSE)","v":484422052},{"$f":"VLOOKUP(A6,vendredi!A:B,2,FALSE)","v":484422052},589206286.14285719]
["terminator3",{"$f":"VLOOKUP(A7,samedi!A:B,2,FALSE)","v":313517929},{"$f":"VLOOKUP(A7,dimanche!A:B,2,FALSE)","v":313517929},{"$f":"VLOOKUP(A7,lundi!A:B,2,FALSE)","v":386422246},{"$f":"VLOOKUP(A7,mardi!A:B,2,FALSE)","v":292309324},{"$f":"VLOOKUP(A7,mercredi!A:B,2,FALSE)","v":299968629},{"$f":"VLOOKUP(A7,jeudi!A:B,2,FALSE)","v":339326374},{"$f":"VLOOKUP(A7,vendredi!A:B,2,FALSE)","v":339326374},326341257.85714287]
["Aym35",{"$f":"VLOOKUP(A8,samedi!A:B,2,FALSE)","v":124104111},{"$f":"VLOOKUP(A8,dimanche!A:B,2,FALSE)","v":124104111},{"$f":"VLOOKUP(A8,lundi!A:B,2,FALSE)","v":145492628},{"$f":"VLOOKUP(A8,mardi!A:B,2,FALSE)","v":128675213},{"$f":"VLOOKUP(A8,mercredi!A:B,2,FALSE)","v":120362051},{"$f":"VLOOKUP(A8,jeudi!A:B,2,FALSE)","v":167726873},{"$f":"VLOOKUP(A8,vendredi!A:B,2,FALSE)","v":167726873},139741694.2857143]
["ygrek",{"$f":"VLOOKUP(A9,samedi!A:B,2,FALSE)","v":63349825},{"$f":"VLOOKUP(A9,dimanche!A:B,2,FALSE)","v":63349825},{"$f":"VLOOKUP(A9,lundi!A:B,2,FALSE)","v":75203758},{"$f":"VLOOKUP(A9,mardi!A:B,2,FALSE)","v":120374182},{"$f":"VLOOKUP(A9,mercredi!A:B,2,FALSE)","v":54746388},{"$f":"VLOOKUP(A9,jeudi!A:B,2,FALSE)","v":70249467},{"$f":"VLOOKUP(A9,vendredi!A:B,2,FALSE)","v":87465392},76391262.428571433]
["havok1",{"$f":"VLOOKUP(A10,samedi!A:B,2,FALSE)","v":53999038},{"$f":"VLOOKUP(A10,dimanche!A:B,2,FALSE)","v":53999038},{"$f":"VLOOKUP(A10,lundi!A:B,2,FALSE)","v":30675967},{"$f":"VLOOKUP(A10,mardi!A:B,2,FALSE)","v":20956892},{"$f":"VLOOKUP(A10,mercredi!A:B,2,FALSE)","v":20956892},{"$f":"VLOOKUP(A10,jeudi!A:B,2,FALSE)","v":20956892},{"$f":"VLOOKUP(A10,vendredi!A:B,2,FALSE)","v":20956892},31785944.428571429]
{"$rows_left_out":41}
{"sheet":"samedi","index":3,"n_rows":47,"n_cols":4,"rows_kept":47,"cut":false,"hidden":false,"merged":[]}
["khonsou",2241820445,null,"OK"]
["tharsilla",2123998443]
["chachadu44",1535136287]
["chepa",1496016592]
["kiwi445",721431277]
["terminator3",313517929]
["Aym35",124104111]
["ygrek",63349825]
["havok1",53999038]
["Maromi",48828665]
{"$rows_left_out":38}
{"sheet":"dimanche","index":4,"n_rows":47,"n_cols":4,"rows_kept":47,"cut":false,"hidden":false,"merged":[]}
["khonsou",2241820445,null,"OK"]
["tharsilla",2123998443]
["chachadu44",1535136287]
["chepa",1496016592]
["kiwi445",721431277]
["terminator3",313517929]
["Aym35",124104111]
["ygrek",63349825]
["havok1",53999038]
["Maromi",48828665]
{"$rows_left_out":38}
{"sheet":"lundi","index":5,"n_rows":47,"n_cols":4,"rows_kept":47,"cut":false,"hidden":false,"merged":[]}
["khonsou",2241766155,null,"OK"]
["tharsilla",2123998443]
["chachadu44",1535136287]
["chepa",1496016592]
["kiwi445",606482162]
["terminator3",386422246]
["Aym35",145492628]
["ygrek",75203758]
["hbing",33246541]
["Calicelame",31797785]
{"$rows_left_out":38}
{"sheet":"mardi","index":6,"n_rows":47,"n_cols":4,"rows_kept":47,"cut":false,"hidden":false,"merged":[]}
["khonsou",2368497217,null,"ok"]
["tharsilla",2123998443]
["chachadu44",1535136287]
["chepa",1499805343]
["kiwi445",606482162]
["terminator3",292309324]
["Aym35",128675213]
["ygrek",120374182]
["vipere92",78847248]
["kirle",60287573]
{"$rows_left_out":38}
{"sheet":"mercredi","index":7,"n_rows":47,"n_cols":4,"rows_kept":47,"cut":false,"hidden":false,"merged":[]}
["khonsou",2366640927,null,"ok"]
["tharsilla",2123998443]
["chachadu44",1535136287]
["chepa",1426130474]
["kiwi445",499773021]
["terminator3",299968629]
["Aym35",120362051]
["vipere92",101568620]
["ygrek",54746388]
["hbing",54745470]
{"$rows_left_out":38}
{"sheet":"jeudi","index":8,"n_rows":47,"n_cols":4,"rows_kept":47,"cut":false,"hidden":false,"merged":[]}
["khonsou",2378065321,null,"ok"]
["tharsilla",2123998443]
["chachadu44",1535136287]
["chepa",1406300213]
["kiwi445",484422052]
["terminator3",339326374]
["Aym35",167726873]
["hbing",72272433]
["ygrek",70249467]
["Maromi",51166071]
{"$rows_left_out":38}
{"sheet":"vendredi","index":9,"n_rows":47,"n_cols":2,"rows_kept":47,"cut":false,"hidden":false,"merged":[]}
["khonsou",2296405921]
["tharsilla",2123998443]
["chachadu44",1535136287]
["chepa",1413555715]
["kiwi445",484422052]
["terminator3",339326374]
["Aym35",167726873]
["ygrek",87465392]
["hbing",68823701]
["Maromi",51166071]
{"$rows_left_out":38}
{"sheet":"TDP","index":10,"n_rows":50,"n_cols":2,"rows_kept":50,"cut":false,"hidden":false,"merged":[]}
["trezepac",3.8E-3]
["tharsilla",5.1000000000000004E-3]
["chepa",6.0000000000000001E-3]
["khonsou",5.1000000000000004E-3]
["chachadu44",8.6E-3]
["kiwi445",1.06E-2]
["kirle",1.18E-2]
["hbing",0.02]
["orev",1.18E-2]
["boody",4.0000000000000001E-3]
{"$rows_left_out":41}
{"sheet":"Importation","index":11,"n_rows":46,"n_cols":2,"rows_kept":46,"cut":false,"hidden":false,"merged":[]}
["khonsou",2596985489]
["tharsilla",2399203488]
["chachadu44",1846705716]
["chepa",1222393063]
["trezepac",809059529]
["alx02",641180757]
["aditi",629482574]
["terminator3",527026406]
["kiwi445",234957796]
["Aym35",96827039]
{"$rows_left_out":36}