{"text_format":"1","workbook":"xlsx","n_sheets":5,"sheets":["Pronostiques","Taux Ender","Grille de rencontres","Classement","Proposition"],"not_rendered":{"charts":0,"images":0,"macros":1,"external_links":0,"defined_names":8,"comments":0,"pivot_tables":0},"unopened":[],"bounds":{"document_bytes":16777216,"sheet_cells":100000,"rows_first":2000,"rows_last":500,"rows_between":2000,"halvings":0,"cell_chars":16384,"cell_head_chars":4096},"cells_cut":0,"cells_raw":0,"read":"whole","date_system":"1900"}

{"sheet":"Pronostiques","index":0,"n_rows":58,"n_cols":20,"rows_kept":58,"cut":false,"hidden":false,"merged":[[56,0,56,1],[57,0,57,1],[0,0,1,0],[0,1,1,1],[0,2,1,2],[0,15,0,19],[0,13,0,14],[0,3,0,4],[0,5,0,6],[0,7,0,8],[0,9,0,10],[0,11,0,12]]}
["Participant Forum","Pseudo IG","Numéro attribué TOURNOI","Tyrell",null,"Lannister",null,"Martell",null,"Baratheon",null,"Stark",null,"Greyjoy",null,"TOTAL"]
[null,null,null,"Joué","Gagné","Joué","Gagné","Joué","Gagné","Joué","Gagné","Joué","Gagné","Joué","Gagné","Joué","Gagné","% Victoires","Rang","Classement par victoires"]
["Sentanza","Sentanza",null,0,0,0,0,0,0,0,0,2,1,1,0,{"$f":"SUM(N3,L3,J3,H3,F3,D3)","v":3},{"$f":"SUM(E3,G3,I3,K3,M3,O3)","v":1},{"$f":"Q3/P3","v":0.33333333333333331},{"$f":"RANK(R3,$R$3:$R$46,0)","v":10},{"$f":"RANK(Q3,$Q$3:$Q$46,0)","v":33}]
["Tauligra","Tauligra",null,1,0,0,0,0,0,0,0,1,0,2,0,{"$f":"SUM(N4,L4,J4,H4,F4,D4)","v":4},{"$f":"SUM(E4,G4,I4,K4,M4,O4)","v":0},{"$f":"Q4/P4","v":0},{"$f":"RANK(R4,$R$3:$R$46,0)","v":35},{"$f":"RANK(Q4,$Q$3:$Q$46,0)","v":35}]
["Lord Batnono","Batnono",null,0,0,1,0,0,0,0,0,0,0,1,0,2,0,0,35,35]
["Ironmaidenx","Ironmaidenx",null,11,4,5,3,9,4,7,5,11,5,4,3,47,24,0.51063829787234039,4,1]
["Ender","Ender",null,3,2,7,2,1,0,6,2,1,1,3,0,21,7,0.33333333333333331,10,6]
["Amombar74","Amombar",null,6,2,5,0,3,1,2,0,1,0,4,0,21,3,0.14285714285714285,26,18]
["Garth","Garth",null,4,0,5,0,3,2,4,0,3,1,4,1,23,4,0.17391304347826086,22,13]
["Cocoyanouck","Cocoyanouck",null,4,0,2,1,5,0,3,1,6,0,3,1,23,3,0.13043478260869565,29,18]
["Horadreem","Horadreem",null,9,1,8,0,9,0,8,1,9,1,9,4,52,7,0.13461538461538461,28,6]
["Aénaarion","Aénaarion",null,8,2,9,1,4,1,12,3,6,1,13,7,52,15,0.28846153846153844,16,2]
["Tal","Tal",null,12,1,13,0,7,1,12,1,8,2,9,2,61,7,0.11475409836065574,30,6]
["Namtok","Namtok",null,9,3,7,0,3,0,8,3,11,4,7,3,45,13,0.28888888888888886,15,3]
["Jake The Dog","Jake The Dog",null,3,1,5,0,1,0,7,1,5,0,7,1,28,3,0.10714285714285714,32,18]
["Gambit","Gambit",null,5,1,2,0,2,1,1,1,0,0,0,0,10,3,0.3,14,18]
["WillamK","WillamK",null,1,1,1,0,2,0,1,1,1,0,2,1,8,3,0.375,8,18]
["Kokunut38","Kokunut38",null,0,0,0,0,0,0,0,0,0,0,0,0,0,0,0,35,35]
["Minos 83","Minos 83",null,3,1,3,1,4,1,1,0,1,0,2,2,14,5,0.35714285714285715,9,11]
["Clopinette","Clopinette",null,3,1,4,1,3,3,2,1,3,2,2,1,17,9,0.52941176470588236,3,4]
["Linos","Linos",null,0,0,2,0,0,0,0,0,1,0,0,0,3,0,0,35,35]
["Elyrioss","Elyrioss",null,2,0,1,0,2,1,0,0,2,0,3,1,10,2,0.2,20,28]
["Jaeregan","Jaeregan",null,3,1,5,1,3,0,4,1,5,3,6,2,26,8,0.30769230769230771,13,5]
["Arya74","Arya74",null,1,1,0,0,2,0,1,1,1,1,2,0,7,3,0.42857142857142855,6,18]
["Shyria","Shyria",null,4,0,1,0,6,0,4,0,3,0,1,0,19,0,0,35,35]
["Moz-kito","Moz",null,5,0,4,0,2,1,5,3,2,0,2,1,20,5,0.25,18,11]
["Sagarmatha","Sagarmatha",null,0,0,0,0,0,0,1,0,1,0,0,0,2,0,0,35,35]
["Oulaoups","Oulaoups",null,0,0,0,0,0,0,0,0,0,0,0,0,0,0,0,35,35]
["Possom","Possom",null,7,2,4,0,6,0,6,2,4,1,3,1,30,6,0.2,20,10]
["NeijH","NeijH",null,3,0,4,0,2,0,7,0,7,3,6,0,29,3,0.10344827586206896,33,18]
["Delapaille","Delapaille",null,3,0,4,0,3,1,9,2,5,0,5,1,29,4,0.13793103448275862,27,13]
["Vermoulu","Vermoulu",null,1,1,1,0,4,0,1,0,2,0,0,0,9,1,0.1111111111111111,31,33]
["Mutos","Mutos",null,0,0,0,0,0,0,4,2,0,0,0,0,4,2,0.5,5,28]
["Forcerouge78","Forcerouge78",null,4,2,1,0,2,1,0,0,4,1,1,0,12,4,0.33333333333333331,10,13]
["Thusane","Thusane",null,5,0,3,0,2,0,2,0,4,0,4,0,20,0,0,35,35]
["Pietou","Pietou",null,5,1,4,2,2,0,3,0,2,0,3,0,19,3,0.15789473684210525,25,18]
["LouBew","LouBew",null,9,0,2,0,8,1,9,1,7,5,9,0,44,7,0.15909090909090909,24,6]
["Joukov","Joukov",null,4,0,2,0,6,0,3,1,4,1,3,0,22,2,9.0909090909090912E-2,34,28]
["Vent Gris","Vent Gris",null,1,0,1,0,0,0,0,0,1,0,0,0,{"$f":"SUM(N39,L39,J39,H39,F39,D39)","v":3},{"$f":"SUM(E39,G39,I39,K39,M39,O39)","v":0},{"$f":"Q39/P39","v":0},35,35]
["Lord A.K","Lord A.K",null,3,1,2,1,0,0,0,0,0,0,0,0,5,2,0.4,7,28]
["Gromrek","Gromrek",null,0,0,0,0,0,0,0,0,0,0,2,2,{"$f":"SUM(N41,L41,J41,H41,F41,D41)","v":2},{"$f":"SUM(E41,G41,I41,K41,M41,O41)","v":2},{"$f":"Q41/P41","v":1},1,28]
["Dodger","Dodger",null,0,0,0,0,0,0,0,0,0,0,0,0,0,0,0,35,35]
["Blacksmiths","Blacksmiths",null,3,0,2,0,3,1,1,1,3,0,4,2,16,4,0.25,18,13]
["Niamor723","Niamor723",null,1,1,0,0,1,1,1,1,0,0,0,0,3,3,1,1,18]
["Ffuj35","Ffuj35",null,4,0,3,0,3,1,5,2,1,0,2,0,18,3,0.16666666666666666,23,18]
["Zubeldia","Zubeldia",null,3,0,4,1,1,0,1,1,1,1,4,1,14,4,0.2857142857142857,17,13]
[]
[]
[]
[]
[]
["Creator2","TheCreator","REMPLACANT",1,0,0,0,2,0,0,0,1,0,0,0,{"$f":"SUM(N52,L52,J52,H52,F52,D52)","v":4},{"$f":"SUM(E52,G52,I52,K52,M52,O52)","v":0}]
["Loup Borgne","Loup Borgne","REMPLACANT",1,0,1,0,1,0,3,2,0,0,0,0,{"$f":"SUM(N53,L53,J53,H53,F53,D53)","v":6},{"$f":"SUM(E53,G53,I53,K53,M53,O53)","v":2}]
["Pazu","Pazu","REMPLACANT",3,0,5,0,6,3,4,2,7,4,7,1,{"$f":"SUM(N54,L54,J54,H54,F54,D54)","v":32},{"$f":"SUM(E54,G54,I54,K54,M54,O54)","v":10}]
["Le Gnome","Le Gnome","ANNULE",0,0,1,0,2,0,4,0,3,0,1,1,{"$f":"SUM(N55,L55,J55,H55,F55,D55)","v":11},{"$f":"SUM(E55,G55,I55,K55,M55,O55)","v":1}]
[]
["Nombre de participants",null,null,null,null,"Mise à jour : 15/09/2014"]
[{"$f":"COUNTA(B3:B46)","v":44}]

{"sheet":"Taux Ender","index":1,"n_rows":10,"n_cols":2,"rows_kept":10,"cut":false,"hidden":false,"merged":[[1,0,1,1]]}
[]
["Pourcentages de victoire"]
["Tyrell",10.5]
["Lannister",11.5]
["Martell",12.5]
["Baratheon",18.5]
["Stark",21.5]
["Greyjoy",25.5]
[]
["Mise à jour :","2014-09-08"]

{"sheet":"Grille de rencontres","index":2,"n_rows":51,"n_cols":21,"rows_kept":51,"cut":false,"hidden":false,"merged":[[46,15,47,20],[46,5,47,10]]}
["Joueurs","Numéro Attribué",null,null,"N° Partie","Tyrell","Lannister","Martell","Baratheon","Stark","Greyjoy",null,"Vainqueur","Famille",null,"Tyrell","Lannister","Martell","Baratheon","Stark","Greyjoy"]
["Sentanza",23,null,null,1585,"Tauligra","Possom","WillamK","Aénaarion","Joukov","Jaeregan",null,"Jaeregan","Greyjoy",null,1,0,5,4,3,7]
["Tauligra",1,null,null,{"$f":"E2+1","v":1586},"Possom","Ffuj35","Lord A.K","Mutos","Niamor723","Elyrioss",null,"Niamor723","Stark",null,0,4,6,2,7,1]
["Batnono",36,null,null,{"$f":"E3+1","v":1587},"WillamK","Oulaoups","NejiH","Arya74","Sagarmatha","Pietou",null,"Pietou","Greyjoy",null,2,0,5,4,4,5]
["Ironmaidenx",22,null,null,1588,"Aénaarion","Blacksmiths","Delapaille","Cocoyanouck","Shyria","Gromrek",null,"Aénaarion","Tyrell",null,7,4,2,2,4,0]
["Ender",38,null,null,1589,"Joukov","Kokunut38","Minos 83","Sagarmatha","Gambit","Lord A.K",null,"Gambit","Stark",null,4,0,4,3,7,2]
["Amombar",41,null,null,1590,"Jaeregan","Jake The Dog","Elyrioss","Forcerouge78","Clopinette","Shyria",null,"Clopinette","Stark",null,3,4,4,2,7,0]
["Garth",7,null,null,1591,"Garth","Jaeregan","Tal","Pietou","Dodger","Mutos",null,"Dodger","Stark",null,4,1,3,1,7,3]
["Cocoyanouck",19,null,null,1592,"Pietou","Thusane","Joukov","Niamor723","Delapaille","Jake The Dog",null,"Jake The Dog","Greyjoy",null,6,1,0,4,2,7]
["Horadreem",20,null,null,1593,"Zubeldia","Pietou","Vent Gris","Horadreem","Lord A.K","LouBew",null,"Vent Gris","Martell",null,4,2,5,4,5,0]
["Aénaarion",4,null,null,1594,"Ffuj35","Horadreem","Sagarmatha","Shyria","Batnono","Joukov",null,"Joukov","Greyjoy",null,4,1,4,3,4,4]
["Tal",37,null,null,1595,"Minos 83","WillamK","Ironmaidenx","Tal","Namtok","Blacksmiths",null,"Tal","Baratheon",null,3,4,3,7,1,2]
["Namtok",12,null,null,1596,"Namtok","Amombar","LouBew","Gromrek","Vermoulu","Moz",null,"Moz","Greyjoy",null,6,0,0,3,4,7]
["Jake The Dog",18,null,null,1597,"Shyria","Ironmaidenx","Mutos","Amombar","Zubeldia","Ender",null,"Ender","Greyjoy",null,3,0,2,5,4,6]
["Gambit",35,null,null,1598,"Delapaille","Minos 83","Linos","Batnono","Amombar","Garth",null,"Linos","Martell",null,0,4,7,4,3,2]
["WillamK",3,null,null,1599,"Oulaoups","Tauligra","Clopinette","Delapaille","Kokunut38","Forcerouge78",null,"Kokunut38","Stark",null,2,1,4,1,7,4]
["Kokunut38",26,null,null,1600,"NejiH","Moz","Gambit","Vent Gris","Ffuj35","Amombar",null,"Amombar","Greyjoy",null,1,0,3,3,4,7]
["Minos 83",11,null,null,1601,"Gromrek","Niamor723","Horadreem","Dodger","Thusane","Kokunut38",null,"Gromrek","Tyrell",null,8,1,4,3,1,3]
["Clopinette",34,null,null,1602,"Jake The Dog","Sagarmatha","Garth","Zubeldia","Blacksmiths","Vermoulu",null,"Vermoulu","Greyjoy",null,3,0,4,3,3,7]
["Linos",25,null,null,1603,"Cocoyanouck","Ender","Possom","Kokunut38","Ironmaidenx","NejiH",null,"Ironmaidenx","Stark",null,4,3,4,2,7,0]
["Elyrioss",33,null,null,1604,"Horadreem","NejiH","Aénaarion","Blacksmiths","Elyrioss","Namtok",null,"Blacksmiths","Baratheon",null,3,1,3,7,2,4]
["Jaeregan",6,null,null,1605,"Forcerouge78","Mutos","Ender","WillamK","Gromrek","Sagarmatha",null,"Ender","Martell",null,2,3,7,1,5,2]
["Arya74",44,null,null,1606,"Ironmaidenx","Joukov","Gromrek","Vermoulu","Linos","Oulaoups",null,"Linos","Stark",null,4,2,4,2,7,1]
["Shyria",13,null,null,1607,"Sentanza","Lord A.K","Blacksmiths","Oulaoups","Minos 83","Thusane",null,"Blacksmiths","Martell",null,4,0,7,0,3,5]
["Moz",24,null,null,1608,"Moz","Vermoulu","Tauligra","Sentanza","WillamK","Dodger",null,"Sentanza","Baratheon",null,2,2,1,7,4,2]
["Sagarmatha",31,null,null,1609,"Linos","Forcerouge78","Thusane","Possom","Moz","Tal",null,"Moz","Stark",null,4,0,3,3,5,4]
["Oulaoups",15,null,null,1610,"Kokunut38","Arya74","Namtok","Thusane","Jake The Dog","Ffuj35",null,"Namtok","Martell",null,0,4,6,3,2,5]
["Possom",2,null,null,1611,"Niamor723","Batnono","Forcerouge78","NejiH","Sentanza","Zubeldia",null,"Zubeldia","Greyjoy",null,3,0,4,3,3,7]
["NejiH",16,null,null,1612,"Dodger","Aénaarion","Amombar","Jake The Dog","Arya74","Ironmaidenx",null,"Arya74","Stark",null,3,4,3,4,5,1]
["Delapaille",14,null,null,1613,"LouBew","Cocoyanouck","Dodger","Joukov","Forcerouge78","Arya74",null,"Joukov","Baratheon",null,2,2,4,7,0,5]
["Vermoulu",43,null,null,1614,"Lord A.K","Garth","Moz","Clopinette","Ender","Aénaarion",null,"Ender","Stark",null,3,0,3,3,7,3]
["Mutos",32,null,null,1615,"Sagarmatha","Linos","Cocoyanouck","Tauligra","Tal","Horadreem",null,"Tal","Stark",null,2,2,3,4,7,1]
["Forcerouge78",21,null,null,1616,"Mutos","LouBew","Arya74","Minos 83","NejiH","Clopinette",null,"Arya74","Martell",null,0,6,7,3,4,0]
["Thusane",42,null,null,1617,"Elyrioss","Dodger","Zubeldia","Gambit","Possom","Delapaille",null,"Gambit","Baratheon",null,3,0,2,7,3,5]
["Pietou",8,null,null,1618,"Clopinette","Vent Gris","Niamor723","Ironmaidenx","Jaeregan","Batnono",null,"Jaeregan","Stark",null,2,4,4,4,5,1]
["LouBew",29,null,null,1619,"Gambit","Shyria","Kokunut38","Linos","Vent Gris","WillamK",null,"Vent Gris","Stark",null,3,0,4,2,6,5]
["Joukov",5,null,null,1620,"Batnono","Elyrioss","Pietou","Ender","Cocoyanouck","Minos 83",null,"Ender","Baratheon",null,2,3,2,7,3,1]
["Vent Gris",39,null,null,1621,"Tal","Gromrek","Jake The Dog","Elyrioss","Tauligra","Vent Gris",null,"Tal","Tyrell",null,7,2,1,2,6,2]
["Lord A.K",30,null,null,1622,"Ender","Gambit","Oulaoups","Namtok","Garth","Niamor723",null,"Ender","Tyrell",null,7,4,0,3,1,4]
["Gromrek",17,null,null,1623,"Vent Gris","Sentanza","Shyria","Garth","LouBew","Possom",null,"LouBew","Stark",null,2,3,4,3,7,1]
["Dodger",28,null,null,1624,"Blacksmiths","Clopinette","Vermoulu","Ffuj35","Pietou","Linos",null,"Clopinette","Lannister",null,3,7,4,3,2,0]
["Blacksmiths",40,null,null,1625,"Amombar","Delapaille","Sentanza","Jaeregan","Horadreem","Gambit",null,"Amombar","Tyrell",null,6,0,2,5,2,5]
["Niamor723",27,null,null,1626,"Thusane","Namtok","Batnono","Lord A.K","Mutos","Tauligra",null,"Namtok","Lannister",null,2,7,0,4,1,6]
["Ffuj35",10,null,null,1627,"Vermoulu","Tal","Ffuj35","LouBew","Aénaarion","Sentanza",null,"Aénaarion","Stark",null,4,3,3,2,7,1]
["Zubeldia",9,null,null,1628,"Arya74","Zubeldia","Jaeregan","Moz","Oulaoups","Cocoyanouck",null,"Zubeldia","Lannister",null,3,5,4,5,0,2]
[]
[null,null,null,null,null,"Grille de Rencontres",null,null,null,null,null,null,null,null,null,"Nombre de chateaux"]
[]
[]
[]
[null,null,null,null,null,null,null,null,null,null,null,null,null,null,null,{"$f":"SUM(P2:P45)","v":141},{"$f":"SUM(Q2:Q45)","v":94},154,154,181,140]

{"sheet":"Classement","index":3,"n_rows":48,"n_cols":24,"rows_kept":48,"cut":false,"hidden":false,"merged":[[46,21,47,23]]}
["Participants","Score","AlphaBeta","Rang",null,"Rang","Participant","Score",null,"Tyrell","Lannister","Martell","Baratheon","Stark","Greyjoy","Score Ender",null,"Total Chateaux",null,"Temporaire",null,"Classement Final","Participant","Score"]
[{"$f":"'Grille de rencontres'!A2","v":"Sentanza"},{"$f":"COUNTIF(Vainqueur,A2)","v":1},{"$f":"B2-COUNTIF(Participants,\"<=\"&A2)/1000","v":0.96399999999999997},{"$f":"RANK(C2,AlphaBeta,0)","v":24},null,1,{"$f":"INDEX(Participants,MATCH(LARGE(AlphaBeta,ROWS($1:1)),AlphaBeta,0))","v":"Ender"},{"$f":"LARGE(Score,ROWS($1:1))","v":5},null,1,null,1,1,1,1,{"$f":"J2*'Taux Ender'!$B$3+K2*'Taux Ender'!$B$4+L2*'Taux Ender'!$B$5+M2*'Taux Ender'!$B$6+N2*'Taux Ender'!$B$7+O2*'Taux Ender'!$B$8","v":88.5},null,37,null,{"$f":"H2*10^7-P2*1+R2*10^4+C2*10^-3","v":50369911.500964001},null,{"$f":"F2","v":1},{"$f":"INDEX($G$2:$G$45,MATCH(LARGE($T$2:$T$45,ROWS($1:1)),$T$2:$T$45,0))","v":"Ender"},{"$f":"H2","v":5}]
[{"$f":"'Grille de rencontres'!A3","v":"Tauligra"},0,-3.9E-2,42,null,{"$f":"F2+1","v":2},{"$f":"INDEX(Participants,MATCH(LARGE(AlphaBeta,ROWS($1:2)),AlphaBeta,0))","v":"Tal"},{"$f":"LARGE(Score,ROWS($1:2))","v":3},null,1,null,null,1,1,null,{"$f":"J3*'Taux Ender'!$B$3+K3*'Taux Ender'!$B$4+L3*'Taux Ender'!$B$5+M3*'Taux Ender'!$B$6+N3*'Taux Ender'!$B$7+O3*'Taux Ender'!$B$8","v":50.5},null,31,null,{"$f":"H3*10^7-P3*1+R3*10^4+C3*10^-3","v":30309949.499961},null,{"$f":"F3","v":2},{"$f":"INDEX($G$2:$G$45,MATCH(LARGE($T$2:$T$45,ROWS($1:2)),$T$2:$T$45,0))","v":"Tal"},{"$f":"H3","v":3}]
[{"$f":"'Grille de rencontres'!A4","v":"Batnono"},0,-4.0000000000000001E-3,26,null,{"$f":"F3+1","v":3},{"$f":"INDEX(Participants,MATCH(LARGE(AlphaBeta,ROWS($1:3)),AlphaBeta,0))","v":"Aénaarion"},{"$f":"LARGE(Score,ROWS($1:3))","v":2},null,1,null,null,null,1,null,{"$f":"J4*'Taux Ender'!$B$3+K4*'Taux Ender'!$B$4+L4*'Taux Ender'!$B$5+M4*'Taux Ender'!$B$6+N4*'Taux Ender'!$B$7+O4*'Taux Ender'!$B$8","v":32},null,28,null,20279967.999995999,null,3,{"$f":"INDEX($G$2:$G$45,MATCH(LARGE($T$2:$T$45,ROWS($1:3)),$T$2:$T$45,0))","v":"Gambit"},2]
[{"$f":"'Grille de rencontres'!A5","v":"Ironmaidenx"},1,0.98199999999999998,18,null,4,{"$f":"INDEX(Participants,MATCH(LARGE(AlphaBeta,ROWS($1:4)),AlphaBeta,0))","v":"Amombar"},{"$f":"LARGE(Score,ROWS($1:4))","v":2},null,1,null,null,null,null,1,{"$f":"J5*'Taux Ender'!$B$3+K5*'Taux Ender'!$B$4+L5*'Taux Ender'!$B$5+M5*'Taux Ender'!$B$6+N5*'Taux Ender'!$B$7+O5*'Taux Ender'!$B$8","v":36},null,24,null,20239964.000982001,null,4,{"$f":"INDEX($G$2:$G$45,MATCH(LARGE($T$2:$T$45,ROWS($1:4)),$T$2:$T$45,0))","v":"Aénaarion"},2]
[{"$f":"'Grille de rencontres'!A6","v":"Ender"},5,4.9889999999999999,1,null,5,{"$f":"INDEX(Participants,MATCH(LARGE(AlphaBeta,ROWS($1:5)),AlphaBeta,0))","v":"Arya74"},{"$f":"LARGE(Score,ROWS($1:5))","v":2},null,null,null,1,null,1,null,{"$f":"J6*'Taux Ender'!$B$3+K6*'Taux Ender'!$B$4+L6*'Taux Ender'!$B$5+M6*'Taux Ender'!$B$6+N6*'Taux Ender'!$B$7+O6*'Taux Ender'!$B$8","v":34},null,28,null,20279966.004988998,null,5,{"$f":"INDEX($G$2:$G$45,MATCH(LARGE($T$2:$T$45,ROWS($1:5)),$T$2:$T$45,0))","v":"Arya74"},2]
[{"$f":"'Grille de rencontres'!A7","v":"Amombar"},2,1.998,4,null,6,{"$f":"INDEX(Participants,MATCH(LARGE(AlphaBeta,ROWS($1:6)),AlphaBeta,0))","v":"Blacksmiths"},{"$f":"LARGE(Score,ROWS($1:6))","v":2},null,null,null,1,1,null,null,{"$f":"J7*'Taux Ender'!$B$3+K7*'Taux Ender'!$B$4+L7*'Taux Ender'!$B$5+M7*'Taux Ender'!$B$6+N7*'Taux Ender'!$B$7+O7*'Taux Ender'!$B$8","v":31},null,26,null,20259969.001998,null,6,{"$f":"INDEX($G$2:$G$45,MATCH(LARGE($T$2:$T$45,ROWS($1:6)),$T$2:$T$45,0))","v":"Namtok"},2]
[{"$f":"'Grille de rencontres'!A8","v":"Garth"},0,-1.4999999999999999E-2,32,null,7,{"$f":"INDEX(Participants,MATCH(LARGE(AlphaBeta,ROWS($1:7)),AlphaBeta,0))","v":"Clopinette"},{"$f":"LARGE(Score,ROWS($1:7))","v":2},null,null,1,null,null,1,null,{"$f":"J8*'Taux Ender'!$B$3+K8*'Taux Ender'!$B$4+L8*'Taux Ender'!$B$5+M8*'Taux Ender'!$B$6+N8*'Taux Ender'!$B$7+O8*'Taux Ender'!$B$8","v":33},null,23,null,20229966.999984998,null,7,{"$f":"INDEX($G$2:$G$45,MATCH(LARGE($T$2:$T$45,ROWS($1:7)),$T$2:$T$45,0))","v":"Blacksmiths"},2]
[{"$f":"'Grille de rencontres'!A9","v":"Cocoyanouck"},0,-7.0000000000000001E-3,27,null,8,{"$f":"INDEX(Participants,MATCH(LARGE(AlphaBeta,ROWS($1:8)),AlphaBeta,0))","v":"Gambit"},{"$f":"LARGE(Score,ROWS($1:8))","v":2},null,null,null,null,1,1,null,{"$f":"J9*'Taux Ender'!$B$3+K9*'Taux Ender'!$B$4+L9*'Taux Ender'!$B$5+M9*'Taux Ender'!$B$6+N9*'Taux Ender'!$B$7+O9*'Taux Ender'!$B$8","v":40},null,29,null,20289959.999993,null,8,{"$f":"INDEX($G$2:$G$45,MATCH(LARGE($T$2:$T$45,ROWS($1:8)),$T$2:$T$45,0))","v":"Zubeldia"},2]
[{"$f":"'Grille de rencontres'!A10","v":"Horadreem"},0,-1.7000000000000001E-2,33,null,9,{"$f":"INDEX(Participants,MATCH(LARGE(AlphaBeta,ROWS($1:9)),AlphaBeta,0))","v":"Jaeregan"},{"$f":"LARGE(Score,ROWS($1:9))","v":2},null,null,null,null,null,1,1,{"$f":"J10*'Taux Ender'!$B$3+K10*'Taux Ender'!$B$4+L10*'Taux Ender'!$B$5+M10*'Taux Ender'!$B$6+N10*'Taux Ender'!$B$7+O10*'Taux Ender'!$B$8","v":47},null,25,null,20249952.999983002,null,9,{"$f":"INDEX($G$2:$G$45,MATCH(LARGE($T$2:$T$45,ROWS($1:9)),$T$2:$T$45,0))","v":"Jaeregan"},2]
[{"$f":"'Grille de rencontres'!A11","v":"Aénaarion"},2,1.9990000000000001,3,null,10,{"$f":"INDEX(Participants,MATCH(LARGE(AlphaBeta,ROWS($1:10)),AlphaBeta,0))","v":"Joukov"},{"$f":"LARGE(Score,ROWS($1:10))","v":2},null,null,null,null,1,null,1,{"$f":"J11*'Taux Ender'!$B$3+K11*'Taux Ender'!$B$4+L11*'Taux Ender'!$B$5+M11*'Taux Ender'!$B$6+N11*'Taux Ender'!$B$7+O11*'Taux Ender'!$B$8","v":44},null,20,null,20199956.001998998,null,10,{"$f":"INDEX($G$2:$G$45,MATCH(LARGE($T$2:$T$45,ROWS($1:10)),$T$2:$T$45,0))","v":"Amombar"},2]
[{"$f":"'Grille de rencontres'!A12","v":"Tal"},3,2.9620000000000002,2,null,11,{"$f":"INDEX(Participants,MATCH(LARGE(AlphaBeta,ROWS($1:11)),AlphaBeta,0))","v":"Linos"},{"$f":"LARGE(Score,ROWS($1:11))","v":2},null,null,null,1,null,1,null,{"$f":"J12*'Taux Ender'!$B$3+K12*'Taux Ender'!$B$4+L12*'Taux Ender'!$B$5+M12*'Taux Ender'!$B$6+N12*'Taux Ender'!$B$7+O12*'Taux Ender'!$B$8","v":34},null,22,null,20219966.002962001,null,11,{"$f":"INDEX($G$2:$G$45,MATCH(LARGE($T$2:$T$45,ROWS($1:11)),$T$2:$T$45,0))","v":"Clopinette"},2]
[{"$f":"'Grille de rencontres'!A13","v":"Namtok"},2,1.9710000000000001,13,null,12,{"$f":"INDEX(Participants,MATCH(LARGE(AlphaBeta,ROWS($1:12)),AlphaBeta,0))","v":"Moz"},{"$f":"LARGE(Score,ROWS($1:12))","v":2},null,null,null,null,null,1,1,{"$f":"J13*'Taux Ender'!$B$3+K13*'Taux Ender'!$B$4+L13*'Taux Ender'!$B$5+M13*'Taux Ender'!$B$6+N13*'Taux Ender'!$B$7+O13*'Taux Ender'!$B$8","v":47},null,22,null,20219953.001970999,null,12,{"$f":"INDEX($G$2:$G$45,MATCH(LARGE($T$2:$T$45,ROWS($1:12)),$T$2:$T$45,0))","v":"Linos"},2]
[{"$f":"'Grille de rencontres'!A14","v":"Jake The Dog"},1,0.98,19,null,13,{"$f":"INDEX(Participants,MATCH(LARGE(AlphaBeta,ROWS($1:13)),AlphaBeta,0))","v":"Namtok"},{"$f":"LARGE(Score,ROWS($1:13))","v":2},null,null,1,1,null,null,null,{"$f":"J14*'Taux Ender'!$B$3+K14*'Taux Ender'!$B$4+L14*'Taux Ender'!$B$5+M14*'Taux Ender'!$B$6+N14*'Taux Ender'!$B$7+O14*'Taux Ender'!$B$8","v":24},null,27,null,20269976.000980001,null,13,{"$f":"INDEX($G$2:$G$45,MATCH(LARGE($T$2:$T$45,ROWS($1:13)),$T$2:$T$45,0))","v":"Vent Gris"},2]
[{"$f":"'Grille de rencontres'!A15","v":"Gambit"},2,1.986,8,null,14,{"$f":"INDEX(Participants,MATCH(LARGE(AlphaBeta,ROWS($1:14)),AlphaBeta,0))","v":"Vent Gris"},{"$f":"LARGE(Score,ROWS($1:14))","v":2},null,null,null,1,null,1,null,{"$f":"J15*'Taux Ender'!$B$3+K15*'Taux Ender'!$B$4+L15*'Taux Ender'!$B$5+M15*'Taux Ender'!$B$6+N15*'Taux Ender'!$B$7+O15*'Taux Ender'!$B$8","v":34},null,22,null,20219966.001986001,null,14,{"$f":"INDEX($G$2:$G$45,MATCH(LARGE($T$2:$T$45,ROWS($1:14)),$T$2:$T$45,0))","v":"Moz"},2]
[{"$f":"'Grille de rencontres'!A16","v":"WillamK"},0,-4.2999999999999997E-2,44,null,15,{"$f":"INDEX(Participants,MATCH(LARGE(AlphaBeta,ROWS($1:15)),AlphaBeta,0))","v":"Zubeldia"},{"$f":"LARGE(Score,ROWS($1:15))","v":2},null,null,1,null,null,null,1,{"$f":"J16*'Taux Ender'!$B$3+K16*'Taux Ender'!$B$4+L16*'Taux Ender'!$B$5+M16*'Taux Ender'!$B$6+N16*'Taux Ender'!$B$7+O16*'Taux Ender'!$B$8","v":37},null,25,null,20249962.999956999,null,15,{"$f":"INDEX($G$2:$G$45,MATCH(LARGE($T$2:$T$45,ROWS($1:15)),$T$2:$T$45,0))","v":"Joukov"},2]
[{"$f":"'Grille de rencontres'!A17","v":"Kokunut38"},1,0.97799999999999998,20,null,16,{"$f":"INDEX(Participants,MATCH(LARGE(AlphaBeta,ROWS($1:16)),AlphaBeta,0))","v":"Dodger"},{"$f":"LARGE(Score,ROWS($1:16))","v":1},null,null,null,null,null,1,null,{"$f":"J17*'Taux Ender'!$B$3+K17*'Taux Ender'!$B$4+L17*'Taux Ender'!$B$5+M17*'Taux Ender'!$B$6+N17*'Taux Ender'!$B$7+O17*'Taux Ender'!$B$8","v":21.5},null,19,null,10189978.500978,null,16,{"$f":"INDEX($G$2:$G$45,MATCH(LARGE($T$2:$T$45,ROWS($1:16)),$T$2:$T$45,0))","v":"Niamor723"},1]
[{"$f":"'Grille de rencontres'!A18","v":"Minos 83"},0,-2.5999999999999999E-2,35,null,17,{"$f":"INDEX(Participants,MATCH(LARGE(AlphaBeta,ROWS($1:17)),AlphaBeta,0))","v":"Gromrek"},{"$f":"LARGE(Score,ROWS($1:17))","v":1},null,1,null,null,null,null,null,{"$f":"J18*'Taux Ender'!$B$3+K18*'Taux Ender'!$B$4+L18*'Taux Ender'!$B$5+M18*'Taux Ender'!$B$6+N18*'Taux Ender'!$B$7+O18*'Taux Ender'!$B$8","v":10.5},null,22,null,10219989.499973999,null,17,{"$f":"INDEX($G$2:$G$45,MATCH(LARGE($T$2:$T$45,ROWS($1:17)),$T$2:$T$45,0))","v":"Vermoulu"},1]
[{"$f":"'Grille de rencontres'!A19","v":"Clopinette"},2,1.994,7,null,18,{"$f":"INDEX(Participants,MATCH(LARGE(AlphaBeta,ROWS($1:18)),AlphaBeta,0))","v":"Ironmaidenx"},{"$f":"LARGE(Score,ROWS($1:18))","v":1},null,null,null,null,null,1,null,{"$f":"J19*'Taux Ender'!$B$3+K19*'Taux Ender'!$B$4+L19*'Taux Ender'!$B$5+M19*'Taux Ender'!$B$6+N19*'Taux Ender'!$B$7+O19*'Taux Ender'!$B$8","v":21.5},null,19,null,10189978.501994001,null,18,{"$f":"INDEX($G$2:$G$45,MATCH(LARGE($T$2:$T$45,ROWS($1:18)),$T$2:$T$45,0))","v":"Gromrek"},1]
[{"$f":"'Grille de rencontres'!A20","v":"Linos"},2,1.9770000000000001,11,null,19,{"$f":"INDEX(Participants,MATCH(LARGE(AlphaBeta,ROWS($1:19)),AlphaBeta,0))","v":"Jake The Dog"},{"$f":"LARGE(Score,ROWS($1:19))","v":1},null,null,null,null,null,null,1,{"$f":"J20*'Taux Ender'!$B$3+K20*'Taux Ender'!$B$4+L20*'Taux Ender'!$B$5+M20*'Taux Ender'!$B$6+N20*'Taux Ender'!$B$7+O20*'Taux Ender'!$B$8","v":25.5},null,21,null,10209974.501977,null,19,{"$f":"INDEX($G$2:$G$45,MATCH(LARGE($T$2:$T$45,ROWS($1:19)),$T$2:$T$45,0))","v":"Jake The Dog"},1]
[{"$f":"'Grille de rencontres'!A21","v":"Elyrioss"},0,-0.01,29,null,20,{"$f":"INDEX(Participants,MATCH(LARGE(AlphaBeta,ROWS($1:20)),AlphaBeta,0))","v":"Kokunut38"},{"$f":"LARGE(Score,ROWS($1:20))","v":1},null,null,null,null,null,1,null,{"$f":"J21*'Taux Ender'!$B$3+K21*'Taux Ender'!$B$4+L21*'Taux Ender'!$B$5+M21*'Taux Ender'!$B$6+N21*'Taux Ender'!$B$7+O21*'Taux Ender'!$B$8","v":21.5},null,16,null,10159978.499989999,null,20,{"$f":"INDEX($G$2:$G$45,MATCH(LARGE($T$2:$T$45,ROWS($1:20)),$T$2:$T$45,0))","v":"Sentanza"},1]
[{"$f":"'Grille de rencontres'!A22","v":"Jaeregan"},2,1.9810000000000001,9,null,21,{"$f":"INDEX(Participants,MATCH(LARGE(AlphaBeta,ROWS($1:21)),AlphaBeta,0))","v":"LouBew"},{"$f":"LARGE(Score,ROWS($1:21))","v":1},null,null,null,null,null,1,null,{"$f":"J22*'Taux Ender'!$B$3+K22*'Taux Ender'!$B$4+L22*'Taux Ender'!$B$5+M22*'Taux Ender'!$B$6+N22*'Taux Ender'!$B$7+O22*'Taux Ender'!$B$8","v":21.5},null,17,null,10169978.501980999,null,21,{"$f":"INDEX($G$2:$G$45,MATCH(LARGE($T$2:$T$45,ROWS($1:21)),$T$2:$T$45,0))","v":"Ironmaidenx"},1]
[{"$f":"'Grille de rencontres'!A23","v":"Arya74"},2,1.9970000000000001,5,null,22,{"$f":"INDEX(Participants,MATCH(LARGE(AlphaBeta,ROWS($1:22)),AlphaBeta,0))","v":"Niamor723"},{"$f":"LARGE(Score,ROWS($1:22))","v":1},null,null,null,null,null,1,null,{"$f":"J23*'Taux Ender'!$B$3+K23*'Taux Ender'!$B$4+L23*'Taux Ender'!$B$5+M23*'Taux Ender'!$B$6+N23*'Taux Ender'!$B$7+O23*'Taux Ender'!$B$8","v":21.5},null,23,null,10229978.501997,null,22,{"$f":"INDEX($G$2:$G$45,MATCH(LARGE($T$2:$T$45,ROWS($1:22)),$T$2:$T$45,0))","v":"Dodger"},1]
[{"$f":"'Grille de rencontres'!A24","v":"Shyria"},0,-3.6999999999999998E-2,41,null,23,{"$f":"INDEX(Participants,MATCH(LARGE(AlphaBeta,ROWS($1:23)),AlphaBeta,0))","v":"Pietou"},{"$f":"LARGE(Score,ROWS($1:23))","v":1},null,null,null,null,null,null,1,{"$f":"J24*'Taux Ender'!$B$3+K24*'Taux Ender'!$B$4+L24*'Taux Ender'!$B$5+M24*'Taux Ender'!$B$6+N24*'Taux Ender'!$B$7+O24*'Taux Ender'!$B$8","v":25.5},null,18,null,10179974.499963,null,23,{"$f":"INDEX($G$2:$G$45,MATCH(LARGE($T$2:$T$45,ROWS($1:23)),$T$2:$T$45,0))","v":"Pietou"},1]
[{"$f":"'Grille de rencontres'!A25","v":"Moz"},2,1.9730000000000001,12,null,24,{"$f":"INDEX(Participants,MATCH(LARGE(AlphaBeta,ROWS($1:24)),AlphaBeta,0))","v":"Sentanza"},{"$f":"LARGE(Score,ROWS($1:24))","v":1},null,null,null,null,1,null,null,{"$f":"J25*'Taux Ender'!$B$3+K25*'Taux Ender'!$B$4+L25*'Taux Ender'!$B$5+M25*'Taux Ender'!$B$6+N25*'Taux Ender'!$B$7+O25*'Taux Ender'!$B$8","v":18.5},null,20,null,10199981.501972999,null,24,{"$f":"INDEX($G$2:$G$45,MATCH(LARGE($T$2:$T$45,ROWS($1:24)),$T$2:$T$45,0))","v":"LouBew"},1]
[{"$f":"'Grille de rencontres'!A26","v":"Sagarmatha"},0,-3.5000000000000003E-2,40,null,25,{"$f":"INDEX(Participants,MATCH(LARGE(AlphaBeta,ROWS($1:25)),AlphaBeta,0))","v":"Vermoulu"},{"$f":"LARGE(Score,ROWS($1:25))","v":1},null,null,null,null,null,null,1,{"$f":"J26*'Taux Ender'!$B$3+K26*'Taux Ender'!$B$4+L26*'Taux Ender'!$B$5+M26*'Taux Ender'!$B$6+N26*'Taux Ender'!$B$7+O26*'Taux Ender'!$B$8","v":25.5},null,23,null,10229974.499965001,null,25,{"$f":"INDEX($G$2:$G$45,MATCH(LARGE($T$2:$T$45,ROWS($1:25)),$T$2:$T$45,0))","v":"Kokunut38"},1]
[{"$f":"'Grille de rencontres'!A27","v":"Oulaoups"},0,-3.2000000000000001E-2,38,null,26,{"$f":"INDEX(Participants,MATCH(LARGE(AlphaBeta,ROWS($1:26)),AlphaBeta,0))","v":"Batnono"},{"$f":"LARGE(Score,ROWS($1:26))","v":0},null,null,null,null,null,null,null,{"$f":"J27*'Taux Ender'!$B$3+K27*'Taux Ender'!$B$4+L27*'Taux Ender'!$B$5+M27*'Taux Ender'!$B$6+N27*'Taux Ender'!$B$7+O27*'Taux Ender'!$B$8","v":0},null,11,null,109999.999968,null,26,{"$f":"INDEX($G$2:$G$45,MATCH(LARGE($T$2:$T$45,ROWS($1:26)),$T$2:$T$45,0))","v":"Ffuj35"},0]
[{"$f":"'Grille de rencontres'!A28","v":"Possom"},0,-3.4000000000000002E-2,39,null,27,{"$f":"INDEX(Participants,MATCH(LARGE(AlphaBeta,ROWS($1:27)),AlphaBeta,0))","v":"Cocoyanouck"},{"$f":"LARGE(Score,ROWS($1:27))","v":0},null,null,null,null,null,null,null,{"$f":"J28*'Taux Ender'!$B$3+K28*'Taux Ender'!$B$4+L28*'Taux Ender'!$B$5+M28*'Taux Ender'!$B$6+N28*'Taux Ender'!$B$7+O28*'Taux Ender'!$B$8","v":0},null,16,null,159999.999966,null,27,{"$f":"INDEX($G$2:$G$45,MATCH(LARGE($T$2:$T$45,ROWS($1:27)),$T$2:$T$45,0))","v":"WillamK"},0]
[{"$f":"'Grille de rencontres'!A29","v":"NejiH"},0,-0.03,37,null,28,{"$f":"INDEX(Participants,MATCH(LARGE(AlphaBeta,ROWS($1:28)),AlphaBeta,0))","v":"Delapaille"},{"$f":"LARGE(Score,ROWS($1:28))","v":0},null,null,null,null,null,null,null,{"$f":"J29*'Taux Ender'!$B$3+K29*'Taux Ender'!$B$4+L29*'Taux Ender'!$B$5+M29*'Taux Ender'!$B$6+N29*'Taux Ender'!$B$7+O29*'Taux Ender'!$B$8","v":0},null,10,null,99999.999970000004,null,28,{"$f":"INDEX($G$2:$G$45,MATCH(LARGE($T$2:$T$45,ROWS($1:28)),$T$2:$T$45,0))","v":"Lord A.K"},0]
[{"$f":"'Grille de rencontres'!A30","v":"Delapaille"},0,-8.0000000000000002E-3,28,null,29,{"$f":"INDEX(Participants,MATCH(LARGE(AlphaBeta,ROWS($1:29)),AlphaBeta,0))","v":"Elyrioss"},{"$f":"LARGE(Score,ROWS($1:29))","v":0},null,null,null,null,null,null,null,{"$f":"J30*'Taux Ender'!$B$3+K30*'Taux Ender'!$B$4+L30*'Taux Ender'!$B$5+M30*'Taux Ender'!$B$6+N30*'Taux Ender'!$B$7+O30*'Taux Ender'!$B$8","v":0},null,15,null,149999.999992,null,29,{"$f":"INDEX($G$2:$G$45,MATCH(LARGE($T$2:$T$45,ROWS($1:29)),$T$2:$T$45,0))","v":"Tauligra"},0]
[{"$f":"'Grille de rencontres'!A31","v":"Vermoulu"},1,0.95799999999999996,25,null,30,{"$f":"INDEX(Participants,MATCH(LARGE(AlphaBeta,ROWS($1:30)),AlphaBeta,0))","v":"Ffuj35"},{"$f":"LARGE(Score,ROWS($1:30))","v":0},null,null,null,null,null,null,null,{"$f":"J31*'Taux Ender'!$B$3+K31*'Taux Ender'!$B$4+L31*'Taux Ender'!$B$5+M31*'Taux Ender'!$B$6+N31*'Taux Ender'!$B$7+O31*'Taux Ender'!$B$8","v":0},null,23,null,230000.00095799999,null,30,{"$f":"INDEX($G$2:$G$45,MATCH(LARGE($T$2:$T$45,ROWS($1:30)),$T$2:$T$45,0))","v":"Minos 83"},0]
[{"$f":"'Grille de rencontres'!A32","v":"Mutos"},0,-2.8000000000000001E-2,36,null,31,{"$f":"INDEX(Participants,MATCH(LARGE(AlphaBeta,ROWS($1:31)),AlphaBeta,0))","v":"Forcerouge78"},{"$f":"LARGE(Score,ROWS($1:31))","v":0},null,null,null,null,null,null,null,{"$f":"J32*'Taux Ender'!$B$3+K32*'Taux Ender'!$B$4+L32*'Taux Ender'!$B$5+M32*'Taux Ender'!$B$6+N32*'Taux Ender'!$B$7+O32*'Taux Ender'!$B$8","v":0},null,12,null,119999.99997200001,null,31,{"$f":"INDEX($G$2:$G$45,MATCH(LARGE($T$2:$T$45,ROWS($1:31)),$T$2:$T$45,0))","v":"Cocoyanouck"},0]
[{"$f":"'Grille de rencontres'!A33","v":"Forcerouge78"},0,-1.2999999999999999E-2,31,null,32,{"$f":"INDEX(Participants,MATCH(LARGE(AlphaBeta,ROWS($1:32)),AlphaBeta,0))","v":"Garth"},{"$f":"LARGE(Score,ROWS($1:32))","v":0},null,null,null,null,null,null,null,{"$f":"J33*'Taux Ender'!$B$3+K33*'Taux Ender'!$B$4+L33*'Taux Ender'!$B$5+M33*'Taux Ender'!$B$6+N33*'Taux Ender'!$B$7+O33*'Taux Ender'!$B$8","v":0},null,14,null,139999.99998699999,null,32,{"$f":"INDEX($G$2:$G$45,MATCH(LARGE($T$2:$T$45,ROWS($1:32)),$T$2:$T$45,0))","v":"Sagarmatha"},0]
[{"$f":"'Grille de rencontres'!A34","v":"Thusane"},0,-0.04,43,null,33,{"$f":"INDEX(Participants,MATCH(LARGE(AlphaBeta,ROWS($1:33)),AlphaBeta,0))","v":"Horadreem"},{"$f":"LARGE(Score,ROWS($1:33))","v":0},null,null,null,null,null,null,null,{"$f":"J34*'Taux Ender'!$B$3+K34*'Taux Ender'!$B$4+L34*'Taux Ender'!$B$5+M34*'Taux Ender'!$B$6+N34*'Taux Ender'!$B$7+O34*'Taux Ender'!$B$8","v":0},null,15,null,149999.99995999999,null,33,{"$f":"INDEX($G$2:$G$45,MATCH(LARGE($T$2:$T$45,ROWS($1:33)),$T$2:$T$45,0))","v":"Elyrioss"},0]
[{"$f":"'Grille de rencontres'!A35","v":"Pietou"},1,0.96699999999999997,23,null,34,{"$f":"INDEX(Participants,MATCH(LARGE(AlphaBeta,ROWS($1:34)),AlphaBeta,0))","v":"Lord A.K"},{"$f":"LARGE(Score,ROWS($1:34))","v":0},null,null,null,null,null,null,null,{"$f":"J35*'Taux Ender'!$B$3+K35*'Taux Ender'!$B$4+L35*'Taux Ender'!$B$5+M35*'Taux Ender'!$B$6+N35*'Taux Ender'!$B$7+O35*'Taux Ender'!$B$8","v":0},null,20,null,200000.000967,null,34,{"$f":"INDEX($G$2:$G$45,MATCH(LARGE($T$2:$T$45,ROWS($1:34)),$T$2:$T$45,0))","v":"Thusane"},0]
[{"$f":"'Grille de rencontres'!A36","v":"LouBew"},1,0.97499999999999998,21,null,35,{"$f":"INDEX(Participants,MATCH(LARGE(AlphaBeta,ROWS($1:35)),AlphaBeta,0))","v":"Minos 83"},{"$f":"LARGE(Score,ROWS($1:35))","v":0},null,null,null,null,null,null,null,{"$f":"J36*'Taux Ender'!$B$3+K36*'Taux Ender'!$B$4+L36*'Taux Ender'!$B$5+M36*'Taux Ender'!$B$6+N36*'Taux Ender'!$B$7+O36*'Taux Ender'!$B$8","v":0},null,18,null,180000.000975,null,35,{"$f":"INDEX($G$2:$G$45,MATCH(LARGE($T$2:$T$45,ROWS($1:35)),$T$2:$T$45,0))","v":"Horadreem"},0]
[{"$f":"'Grille de rencontres'!A37","v":"Joukov"},2,1.9790000000000001,10,null,36,{"$f":"INDEX(Participants,MATCH(LARGE(AlphaBeta,ROWS($1:36)),AlphaBeta,0))","v":"Mutos"},{"$f":"LARGE(Score,ROWS($1:36))","v":0},null,null,null,null,null,null,null,{"$f":"J37*'Taux Ender'!$B$3+K37*'Taux Ender'!$B$4+L37*'Taux Ender'!$B$5+M37*'Taux Ender'!$B$6+N37*'Taux Ender'!$B$7+O37*'Taux Ender'!$B$8","v":0},null,11,null,110000.00197899999,null,36,{"$f":"INDEX($G$2:$G$45,MATCH(LARGE($T$2:$T$45,ROWS($1:36)),$T$2:$T$45,0))","v":"Shyria"},0]
[{"$f":"'Grille de rencontres'!A38","v":"Vent Gris"},2,1.9590000000000001,14,null,37,{"$f":"INDEX(Participants,MATCH(LARGE(AlphaBeta,ROWS($1:37)),AlphaBeta,0))","v":"NejiH"},{"$f":"LARGE(Score,ROWS($1:37))","v":0},null,null,null,null,null,null,null,{"$f":"J38*'Taux Ender'!$B$3+K38*'Taux Ender'!$B$4+L38*'Taux Ender'!$B$5+M38*'Taux Ender'!$B$6+N38*'Taux Ender'!$B$7+O38*'Taux Ender'!$B$8","v":0},null,14,null,140000.00195899999,null,37,{"$f":"INDEX($G$2:$G$45,MATCH(LARGE($T$2:$T$45,ROWS($1:37)),$T$2:$T$45,0))","v":"NejiH"},0]
[{"$f":"'Grille de rencontres'!A39","v":"Lord A.K"},0,-2.4E-2,34,null,38,{"$f":"INDEX(Participants,MATCH(LARGE(AlphaBeta,ROWS($1:38)),AlphaBeta,0))","v":"Oulaoups"},{"$f":"LARGE(Score,ROWS($1:38))","v":0},null,null,null,null,null,null,null,{"$f":"J39*'Taux Ender'!$B$3+K39*'Taux Ender'!$B$4+L39*'Taux Ender'!$B$5+M39*'Taux Ender'!$B$6+N39*'Taux Ender'!$B$7+O39*'Taux Ender'!$B$8","v":0},null,3,null,29999.999975999999,null,38,{"$f":"INDEX($G$2:$G$45,MATCH(LARGE($T$2:$T$45,ROWS($1:38)),$T$2:$T$45,0))","v":"Garth"},0]
[{"$f":"'Grille de rencontres'!A40","v":"Gromrek"},1,0.98399999999999999,17,null,39,{"$f":"INDEX(Participants,MATCH(LARGE(AlphaBeta,ROWS($1:39)),AlphaBeta,0))","v":"Possom"},{"$f":"LARGE(Score,ROWS($1:39))","v":0},null,null,null,null,null,null,null,{"$f":"J40*'Taux Ender'!$B$3+K40*'Taux Ender'!$B$4+L40*'Taux Ender'!$B$5+M40*'Taux Ender'!$B$6+N40*'Taux Ender'!$B$7+O40*'Taux Ender'!$B$8","v":0},null,11,null,110000.000984,null,39,{"$f":"INDEX($G$2:$G$45,MATCH(LARGE($T$2:$T$45,ROWS($1:39)),$T$2:$T$45,0))","v":"Forcerouge78"},0]
[{"$f":"'Grille de rencontres'!A41","v":"Dodger"},1,0.99099999999999999,16,null,40,{"$f":"INDEX(Participants,MATCH(LARGE(AlphaBeta,ROWS($1:40)),AlphaBeta,0))","v":"Sagarmatha"},{"$f":"LARGE(Score,ROWS($1:40))","v":0},null,null,null,null,null,null,null,{"$f":"J41*'Taux Ender'!$B$3+K41*'Taux Ender'!$B$4+L41*'Taux Ender'!$B$5+M41*'Taux Ender'!$B$6+N41*'Taux Ender'!$B$7+O41*'Taux Ender'!$B$8","v":0},null,15,null,150000.00099100001,null,40,{"$f":"INDEX($G$2:$G$45,MATCH(LARGE($T$2:$T$45,ROWS($1:40)),$T$2:$T$45,0))","v":"Mutos"},0]
[{"$f":"'Grille de rencontres'!A42","v":"Blacksmiths"},2,1.9950000000000001,6,null,41,{"$f":"INDEX(Participants,MATCH(LARGE(AlphaBeta,ROWS($1:41)),AlphaBeta,0))","v":"Shyria"},{"$f":"LARGE(Score,ROWS($1:41))","v":0},null,null,null,null,null,null,null,{"$f":"J42*'Taux Ender'!$B$3+K42*'Taux Ender'!$B$4+L42*'Taux Ender'!$B$5+M42*'Taux Ender'!$B$6+N42*'Taux Ender'!$B$7+O42*'Taux Ender'!$B$8","v":0},null,14,null,140000.001995,null,41,{"$f":"INDEX($G$2:$G$45,MATCH(LARGE($T$2:$T$45,ROWS($1:41)),$T$2:$T$45,0))","v":"Possom"},0]
[{"$f":"'Grille de rencontres'!A43","v":"Niamor723"},1,0.96899999999999997,22,null,42,{"$f":"INDEX(Participants,MATCH(LARGE(AlphaBeta,ROWS($1:42)),AlphaBeta,0))","v":"Tauligra"},{"$f":"LARGE(Score,ROWS($1:42))","v":0},null,null,null,null,null,null,null,{"$f":"J43*'Taux Ender'!$B$3+K43*'Taux Ender'!$B$4+L43*'Taux Ender'!$B$5+M43*'Taux Ender'!$B$6+N43*'Taux Ender'!$B$7+O43*'Taux Ender'!$B$8","v":0},null,19,null,190000.00096899999,null,42,{"$f":"INDEX($G$2:$G$45,MATCH(LARGE($T$2:$T$45,ROWS($1:42)),$T$2:$T$45,0))","v":"Batnono"},0]
[{"$f":"'Grille de rencontres'!A44","v":"Ffuj35"},0,-1.2E-2,30,null,43,{"$f":"INDEX(Participants,MATCH(LARGE(AlphaBeta,ROWS($1:43)),AlphaBeta,0))","v":"Thusane"},{"$f":"LARGE(Score,ROWS($1:43))","v":0},null,null,null,null,null,null,null,{"$f":"J44*'Taux Ender'!$B$3+K44*'Taux Ender'!$B$4+L44*'Taux Ender'!$B$5+M44*'Taux Ender'!$B$6+N44*'Taux Ender'!$B$7+O44*'Taux Ender'!$B$8","v":0},null,15,null,149999.999988,null,43,{"$f":"INDEX($G$2:$G$45,MATCH(LARGE($T$2:$T$45,ROWS($1:43)),$T$2:$T$45,0))","v":"Delapaille"},0]
[{"$f":"'Grille de rencontres'!A45","v":"Zubeldia"},2,1.956,15,null,44,{"$f":"INDEX(Participants,MATCH(LARGE(AlphaBeta,ROWS($1:44)),AlphaBeta,0))","v":"WillamK"},{"$f":"LARGE(Score,ROWS($1:44))","v":0},null,null,null,null,null,null,null,{"$f":"J45*'Taux Ender'!$B$3+K45*'Taux Ender'!$B$4+L45*'Taux Ender'!$B$5+M45*'Taux Ender'!$B$6+N45*'Taux Ender'!$B$7+O45*'Taux Ender'!$B$8","v":0},null,21,null,210000.00195599999,null,44,{"$f":"INDEX($G$2:$G$45,MATCH(LARGE($T$2:$T$45,ROWS($1:44)),$T$2:$T$45,0))","v":"Oulaoups"},0]
[]
[null,null,null,null,null,null,null,null,null,null,null,null,null,null,null,null,null,null,null,null,null,"Classement Final"]
[null,null,null,null,null,null,null,null,null,{"$f":"SUM(J2:J45)","v":5},3,6,6,15,9]

{"sheet":"Proposition","index":4,"n_rows":86,"n_cols":24,"rows_kept":86,"cut":false,"hidden":false,"merged":[[0,17,1,22],[0,23,1,23],[67,5,67,10]]}
["Participants","Score","col à masquer","Rang","Nom","Score",null,null,null,null,null,null,null,null,null,null,null,"Chateaux",null,null,null,null,null,"Pour Vérifier"]
["Kevin",2.75,{"$f":"IF(OR(A2=\"\",B2=\"\"),\"\",B2+ROWS($1:1)/10000-COUNTIF(A$2:A$8,\"<=\"&A2)/1000)","v":2.7451000000000003},{"$f":"IF(OR(A2=\"\",B2=\"\"),\"\",RANK(LARGE($B$2:$B$8,ROWS($1:1)),$B$2:$B$8,0))","v":1},{"$f":"IF(OR(A2,B2=\"\"),\"\",INDEX($A$2:$A$8,MATCH(LARGE($C$2:$C$8,ROW(A1)),$C$2:$C$8,0)))","v":"aa"},{"$f":"IF(OR(A2=\"\",B2=\"\"),\"\",INDEX(B$2:C$8,MATCH(LARGE(C$2:C$8,ROWS($1:1)),C$2:C$8,0),1))","v":2.75}]
["Britney",2.75,{"$f":"IF(OR(A3=\"\",B3=\"\"),\"\",B3+ROWS($1:2)/10000-COUNTIF(A$2:A$6,\"<=\"&A3)/1000)","v":2.7482000000000002},{"$f":"IF(OR(A3=\"\",B3=\"\"),\"\",RANK(LARGE($B$2:$B$8,ROWS($1:2)),$B$2:$B$8,0))","v":1},{"$f":"IF(OR(A3,B3=\"\"),\"\",INDEX($A$2:$A$8,MATCH(LARGE($C$2:$C$8,ROW(A2)),$C$2:$C$8,0)))","v":"Alfred"},{"$f":"IF(OR(A3=\"\",B3=\"\"),\"\",INDEX(B$2:C$8,MATCH(LARGE(C$2:C$8,ROWS($1:2)),C$2:C$8,0),1))","v":2.75},null,null,null,null,null,null,null,null,"Vainqueur","Famille",null,"A","B","C","D","E","F","Total"]
["Alfred",2.75,{"$f":"IF(OR(A4=\"\",B4=\"\"),\"\",B4+ROWS($1:3)/10000-COUNTIF(A$2:A$6,\"<=\"&A4)/1000)","v":2.7493000000000003},{"$f":"IF(OR(A4=\"\",B4=\"\"),\"\",RANK(LARGE($B$2:$B$8,ROWS($1:3)),$B$2:$B$8,0))","v":1},"Britney",{"$f":"IF(OR(A4=\"\",B4=\"\"),\"\",INDEX(B$2:C$8,MATCH(LARGE(C$2:C$8,ROWS($1:3)),C$2:C$8,0),1))","v":2.75},null,null,null,null,null,null,null,null,"Kevin","F"]
["Todd",2.5,{"$f":"IF(OR(A5=\"\",B5=\"\"),\"\",B5+ROWS($1:4)/10000-COUNTIF(A$2:A$6,\"<=\"&A5)/1000)","v":2.4954000000000001},{"$f":"IF(OR(A5=\"\",B5=\"\"),\"\",RANK(LARGE($B$2:$B$8,ROWS($1:4)),$B$2:$B$8,0))","v":1},"Julie",{"$f":"IF(OR(A5=\"\",B5=\"\"),\"\",INDEX(B$2:C$8,MATCH(LARGE(C$2:C$8,ROWS($1:4)),C$2:C$8,0),1))","v":2.75},null,null,null,null,null,null,null,null,"Julie","A"]
["Julie",2.75,{"$f":"IF(OR(A6=\"\",B6=\"\"),\"\",B6+ROWS($1:5)/10000-COUNTIF(A$2:A$6,\"<=\"&A6)/1000)","v":2.7475000000000001},{"$f":"IF(OR(A6=\"\",B6=\"\"),\"\",RANK(LARGE($B$2:$B$8,ROWS($1:5)),$B$2:$B$8,0))","v":1},"Kevin",{"$f":"IF(OR(A6=\"\",B6=\"\"),\"\",INDEX(B$2:C$8,MATCH(LARGE(C$2:C$8,ROWS($1:5)),C$2:C$8,0),1))","v":2.75},null,null,null,null,null,null,null,null,"Kevin","D"]
["aa",2.75,{"$f":"IF(OR(A7=\"\",B7=\"\"),\"\",B7+ROWS($1:6)/10000-COUNTIF(A$2:A$6,\"<=\"&A7)/1000)","v":2.7505999999999999},{"$f":"IF(OR(A7=\"\",B7=\"\"),\"\",RANK(LARGE($B$2:$B$8,ROWS($1:6)),$B$2:$B$8,0))","v":6},"Todd",{"$f":"IF(OR(A7=\"\",B7=\"\"),\"\",INDEX(B$2:C$8,MATCH(LARGE(C$2:C$8,ROWS($1:6)),C$2:C$8,0),1))","v":2.5},null,null,null,null,null,null,null,null,"Alfred","E"]
[null,null,{"$f":"IF(OR(A8=\"\",B8=\"\"),\"\",B8+ROWS($1:7)/10000-COUNTIF(A$2:A$6,\"<=\"&A8)/1000)","v":""},{"$f":"IF(OR(A8=\"\",B8=\"\"),\"\",RANK(LARGE($B$2:$B$8,ROWS($1:7)),$B$2:$B$8,0))","v":""},"",{"$f":"IF(OR(A8=\"\",B8=\"\"),\"\",INDEX(B$2:C$8,MATCH(LARGE(C$2:C$8,ROWS($1:7)),C$2:C$8,0),1))","v":""},null,null,null,null,null,null,null,null,"Kevin","B"]
[null,null,null,null,null,null,null,null,null,null,null,null,null,null,"Todd","C"]
[null,null,null,null,null,null,null,null,null,null,null,null,null,null,"Julie","F"]
[null,null,null,null,null,null,null,null,null,null,null,null,null,null,"Britney","F"]
[null,null,null,null,null,null,null,null,null,null,null,null,null,null,"Britney","B"]
[null,"Nb.si(a$2:a$8; avec le critère inférieur ou égal à la cellule a2) donne le rang alphabétique de la cellule A2 dans la plage A2:A8",null,null,null,null,null,null,null,null,null,null,null,null,"aa","E"]
[null,null,"le rang divisé par 1000 est oté du score initial ;en le rajoutant les égalités seraient classées par ordre alpha inverse"]
[{"$f":"\"Rang alpha \"&A2&\"     >\"","v":"Rang alpha Kevin     >"},{"$f":"COUNTIF(A$2:A$8,\"<=\"&A2)","v":5},{"$f":"B15/1000","v":5.0000000000000001E-3}]
[{"$f":"\"Rang alpha \"&A3&\"     >\"","v":"Rang alpha Britney     >"},{"$f":"COUNTIF(A$2:A$8,\"<=\"&A3)","v":3},{"$f":"B16/1000","v":3.0000000000000001E-3}]
["Rang alpha Alfred     >",2,2E-3]
["Rang alpha Todd     >",6,6.0000000000000001E-3]
["Rang alpha Julie     >",4,4.0000000000000001E-3]
["Rang alpha aa     >",1,1E-3]
["Rang alpha      >",0,0]
[null,null,"le diviseur de la valeur du nom est inférieur à celui des lignes pour qu'il est priorité"]
[]
[]
[]
[]
[]
[]
[]
["Participants","Score","Colonne","Rang","Participant","Score",null,"A","B","C","D","E","F","Score",null,"Rang","Participant","Score","Parties Terminées"]
["Kevin",{"$f":"COUNTIF($O$4:$O$13,A31)","v":3},{"$f":"B31-COUNTIF($A$31:$A$36,\"<=\"&A31)/1000","v":2.9950000000000001},{"$f":"RANK(LARGE($B$31:$B$36,ROWS($1:1)),$B$31:$B$36,0)","v":1},{"$f":"INDEX($A$31:$A$36,MATCH(LARGE($C$31:$C$36,ROWS($1:1)),$C$31:$C$36,0))","v":"Kevin"},{"$f":"LARGE($B$31:$B$36,ROWS($1:1))","v":3},null,{"$f":"COUNTIFS($O$4:$O$13,$E31,$P$4:$P$13,H$30)","v":0},{"$f":"COUNTIFS($O$4:$O$13,$E31,$P$4:$P$13,I$30)","v":1},0,1,0,1,{"$f":"F31*10^7+H31*10^6+I31*10^5+J31*10^4+K31*10^3+L31*10^2+M31*10^1-COUNTIF($E$31:$E$36,\"<=\"&E31)","v":30101005},null,{"$f":"D31","v":1},{"$f":"INDEX($E$31:$E$36,MATCH(LARGE($N$31:$N$36,ROWS($1:1)),$N$31:$N$36,0))","v":"Kevin"}]
["Britney",2,{"$f":"B32-COUNTIF($A$31:$A$36,\"<=\"&A32)/1000","v":1.9970000000000001},{"$f":"RANK(LARGE($B$31:$B$36,ROWS($1:2)),$B$31:$B$36,0)","v":2},{"$f":"INDEX($A$31:$A$36,MATCH(LARGE($C$31:$C$36,ROWS($1:2)),$C$31:$C$36,0))","v":"Britney"},{"$f":"LARGE($B$31:$B$36,ROWS($1:2))","v":2},null,0,1,0,0,0,1,20100007,null,2,{"$f":"INDEX($E$31:$E$36,MATCH(LARGE($N$31:$N$36,ROWS($1:2)),$N$31:$N$36,0))","v":"Julie"}]
["Alfred",1,{"$f":"B33-COUNTIF($A$31:$A$36,\"<=\"&A33)/1000","v":0.998},{"$f":"RANK(LARGE($B$31:$B$36,ROWS($1:3)),$B$31:$B$36,0)","v":2},{"$f":"INDEX($A$31:$A$36,MATCH(LARGE($C$31:$C$36,ROWS($1:3)),$C$31:$C$36,0))","v":"Julie"},{"$f":"LARGE($B$31:$B$36,ROWS($1:3))","v":2},null,1,0,0,0,0,1,21000006,null,2,{"$f":"INDEX($E$31:$E$36,MATCH(LARGE($N$31:$N$36,ROWS($1:3)),$N$31:$N$36,0))","v":"Britney"}]
["Todd",1,0.99399999999999999,{"$f":"RANK(LARGE($B$31:$B$36,ROWS($1:4)),$B$31:$B$36,0)","v":4},{"$f":"INDEX($A$31:$A$36,MATCH(LARGE($C$31:$C$36,ROWS($1:4)),$C$31:$C$36,0))","v":"aa"},{"$f":"LARGE($B$31:$B$36,ROWS($1:4))","v":1},null,0,0,0,0,1,0,10000099,null,4,{"$f":"INDEX($E$31:$E$36,MATCH(LARGE($N$31:$N$36,ROWS($1:4)),$N$31:$N$36,0))","v":"Todd"}]
["Julie",2,1.996,{"$f":"RANK(LARGE($B$31:$B$36,ROWS($1:5)),$B$31:$B$36,0)","v":4},{"$f":"INDEX($A$31:$A$36,MATCH(LARGE($C$31:$C$36,ROWS($1:5)),$C$31:$C$36,0))","v":"Alfred"},{"$f":"LARGE($B$31:$B$36,ROWS($1:5))","v":1},null,0,0,0,0,1,0,10000098,null,4,{"$f":"INDEX($E$31:$E$36,MATCH(LARGE($N$31:$N$36,ROWS($1:5)),$N$31:$N$36,0))","v":"aa"}]
["aa",1,0.999,{"$f":"RANK(LARGE($B$31:$B$36,ROWS($1:6)),$B$31:$B$36,0)","v":4},{"$f":"INDEX($A$31:$A$36,MATCH(LARGE($C$31:$C$36,ROWS($1:6)),$C$31:$C$36,0))","v":"Todd"},{"$f":"LARGE($B$31:$B$36,ROWS($1:6))","v":1},null,0,0,1,0,0,0,10009994,null,4,{"$f":"INDEX($E$31:$E$36,MATCH(LARGE($N$31:$N$36,ROWS($1:6)),$N$31:$N$36,0))","v":"Alfred"}]
[]
[]
[]
[]
[]
[]
[]
[]
[]
[]
[]
[]
[]
[null,null,null,null,null,null,"Kevin","Julie",null,1,6,null,null,{"$f":"SUMIF(G50:H52,G50,J50:K52)","v":6}]
[null,null,null,null,null,null,"Britney","Kevin",null,2,5]
[null,null,null,null,null,null,"Alfred","Julie",null,3,4]
[]
[]
[]
[]
[]
[]
[]
[]
[]
[]
[]
[]
[null,null,null,null,null,"A vérifier","PB ENTRE 3 ET 4 "]
[]
[]
[null,null,null,null,null,"Finale"]
[null,null,null,null,null,"T","L","M","B","S","G"]
[null,null,null,null,null,6,4,2,5,3,1,null,1]
[null,null,null,null,null,1,3,4,2,6,5,null,2]
[null,null,null,null,null,3,1,6,4,5,2,null,3]
[null,null,null,null,null,2,5,1,6,4,3,null,4]
[null,null,null,null,null,5,6,3,1,2,4,null,5]
[null,null,null,null,null,4,2,5,3,1,6,null,6]
[]
[]
[]
[]
[]
[null,null,null,null,null,null,null,null,"S","T et M"]
[null,null,null,null,null,null,null,null,"G ","T, M et B"]
[null,null,null,null,null,null,null,null,"L","M et S"]
[null,null,null,null,null,null,null,null,"B","G"]
[null,null,null,null,null,null,null,null,"T","G et S"]
[null,null,null,null,null,null,null,null,"M ","G, S et L"]