{"text_format":"1","workbook":"xlsx","n_sheets":3,"sheets":["Date Traditionnel","Traditionnel","Chinois"],"not_rendered":{"charts":0,"images":0,"macros":1,"external_links":0,"defined_names":2,"comments":0,"pivot_tables":0},"unopened":[],"bounds":{"document_bytes":16777216,"sheet_cells":100000,"rows_first":2000,"rows_last":500,"rows_between":2000,"halvings":0,"cell_chars":16384,"cell_head_chars":4096},"cells_cut":0,"cells_raw":0,"read":"whole","date_system":"1900"}

{"sheet":"Date Traditionnel","index":0,"n_rows":4,"n_cols":3,"rows_kept":4,"cut":false,"hidden":false,"merged":[]}
["Date de naissance:",null,"2015-04-12"]
[]
[]
["Signe :",{"$f":"VLOOKUP(MIN(Traditionnel!E2:E13),Traditionnel!E2:F13,2,FALSE)","v":"Belier"}]

{"sheet":"Traditionnel","index":1,"n_rows":13,"n_cols":6,"rows_kept":13,"cut":false,"hidden":false,"merged":[]}
["Date: début","fin",null,null,null,"Signe"]
["2015-12-22","2015-01-19",{"$f":"ABS(DAYS360(A2,'Date Traditionnel'!$C$1,1))","v":250},{"$f":"ABS(DAYS360(B2,'Date Traditionnel'!$C$1,1))","v":83},{"$f":"MIN(C2,D2)","v":83},"Capricorne"]
["2015-01-20","2015-02-19",{"$f":"ABS(DAYS360(A3,'Date Traditionnel'!$C$1,1))","v":82},{"$f":"ABS(DAYS360(B3,'Date Traditionnel'!$C$1,1))","v":53},{"$f":"MIN(C3,D3)","v":53},"Verseau"]
["2015-02-20","2015-03-20",{"$f":"ABS(DAYS360(A4,'Date Traditionnel'!$C$1,1))","v":52},{"$f":"ABS(DAYS360(B4,'Date Traditionnel'!$C$1,1))","v":22},{"$f":"MIN(C4,D4)","v":22},"Poissons"]
["2015-03-21","2015-04-19",{"$f":"ABS(DAYS360(A5,'Date Traditionnel'!$C$1,1))","v":21},{"$f":"ABS(DAYS360(B5,'Date Traditionnel'!$C$1,1))","v":7},7,"Belier"]
["2015-04-20","2015-05-21",{"$f":"ABS(DAYS360(A6,'Date Traditionnel'!$C$1,1))","v":8},{"$f":"ABS(DAYS360(B6,'Date Traditionnel'!$C$1,1))","v":39},8,"Taureau"]
["2015-05-22","2015-06-21",{"$f":"ABS(DAYS360(A7,'Date Traditionnel'!$C$1,1))","v":40},{"$f":"ABS(DAYS360(B7,'Date Traditionnel'!$C$1,1))","v":69},40,"Gemeaux"]
["2015-06-22","2015-07-22",{"$f":"ABS(DAYS360(A8,'Date Traditionnel'!$C$1,1))","v":70},{"$f":"ABS(DAYS360(B8,'Date Traditionnel'!$C$1,1))","v":100},70,"Cancer"]
["2015-07-23","2015-08-22",{"$f":"ABS(DAYS360(A9,'Date Traditionnel'!$C$1,1))","v":101},{"$f":"ABS(DAYS360(B9,'Date Traditionnel'!$C$1,1))","v":130},101,"Lion"]
["2015-08-23","2015-09-22",{"$f":"ABS(DAYS360(A10,'Date Traditionnel'!$C$1,1))","v":131},{"$f":"ABS(DAYS360(B10,'Date Traditionnel'!$C$1,1))","v":160},131,"Vierge"]
["2015-09-23","2015-10-22",{"$f":"ABS(DAYS360(A11,'Date Traditionnel'!$C$1,1))","v":161},{"$f":"ABS(DAYS360(B11,'Date Traditionnel'!$C$1,1))","v":190},161,"Balance"]
["2015-10-23","2015-11-22",{"$f":"ABS(DAYS360(A12,'Date Traditionnel'!$C$1,1))","v":191},{"$f":"ABS(DAYS360(B12,'Date Traditionnel'!$C$1,1))","v":220},191,"Scorpion"]
["2015-11-23","2015-12-21",{"$f":"ABS(DAYS360(A13,'Date Traditionnel'!$C$1,1))","v":221},{"$f":"ABS(DAYS360(B13,'Date Traditionnel'!$C$1,1))","v":249},221,"Sagittaire"]

{"sheet":"Chinois","index":2,"n_rows":12,"n_cols":10,"rows_kept":12,"cut":false,"hidden":false,"merged":[]}
["Lapin-Lievre-Chat",1915,1927,1939,1951,1963,1975,1987,1999,2011]
["Dragon",1916,1928,1940,1952,1964,1976,1988,2000,2012]
["Serpent",1917,1929,1941,1953,1965,1977,1989,2001,2013]
["Cheval",1918,1930,1942,1954,1966,1978,1990,2002,2014]
["Chevre",1919,1931,1943,1955,1967,1979,1991,2003,2015]
["Singe",1920,1932,1944,1956,1968,1980,1992,2004,2016]
["Coq",1921,1933,1945,1957,1969,1981,1993,2005]
["Chien",1922,1934,1946,1958,1970,1982,1994,2006]
["Cochon-Sanglier-Ours",1923,1935,1947,1959,1971,1983,1995,2007]
["Rat",1924,1936,1948,1960,1972,1984,1996,2008]
["Buffle-Boeuf",1925,1937,1949,1961,1973,1985,1997,2009]
["Tigre",1926,1938,1950,1962,1974,1986,1998,2010]