{"text_format":"1","workbook":"xlsx","n_sheets":3,"sheets":["Match allez 1","Match retour","Classement"],"not_rendered":{"charts":0,"images":0,"macros":1,"external_links":0,"defined_names":2,"comments":0,"pivot_tables":0},"unopened":[],"bounds":{"document_bytes":16777216,"sheet_cells":100000,"rows_first":2000,"rows_last":500,"rows_between":2000,"halvings":0,"cell_chars":16384,"cell_head_chars":4096},"cells_cut":0,"cells_raw":0,"read":"whole","date_system":"1900"}

{"sheet":"Match allez 1","index":0,"n_rows":187,"n_cols":21,"rows_kept":187,"cut":false,"hidden":false,"merged":[[0,0,0,2],[1,0,1,2],[2,4,2,9],[2,11,2,14],[20,4,20,9]]}
["TOURNOI FIFA DEALABS - PS4"]
["COMMUNAUTE : FIFALABS"]
[null,null,null,null,"CLASSEMENT FORMULES",null,null,null,null,null,null,"Résultats"]
["Pseudo Dealabs","ID PSN","Equipe",null,"Equipe","Points","Match joués","Buts pour","Buts contre","Goal Average",null,"Equipe 1","Score 1","Score 2","Equipe 2"]
["Aurelson","aurelson","Braga",null,"Braga",{"$f":"SUM(U5:U15)","v":1},{"$f":"11-COUNTBLANK(M5:M15)","v":4},{"$f":"SUM(M5:M15)","v":5},{"$f":"SUM(N5:N15)","v":8},{"$f":"H5-I5","v":-3},null,"Braga",null,null,"Southampton",null,{"$f":"IF(M5>N5,3,0)","v":0},{"$f":"IF(M5=\"\",0,IF(M5=N5,1,0))","v":0},{"$f":"IF(N5>M5,6,0)","v":0},{"$f":"IF(M5=\"\",0,SUM(Q5:S5))","v":0},{"$f":"VLOOKUP(T5,Classement!$B$2:$C$7,2,0)","v":0}]
["Alexpulsion","Alexpulsion","Southampton",null,"Southampton",{"$f":"SUM(U16:U26)","v":2},{"$f":"11-COUNTBLANK(M16:M26)","v":2},{"$f":"SUM(M16:M26)","v":4},{"$f":"SUM(N16:N26)","v":4},0,null,"Braga",null,null,"Fiorentina",null,{"$f":"IF(M6>N6,3,0)","v":0},{"$f":"IF(M6=\"\",0,IF(M6=N6,1,0))","v":0},{"$f":"IF(N6>M6,6,0)","v":0},{"$f":"IF(M6=\"\",0,SUM(Q6:S6))","v":0},{"$f":"VLOOKUP(T6,Classement!$B$2:$C$7,2,0)","v":0}]
["Alexnanie","Diego-Alexis","Fiorentina",null,"Fiorentina",{"$f":"SUM(U27:U37)","v":9},{"$f":"11-COUNTBLANK(M27:M37)","v":4},{"$f":"SUM(M27:M37)","v":6},{"$f":"SUM(N27:N37)","v":6},0,null,"Braga",2,3,"Celta Vigo",null,0,0,6,6,{"$f":"VLOOKUP(T7,Classement!$B$2:$C$7,2,0)","v":0}]
["Roazhon91","Briand35000","Celta Vigo",null,"Celta Vigo",{"$f":"SUM(U38:U48)","v":10},{"$f":"11-COUNTBLANK(M38:M48)","v":7},{"$f":" SUM(M38:M48)","v":13},{"$f":"SUM(N38:N48)","v":10},3,null,"Braga",1,2,"Torino",null,0,0,6,6,{"$f":"VLOOKUP(T8,Classement!$B$2:$C$7,2,0)","v":0}]
["Toophe","Toophe","Torino",null,"Torino",{"$f":"SUM(U49:U59)","v":9},{"$f":"11-COUNTBLANK(M49:M59)","v":3},{"$f":" SUM(M49:M59)","v":4},{"$f":"SUM(N49:N59)","v":1},3,null,"Braga",null,null,"Werder",null,0,0,0,0,{"$f":"VLOOKUP(T9,Classement!$B$2:$C$7,2,0)","v":0}]
["Fabien59190","Fabien59390","Werder",null,"Werder",{"$f":"SUM(U60:U70)","v":3},{"$f":"11-COUNTBLANK(M60:M70)","v":2},{"$f":" SUM(M60:M70)","v":3},{"$f":"SUM(N60:N70)","v":4},-1,null,"Braga",1,1,"St etienne",null,0,1,0,1,{"$f":"VLOOKUP(T10,Classement!$B$2:$C$7,2,0)","v":1}]
["Astha","astharoth-666","St etienne",null,"St etienne",{"$f":"SUM(U71:U81)","v":7},{"$f":"11-COUNTBLANK(M71:M81)","v":4},{"$f":" SUM(M71:M81)","v":7},{"$f":"SUM(N71:N81)","v":4},3,null,"Braga",null,null,"Nice",null,0,0,0,0,{"$f":"VLOOKUP(T11,Classement!$B$2:$C$7,2,0)","v":0}]
["Rasmus","cyber-soc","Nice",null,"Nice",{"$f":"SUM(U82:U92)","v":0},{"$f":"11-COUNTBLANK(M82:M92)","v":3},{"$f":" SUM(M82:M92)","v":2},{"$f":"SUM(N82:N92)","v":10},-8,null,"Braga",1,2,"Swansea",null,0,0,6,6,{"$f":"VLOOKUP(T12,Classement!$B$2:$C$7,2,0)","v":0}]
["Guizmo35","Guizmo_35","Swansea",null,"Swansea",{"$f":"SUM(U93:U103)","v":11},{"$f":"11-COUNTBLANK(M93:M103)","v":6},{"$f":" SUM(M93:M103)","v":16},{"$f":"SUM(N93:N103)","v":7},9,null,"Braga",null,null,"Cologne",null,0,0,0,0,{"$f":"VLOOKUP(T13,Classement!$B$2:$C$7,2,0)","v":0}]
["HamtaroJoly",null,"Cologne",null,"Cologne",{"$f":"SUM(U104:U114)","v":0},{"$f":"11-COUNTBLANK(M104:M114)","v":0},{"$f":" SUM(M104:M114)","v":0},{"$f":"SUM(N104:N114)","v":0},0,null,"Braga",null,null,"Real Sociedad ",null,0,0,0,0,{"$f":"VLOOKUP(T14,Classement!$B$2:$C$7,2,0)","v":0}]
["Manuinho"," Manuinho35","Real Sociedad ",null,"Real Sociedad ",{"$f":"SUM(U115:U125)","v":4},{"$f":"11-COUNTBLANK(M115:M125)","v":2},{"$f":" SUM(M115:M125)","v":3},{"$f":"SUM(N115:N125)","v":2},1,null,"Braga",null,null,"Club Bruges",null,0,0,0,0,{"$f":"VLOOKUP(T15,Classement!$B$2:$C$7,2,0)","v":0}]
["Douda68","voegtldo","Club Bruges",null,"Club Bruges",{"$f":"SUM(U126:U136)","v":2},{"$f":"11-COUNTBLANK(M126:M136)","v":5},{"$f":" SUM(M126:M136)","v":4},{"$f":"SUM(N126:N136)","v":11},-7,null,"Southampton",null,null,"Fiorentina",null,{"$f":"IF(M16>N16,3,0)","v":0},{"$f":"IF(M16=\"\",0,IF(M16=N16,1,0))","v":0},{"$f":"IF(N16>M16,6,0)","v":0},{"$f":"IF(M16=\"\",0,SUM(Q16:S16))","v":0},{"$f":"VLOOKUP(T16,Classement!$B$2:$C$7,2,0)","v":0}]
[null,null,null,null,null,null,null,null,null,null,null,"Southampton",null,null,"Celta Vigo",null,{"$f":"IF(M17>N17,3,0)","v":0},{"$f":"IF(M17=\"\",0,IF(M17=N17,1,0))","v":0},{"$f":"IF(N17>M17,6,0)","v":0},{"$f":"IF(M17=\"\",0,SUM(Q17:S17))","v":0},{"$f":"VLOOKUP(T17,Classement!$B$2:$C$7,2,0)","v":0}]
[null,null,null,null,null,null,null,null,null,null,null,"Southampton",null,null,"Torino",null,{"$f":"IF(M18>N18,3,0)","v":0},{"$f":"IF(M18=\"\",0,IF(M18=N18,1,0))","v":0},{"$f":"IF(N18>M18,6,0)","v":0},{"$f":"IF(M18=\"\",0,SUM(Q18:S18))","v":0},{"$f":"VLOOKUP(T18,Classement!$B$2:$C$7,2,0)","v":0}]
[null,null,null,null,null,null,null,null,null,null,null,"Southampton",null,null,"Werder",null,{"$f":"IF(M19>N19,3,0)","v":0},{"$f":"IF(M19=\"\",0,IF(M19=N19,1,0))","v":0},{"$f":"IF(N19>M19,6,0)","v":0},{"$f":"IF(M19=\"\",0,SUM(Q19:S19))","v":0},{"$f":"VLOOKUP(T19,Classement!$B$2:$C$7,2,0)","v":0}]
[null,null,null,null,null,null,null,null,null,null,null,"Southampton",null,null,"St etienne",null,{"$f":"IF(M20>N20,3,0)","v":0},{"$f":"IF(M20=\"\",0,IF(M20=N20,1,0))","v":0},{"$f":"IF(N20>M20,6,0)","v":0},{"$f":"IF(M20=\"\",0,SUM(Q20:S20))","v":0},{"$f":"VLOOKUP(T20,Classement!$B$2:$C$7,2,0)","v":0}]
[null,null,null,null,"CLASSEMENT",null,null,null,null,null,null,"Southampton",null,null,"Nice",null,{"$f":"IF(M21>N21,3,0)","v":0},{"$f":"IF(M21=\"\",0,IF(M21=N21,1,0))","v":0},{"$f":"IF(N21>M21,6,0)","v":0},{"$f":"IF(M21=\"\",0,SUM(Q21:S21))","v":0},{"$f":"VLOOKUP(T21,Classement!$B$2:$C$7,2,0)","v":0}]
[null,null,null,null,"Equipe","Points","Match joués","Buts pour","Buts contre","Goal Average",null,"Southampton",2,2,"Swansea",null,{"$f":"IF(M22>N22,3,0)","v":0},{"$f":"IF(M22=\"\",0,IF(M22=N22,1,0))","v":1},{"$f":"IF(N22>M22,6,0)","v":0},{"$f":"IF(M22=\"\",0,SUM(Q22:S22))","v":1},{"$f":"VLOOKUP(T22,Classement!$B$2:$C$7,2,0)","v":1}]
[null,null,null,null,"Braga",null,null,null,null,null,null,"Southampton",null,null,"Cologne",null,{"$f":"IF(M23>N23,3,0)","v":0},{"$f":"IF(M23=\"\",0,IF(M23=N23,1,0))","v":0},{"$f":"IF(N23>M23,6,0)","v":0},{"$f":"IF(M23=\"\",0,SUM(Q23:S23))","v":0},{"$f":"VLOOKUP(T23,Classement!$B$2:$C$7,2,0)","v":0}]
[null,null,null,null,"Southampton",null,null,null,null,null,null,"Southampton",null,null,"Real Sociedad ",null,{"$f":"IF(M24>N24,3,0)","v":0},{"$f":"IF(M24=\"\",0,IF(M24=N24,1,0))","v":0},{"$f":"IF(N24>M24,6,0)","v":0},{"$f":"IF(M24=\"\",0,SUM(Q24:S24))","v":0},{"$f":"VLOOKUP(T24,Classement!$B$2:$C$7,2,0)","v":0}]
[null,null,null,null,"Fiorentina",null,null,null,null,null,null,"Southampton",2,2,"Club Bruges",null,{"$f":"IF(M25>N25,3,0)","v":0},{"$f":"IF(M25=\"\",0,IF(M25=N25,1,0))","v":1},{"$f":"IF(N25>M25,6,0)","v":0},{"$f":"IF(M25=\"\",0,SUM(Q25:S25))","v":1},{"$f":"VLOOKUP(T25,Classement!$B$2:$C$7,2,0)","v":1}]
[null,null,null,null,"Celta Vigo",null,null,null,null,null,null,"Southampton",null,null,"Braga",null,{"$f":"IF(M26>N26,3,0)","v":0},{"$f":"IF(M26=\"\",0,IF(M26=N26,1,0))","v":0},{"$f":"IF(N26>M26,6,0)","v":0},{"$f":"IF(M26=\"\",0,SUM(Q26:S26))","v":0},{"$f":"VLOOKUP(T26,Classement!$B$2:$C$7,2,0)","v":0}]
[null,null,null,null,"Torino",null,null,null,null,null,null,"Fiorentina",1,0,"Celta Vigo",null,{"$f":"IF(M27>N27,3,0)","v":3},{"$f":"IF(M27=\"\",0,IF(M27=N27,1,0))","v":0},{"$f":"IF(N27>M27,6,0)","v":0},{"$f":"IF(M27=\"\",0,SUM(Q27:S27))","v":3},{"$f":"VLOOKUP(T27,Classement!$B$2:$C$7,2,0)","v":3}]
[null,null,null,null,"Werder",null,null,null,null,null,null,"Fiorentina",null,null,"Torino",null,{"$f":"IF(M28>N28,3,0)","v":0},{"$f":"IF(M28=\"\",0,IF(M28=N28,1,0))","v":0},{"$f":"IF(N28>M28,6,0)","v":0},{"$f":"IF(M28=\"\",0,SUM(Q28:S28))","v":0},{"$f":"VLOOKUP(T28,Classement!$B$2:$C$7,2,0)","v":0}]
[null,null,null,null,"St etienne",null,null,null,null,null,null,"Fiorentina",null,null,"Werder",null,{"$f":"IF(M29>N29,3,0)","v":0},{"$f":"IF(M29=\"\",0,IF(M29=N29,1,0))","v":0},{"$f":"IF(N29>M29,6,0)","v":0},{"$f":"IF(M29=\"\",0,SUM(Q29:S29))","v":0},{"$f":"VLOOKUP(T29,Classement!$B$2:$C$7,2,0)","v":0}]
[null,null,null,null,"Nice",null,null,null,null,null,null,"Fiorentina",null,null,"St etienne",null,{"$f":"IF(M30>N30,3,0)","v":0},{"$f":"IF(M30=\"\",0,IF(M30=N30,1,0))","v":0},{"$f":"IF(N30>M30,6,0)","v":0},{"$f":"IF(M30=\"\",0,SUM(Q30:S30))","v":0},{"$f":"VLOOKUP(T30,Classement!$B$2:$C$7,2,0)","v":0}]
{"$rows_left_out":158}
{"sheet":"Match retour","index":1,"n_rows":187,"n_cols":21,"rows_kept":187,"cut":false,"hidden":false,"merged":[[2,11,2,14],[2,4,2,9],[0,0,0,2],[1,0,1,2],[20,4,20,9]]}
["TOURNOI FIFA DEALABS - PS4"]
["COMMUNAUTE : FIFALABS"]
[null,null,null,null,"CLASSEMENT FORMULES",null,null,null,null,null,null,"Résultats"]
["Pseudo Dealabs","ID PSN","Equipe",null,"Equipe","Points","Match joués","Buts pour","Buts contre","Goal Average",null,"Equipe 1","Score 1","Score 2","Equipe 2"]
["Aurelson","aurelson","Braga",null,"Braga",{"$f":"SUM(U5:U15)","v":3},{"$f":"11-COUNTBLANK(M5:M15)","v":2},{"$f":"SUM(M5:M15)","v":1},{"$f":"SUM(N5:N15)","v":4},{"$f":"H5-I5","v":-3},null,"Braga",null,null,"Southampton",null,{"$f":"IF(M5>N5,3,0)","v":0},{"$f":"IF(M5=\"\",0,IF(M5=N5,1,0))","v":0},{"$f":"IF(N5>M5,6,0)","v":0},{"$f":"IF(M5=\"\",0,SUM(Q5:S5))","v":0},{"$f":"VLOOKUP(T5,Classement!$B$2:$C$7,2,0)","v":0}]
["Alexpulsion","Alexpulsion","Southampton",null,"Southampton",{"$f":"SUM(U16:U26)","v":0},{"$f":"11-COUNTBLANK(M16:M26)","v":1},{"$f":"SUM(M16:M26)","v":1},{"$f":"SUM(N16:N26)","v":2},-1,null,"Braga",null,null,"Fiorentina",null,{"$f":"IF(M6>N6,3,0)","v":0},{"$f":"IF(M6=\"\",0,IF(M6=N6,1,0))","v":0},{"$f":"IF(N6>M6,6,0)","v":0},{"$f":"IF(M6=\"\",0,SUM(Q6:S6))","v":0},{"$f":"VLOOKUP(T6,Classement!$B$2:$C$7,2,0)","v":0}]
["Alexnanie","Diego-Alexis","Fiorentina",null,"Fiorentina",{"$f":"SUM(U27:U37)","v":7},{"$f":"11-COUNTBLANK(M27:M37)","v":3},{"$f":"SUM(M27:M37)","v":5},{"$f":"SUM(N27:N37)","v":2},3,null,"Braga",null,null,"Celta Vigo",null,0,0,0,0,{"$f":"VLOOKUP(T7,Classement!$B$2:$C$7,2,0)","v":0}]
["Roazhon91","Briand35000","Celta Vigo",null,"Celta Vigo",{"$f":"SUM(U38:U48)","v":8},{"$f":"11-COUNTBLANK(M38:M48)","v":5},{"$f":" SUM(M38:M48)","v":10},{"$f":"SUM(N38:N48)","v":6},4,null,"Braga",null,null,"Torino",null,0,0,0,0,{"$f":"VLOOKUP(T8,Classement!$B$2:$C$7,2,0)","v":0}]
["Toophe","Toophe","Torino",null,"Torino",{"$f":"SUM(U49:U59)","v":1},{"$f":"11-COUNTBLANK(M49:M59)","v":1},{"$f":" SUM(M49:M59)","v":2},{"$f":"SUM(N49:N59)","v":2},0,null,"Braga",null,null,"Werder",null,0,0,0,0,{"$f":"VLOOKUP(T9,Classement!$B$2:$C$7,2,0)","v":0}]
["Fabien59190","Fabien59390","Werder",null,"Werder",{"$f":"SUM(U60:U70)","v":0},{"$f":"11-COUNTBLANK(M60:M70)","v":2},{"$f":" SUM(M60:M70)","v":2},{"$f":"SUM(N60:N70)","v":8},-6,null,"Braga",1,0,"St etienne",null,3,0,0,3,{"$f":"VLOOKUP(T10,Classement!$B$2:$C$7,2,0)","v":3}]
["Astha","astharoth-666","St etienne",null,"St etienne",{"$f":"SUM(U71:U81)","v":7},{"$f":"11-COUNTBLANK(M71:M81)","v":4},{"$f":" SUM(M71:M81)","v":4},{"$f":"SUM(N71:N81)","v":2},2,null,"Braga",null,null,"Nice",null,0,0,0,0,{"$f":"VLOOKUP(T11,Classement!$B$2:$C$7,2,0)","v":0}]
["Rasmus","cyber-soc","Nice",null,"Nice",{"$f":"SUM(U82:U92)","v":1},{"$f":"11-COUNTBLANK(M82:M92)","v":1},{"$f":" SUM(M82:M92)","v":1},{"$f":"SUM(N82:N92)","v":1},0,null,"Braga",0,4,"Swansea",null,0,0,6,6,{"$f":"VLOOKUP(T12,Classement!$B$2:$C$7,2,0)","v":0}]
["Guizmo35","Guizmo_35","Swansea",null,"Swansea",{"$f":"SUM(U93:U103)","v":8},{"$f":"11-COUNTBLANK(M93:M103)","v":4},{"$f":" SUM(M93:M103)","v":7},{"$f":"SUM(N93:N103)","v":0},7,null,"Braga",null,null,"Cologne",null,0,0,0,0,{"$f":"VLOOKUP(T13,Classement!$B$2:$C$7,2,0)","v":0}]
["HamtaroJoly",null,"Cologne",null,"Cologne",{"$f":"SUM(U104:U114)","v":0},{"$f":"11-COUNTBLANK(M104:M114)","v":0},{"$f":" SUM(M104:M114)","v":0},{"$f":"SUM(N104:N114)","v":0},0,null,"Braga",null,null,"Real Sociedad ",null,0,0,0,0,{"$f":"VLOOKUP(T14,Classement!$B$2:$C$7,2,0)","v":0}]
["Manuinho"," Manuinho35","Real Sociedad ",null,"Real Sociedad ",{"$f":"SUM(U115:U125)","v":1},{"$f":"11-COUNTBLANK(M115:M125)","v":2},{"$f":" SUM(M115:M125)","v":2},{"$f":"SUM(N115:N125)","v":3},-1,null,"Braga",null,null,"Club Bruges",null,0,0,0,0,{"$f":"VLOOKUP(T15,Classement!$B$2:$C$7,2,0)","v":0}]
["Douda68","voegtldo","Club Bruges",null,"Club Bruges",{"$f":"SUM(U126:U136)","v":4},{"$f":"11-COUNTBLANK(M126:M136)","v":5},{"$f":" SUM(M126:M136)","v":3},{"$f":"SUM(N126:N136)","v":8},-5,null,"Southampton",null,null,"Fiorentina",null,{"$f":"IF(M16>N16,3,0)","v":0},{"$f":"IF(M16=\"\",0,IF(M16=N16,1,0))","v":0},{"$f":"IF(N16>M16,6,0)","v":0},{"$f":"IF(M16=\"\",0,SUM(Q16:S16))","v":0},{"$f":"VLOOKUP(T16,Classement!$B$2:$C$7,2,0)","v":0}]
[null,null,null,null,null,null,null,null,null,null,null,"Southampton",null,null,"Celta Vigo",null,{"$f":"IF(M17>N17,3,0)","v":0},{"$f":"IF(M17=\"\",0,IF(M17=N17,1,0))","v":0},{"$f":"IF(N17>M17,6,0)","v":0},{"$f":"IF(M17=\"\",0,SUM(Q17:S17))","v":0},{"$f":"VLOOKUP(T17,Classement!$B$2:$C$7,2,0)","v":0}]
[null,null,null,null,null,null,null,null,null,null,null,"Southampton",null,null,"Torino",null,{"$f":"IF(M18>N18,3,0)","v":0},{"$f":"IF(M18=\"\",0,IF(M18=N18,1,0))","v":0},{"$f":"IF(N18>M18,6,0)","v":0},{"$f":"IF(M18=\"\",0,SUM(Q18:S18))","v":0},{"$f":"VLOOKUP(T18,Classement!$B$2:$C$7,2,0)","v":0}]
[null,null,null,null,null,null,null,null,null,null,null,"Southampton",null,null,"Werder",null,{"$f":"IF(M19>N19,3,0)","v":0},{"$f":"IF(M19=\"\",0,IF(M19=N19,1,0))","v":0},{"$f":"IF(N19>M19,6,0)","v":0},{"$f":"IF(M19=\"\",0,SUM(Q19:S19))","v":0},{"$f":"VLOOKUP(T19,Classement!$B$2:$C$7,2,0)","v":0}]
[null,null,null,null,null,null,null,null,null,null,null,"Southampton",null,null,"St etienne",null,{"$f":"IF(M20>N20,3,0)","v":0},{"$f":"IF(M20=\"\",0,IF(M20=N20,1,0))","v":0},{"$f":"IF(N20>M20,6,0)","v":0},{"$f":"IF(M20=\"\",0,SUM(Q20:S20))","v":0},{"$f":"VLOOKUP(T20,Classement!$B$2:$C$7,2,0)","v":0}]
[null,null,null,null,"CLASSEMENT",null,null,null,null,null,null,"Southampton",null,null,"Nice",null,{"$f":"IF(M21>N21,3,0)","v":0},{"$f":"IF(M21=\"\",0,IF(M21=N21,1,0))","v":0},{"$f":"IF(N21>M21,6,0)","v":0},{"$f":"IF(M21=\"\",0,SUM(Q21:S21))","v":0},{"$f":"VLOOKUP(T21,Classement!$B$2:$C$7,2,0)","v":0}]
[null,null,null,null,"Equipe","Points","Match joués","Buts pour","Buts contre","Goal Average",null,"Southampton",null,null,"Swansea",null,{"$f":"IF(M22>N22,3,0)","v":0},{"$f":"IF(M22=\"\",0,IF(M22=N22,1,0))","v":0},{"$f":"IF(N22>M22,6,0)","v":0},{"$f":"IF(M22=\"\",0,SUM(Q22:S22))","v":0},{"$f":"VLOOKUP(T22,Classement!$B$2:$C$7,2,0)","v":0}]
[null,null,null,null,"Braga",null,null,null,null,null,null,"Southampton",null,null,"Cologne",null,{"$f":"IF(M23>N23,3,0)","v":0},{"$f":"IF(M23=\"\",0,IF(M23=N23,1,0))","v":0},{"$f":"IF(N23>M23,6,0)","v":0},{"$f":"IF(M23=\"\",0,SUM(Q23:S23))","v":0},{"$f":"VLOOKUP(T23,Classement!$B$2:$C$7,2,0)","v":0}]
[null,null,null,null,"Southampton",null,null,null,null,null,null,"Southampton",null,null,"Real Sociedad ",null,{"$f":"IF(M24>N24,3,0)","v":0},{"$f":"IF(M24=\"\",0,IF(M24=N24,1,0))","v":0},{"$f":"IF(N24>M24,6,0)","v":0},{"$f":"IF(M24=\"\",0,SUM(Q24:S24))","v":0},{"$f":"VLOOKUP(T24,Classement!$B$2:$C$7,2,0)","v":0}]
[null,null,null,null,"Fiorentina",null,null,null,null,null,null,"Southampton",1,2,"Club Bruges",null,{"$f":"IF(M25>N25,3,0)","v":0},{"$f":"IF(M25=\"\",0,IF(M25=N25,1,0))","v":0},{"$f":"IF(N25>M25,6,0)","v":6},{"$f":"IF(M25=\"\",0,SUM(Q25:S25))","v":6},{"$f":"VLOOKUP(T25,Classement!$B$2:$C$7,2,0)","v":0}]
[null,null,null,null,"Celta Vigo",null,null,null,null,null,null,"Southampton",null,null,"Braga",null,{"$f":"IF(M26>N26,3,0)","v":0},{"$f":"IF(M26=\"\",0,IF(M26=N26,1,0))","v":0},{"$f":"IF(N26>M26,6,0)","v":0},{"$f":"IF(M26=\"\",0,SUM(Q26:S26))","v":0},{"$f":"VLOOKUP(T26,Classement!$B$2:$C$7,2,0)","v":0}]
[null,null,null,null,"Torino",null,null,null,null,null,null,"Fiorentina",1,0,"Celta Vigo",null,{"$f":"IF(M27>N27,3,0)","v":3},{"$f":"IF(M27=\"\",0,IF(M27=N27,1,0))","v":0},{"$f":"IF(N27>M27,6,0)","v":0},{"$f":"IF(M27=\"\",0,SUM(Q27:S27))","v":3},{"$f":"VLOOKUP(T27,Classement!$B$2:$C$7,2,0)","v":3}]
[null,null,null,null,"Werder",null,null,null,null,null,null,"Fiorentina",null,null,"Torino",null,{"$f":"IF(M28>N28,3,0)","v":0},{"$f":"IF(M28=\"\",0,IF(M28=N28,1,0))","v":0},{"$f":"IF(N28>M28,6,0)","v":0},{"$f":"IF(M28=\"\",0,SUM(Q28:S28))","v":0},{"$f":"VLOOKUP(T28,Classement!$B$2:$C$7,2,0)","v":0}]
[null,null,null,null,"St etienne",null,null,null,null,null,null,"Fiorentina",null,null,"Werder",null,{"$f":"IF(M29>N29,3,0)","v":0},{"$f":"IF(M29=\"\",0,IF(M29=N29,1,0))","v":0},{"$f":"IF(N29>M29,6,0)","v":0},{"$f":"IF(M29=\"\",0,SUM(Q29:S29))","v":0},{"$f":"VLOOKUP(T29,Classement!$B$2:$C$7,2,0)","v":0}]
[null,null,null,null,"Nice",null,null,null,null,null,null,"Fiorentina",null,null,"St etienne",null,{"$f":"IF(M30>N30,3,0)","v":0},{"$f":"IF(M30=\"\",0,IF(M30=N30,1,0))","v":0},{"$f":"IF(N30>M30,6,0)","v":0},{"$f":"IF(M30=\"\",0,SUM(Q30:S30))","v":0},{"$f":"VLOOKUP(T30,Classement!$B$2:$C$7,2,0)","v":0}]
{"$rows_left_out":158}
{"sheet":"Classement","index":2,"n_rows":22,"n_cols":11,"rows_kept":22,"cut":false,"hidden":false,"merged":[[1,1,1,2],[8,5,8,10]]}
[]
[null,"Tableau de points"]
[null,"Identifiants","Points"]
[null,0,0]
[null,3,3]
[null,1,1]
[null,6,0]
[]
[null,null,null,null,null,"CLASSEMENT FORMULES"]
[null,null,null,null,null,"Equipe","Points","Match joués","Buts pour","Buts contre","Goal Average"]
[null,null,null,null,null,"Swansea",{"$f":"'Match allez 1'!F13+'Match retour'!F13","v":19},{"$f":"'Match allez 1'!G13+'Match retour'!G13","v":10},{"$f":"'Match allez 1'!H13+'Match retour'!H13","v":23},{"$f":"'Match allez 1'!I13+'Match retour'!I13","v":7},{"$f":"I11-J11","v":16}]
[null,null,null,null,null,"Celta Vigo",{"$f":"'Match allez 1'!F8+'Match retour'!F8","v":18},{"$f":"'Match allez 1'!G8+'Match retour'!G8","v":12},{"$f":"'Match allez 1'!H8+'Match retour'!H8","v":23},{"$f":"'Match allez 1'!I8+'Match retour'!I8","v":16},{"$f":"I12-J12","v":7}]
[null,null,null,null,null,"Fiorentina",{"$f":"'Match allez 1'!F7+'Match retour'!F7","v":16},{"$f":"'Match allez 1'!G7+'Match retour'!G7","v":7},{"$f":"'Match allez 1'!H7+'Match retour'!H7","v":11},{"$f":"'Match allez 1'!I7+'Match retour'!I7","v":8},{"$f":"I13-J13","v":3}]
[null,null,null,null,null,"St etienne",{"$f":"'Match allez 1'!F11+'Match retour'!F11","v":14},{"$f":"'Match allez 1'!G11+'Match retour'!G11","v":8},{"$f":"'Match allez 1'!H11+'Match retour'!H11","v":11},{"$f":"'Match allez 1'!I11+'Match retour'!I11","v":6},{"$f":"I14-J14","v":5}]
[null,null,null,null,null,"Torino",{"$f":"'Match allez 1'!F9+'Match retour'!F9","v":10},{"$f":"'Match allez 1'!G9+'Match retour'!G9","v":4},{"$f":"'Match allez 1'!H9+'Match retour'!H9","v":6},{"$f":"'Match allez 1'!I9+'Match retour'!I9","v":3},{"$f":"I15-J15","v":3}]
[null,null,null,null,null,"Club Bruges",{"$f":"'Match allez 1'!F16+'Match retour'!F16","v":6},{"$f":"'Match allez 1'!G16+'Match retour'!G16","v":10},{"$f":"'Match allez 1'!H16+'Match retour'!H16","v":7},{"$f":"'Match allez 1'!I16+'Match retour'!I16","v":19},{"$f":"I16-J16","v":-12}]
[null,null,null,null,null,"Real Sociedad ",{"$f":"'Match allez 1'!F15+'Match retour'!F15","v":5},{"$f":"'Match allez 1'!G15+'Match retour'!G15","v":4},{"$f":"'Match allez 1'!H15+'Match retour'!H15","v":5},{"$f":"'Match allez 1'!I15+'Match retour'!I15","v":5},{"$f":"I17-J17","v":0}]
[null,null,null,null,null,"Braga",{"$f":"'Match allez 1'!F5+'Match retour'!F5","v":4},{"$f":"'Match allez 1'!G5+'Match retour'!G5","v":6},{"$f":"'Match allez 1'!H5+'Match retour'!H5","v":6},{"$f":"'Match allez 1'!I5+'Match retour'!I5","v":12},{"$f":"I18-J18","v":-6}]
[null,null,null,null,null,"Werder",{"$f":"'Match allez 1'!F10+'Match retour'!F10","v":3},{"$f":"'Match allez 1'!G10+'Match retour'!G10","v":4},{"$f":"'Match allez 1'!H10+'Match retour'!H10","v":5},{"$f":"'Match allez 1'!I10+'Match retour'!I10","v":12},{"$f":"I19-J19","v":-7}]
[null,null,null,null,null,"Southampton",{"$f":"'Match allez 1'!F6+'Match retour'!F6","v":2},{"$f":"'Match allez 1'!G6+'Match retour'!G6","v":3},{"$f":"'Match allez 1'!H6+'Match retour'!H6","v":5},{"$f":"'Match allez 1'!I6+'Match retour'!I6","v":6},{"$f":"I20-J20","v":-1}]
[null,null,null,null,null,"Nice",{"$f":"'Match allez 1'!F12+'Match retour'!F12","v":1},{"$f":"'Match allez 1'!G12+'Match retour'!G12","v":4},{"$f":"'Match allez 1'!H12+'Match retour'!H12","v":3},{"$f":"'Match allez 1'!I12+'Match retour'!I12","v":11},{"$f":"I21-J21","v":-8}]
[null,null,null,null,null,"Cologne",{"$f":"'Match allez 1'!F14+'Match retour'!F14","v":0},{"$f":"'Match allez 1'!G14+'Match retour'!G14","v":0},{"$f":"'Match allez 1'!H14+'Match retour'!H14","v":0},{"$f":"'Match allez 1'!I14+'Match retour'!I14","v":0},{"$f":"I22-J22","v":0}]