{"text_format":"1","workbook":"xlsx","n_sheets":7,"sheets":["Catégories","Input","Analyse","Home","Rapport","Configuration","Comptes"],"not_rendered":{"charts":3,"images":1,"macros":1,"external_links":0,"defined_names":7,"comments":0,"pivot_tables":4},"unopened":[],"bounds":{"document_bytes":16777216,"sheet_cells":100000,"rows_first":2000,"rows_last":500,"rows_between":2000,"halvings":0,"cell_chars":16384,"cell_head_chars":4096},"cells_cut":0,"cells_raw":0,"read":"whole","date_system":"1900"}

{"sheet":"Catégories","index":0,"n_rows":23,"n_cols":36,"rows_kept":23,"cut":false,"hidden":true,"merged":[[17,13,17,14],[1,19,1,20],[1,22,1,23],[1,31,1,32],[1,13,1,14],[17,1,17,2],[1,4,1,5],[1,7,1,8],[1,10,1,11],[17,4,17,5],[17,7,17,8],[17,10,17,11],[1,25,1,26],[1,28,1,29],[1,16,1,17],[1,34,1,35],[1,1,1,2]]}
[]
[null,"Catégories Sorties",null,null,{"$f":"INDEX(Sortie[Catégories],MATCH(1,Sortie[ID],0))","v":"Alimentation"},null,null,{"$f":"INDEX(Sortie[Catégories],MATCH(2,Sortie[ID],0))","v":"Logement"},null,null,{"$f":"INDEX(Sortie[Catégories],MATCH(3,Sortie[ID],0))","v":"Transport"},null,null,{"$f":"INDEX(Sortie[Catégories],MATCH(4,Sortie[ID],0))","v":"Vêtement"},null,null,{"$f":"INDEX(Sortie[Catégories],MATCH(5,Sortie[ID],0))","v":"Loisirs"},null,null,{"$f":"INDEX(Sortie[Catégories],MATCH(6,Sortie[ID],0))","v":"Internet - Téléphonie"},null,null,{"$f":"INDEX(Sortie[Catégories],MATCH(7,Sortie[ID],0))","v":"Assurance"},null,null,{"$f":"INDEX(Sortie[Catégories],MATCH(8,Sortie[ID],0))","v":"Vacances"},null,null,{"$f":"INDEX(Sortie[Catégories],MATCH(9,Sortie[ID],0))","v":"Frais Bancaire"},null,null,{"$f":"INDEX(Sortie[Catégories],MATCH(10,Sortie[ID],0))","v":"Maëva"},null,null,{"$f":"INDEX(Sortie[Catégories],MATCH(11,Sortie[ID],0))","v":"Soins"}]
[null,"ID","Catégories",null,"ID","Sous-Catégories",null,"ID","Sous-Catégories",null,"ID","Sous-Catégories",null,"ID","Sous-Catégories",null,"ID","Sous-Catégories",null,"ID","Sous-Catégories",null,"ID","Sous-Catégories",null,"ID","Sous-Catégories",null,"ID","Sous-Catégories",null,"ID","Sous-Catégories",null,"ID","Sous-Catégories"]
[null,1,"Alimentation",null,"1.1","Leclerc",null,"2.1","Loyer",null,"3.1","Essence",null,"4.1","Haut",null,"5.1","Tabac",null,"6.1","Free Mobile",null,"7.1","Air Alpha Auto",null,"8.1","Transport",null,"9.1","Frais de Gestion de Compte",null,"10.1","Fumette",null,"11.1","Frais Médicaux"]
[null,2,"Logement",null,"1.2","Auchan",null,"2.2","Electricité",null,"3.2","Autoroute",null,"4.2","Bas",null,"5.2","Cadeau",null,"6.2","Autre Dépense Internet - Téléphonie",null,"7.2","Air Alpha Habitation",null,"8.2","Logement",null,"9.2","Autre Frais Bancaire",null,"10.2","Free Mobile",null,"11.2","Frais Pharmaceutiques"]
[null,3,"Transport",null,"1.3","Fast-Food",null,"2.3","Impôts",null,"3.3","Entretien",null,"4.3","Chaussures",null,"5.3","Coiffeur",null,null,null,null,"7.3","Autre Dépense Assurance",null,"8.3","Activités",null,null,null,null,"10.3","Autre Dépense Maeva",null,"11.3","Frais d'Hospitalisation"]
[null,4,"Vêtement",null,"1.4","Restaurant",null,"2.4","Autre Dépense Logement",null,"3.4","Autre Dépense Transport",null,"4.4","Autre Dépense Vêtement",null,"5.4","Sport",null,null,null,null,null,null,null,"8.4","Alimentation",null,null,null,null,null,null,null,"11.4","Optiques"]
[null,5,"Loisirs",null,"1.5","L'entrepôt",null,null,null,null,null,null,null,null,null,null,"5.5","Abonnement",null,null,null,null,null,null,null,"8.5","Souvenirs",null,null,null,null,null,null,null,"11.5","Autre Frais Santé"]
[null,6,"Internet - Téléphonie",null,"1.6","Leader Price",null,null,null,null,null,null,null,null,null,null,"5.6","Activité Culturelle",null,null,null,null,null,null,null,"8.6","Autre Dépense Vacances"]
[null,7,"Assurance",null,"1.7","L'arche des Fromages",null,null,null,null,null,null,null,null,null,null,"5.7","Cinéma"]
[null,8,"Vacances",null,"1.8","Autre Dépense Alimentation",null,null,null,null,null,null,null,null,null,null,"5.8","Jeux Vidéo"]
[null,9,"Frais Bancaire",null,null,null,null,null,null,null,null,null,null,null,null,null,"5.9","Electronique"]
[null,10,"Maëva",null,null,null,null,null,null,null,null,null,null,null,null,null,"5.10","Autre Dépense Loisir"]
[null,11,"Soins"]
[]
[]
[]
[null,"Catégories Entrées",null,null,{"$f":"INDEX(Entree[Catégories],MATCH(1,Entree[ID],0))","v":"Professionnel"},null,null,"Aides",null,null,{"$f":"INDEX(Entree[Catégories],MATCH(3,Entree[ID],0))","v":"Remboursement"},null,null,{"$f":"INDEX(Entree[Catégories],MATCH(4,Entree[ID],0))","v":"Cadeau"}]
[null,"ID","Catégories",null,"ID","Sous-Catégories",null,"ID","Sous-Catégories",null,"ID","Sous-Catégories",null,"ID","Sous-Catégories"]
[null,1,"Professionnel",null,"1.1","Salaire",null,"2.1","APL",null,"3.1","Medecin",null,"4.1","Anniversaire"]
[null,2,"CAF",null,null,null,null,"2.2","Bourses",null,"3.2","Médicaments",null,"4.2","Noël"]
[null,3,"Remboursement",null,null,null,null,null,null,null,"3.3","Dentiste"]
[null,4,"Cadeau",null,null,null,null,null,null,null,"3.4","Autre Remboursement"]

{"sheet":"Input","index":1,"n_rows":433,"n_cols":43,"rows_kept":433,"cut":false,"hidden":true,"merged":[]}
[]
[null,"ID","Date","Type","Somme","Compte","Du/Au","Description","Catid","Catégorie","Subid","Sous-Catégorie","Référence","Commentaires","Année","Mois","Recherche",null,null,null,null,null,null,null,null,"Recherche",null,"ID","Date","Type","Somme","Compte","Du/Au","Description","Catid","Catégorie","Subid","Sous-Catégorie","Référence","Commentaires","Année","Mois","Recherche"]
[null,{"$f":"ROW(B3)-2","v":1},"02/01/2018","Sortie",212.49,"Compte Courant","","Air Alpha",7,{"$f":"IFERROR(IF(OR(Inpute[Type]=\"Sortie\",Inpute[Type]=\"Budget\"),VLOOKUP(Inpute[Catid],Sortie[],2,0),IF(Inpute[Type]=\"Entrée\",VLOOKUP(Inpute[Catid],Entree[],2,0),\"\")),\" \")","v":"Assurance"},"7.1",{"$f":"IFERROR(IF(OR(Inpute[Type]=\"Sortie\",Inpute[Type]=\"Budget\"),VLOOKUP(Inpute[Subid],INDIRECT(\"Sortie\"&Inpute[Catid]),2,0),IF(Inpute[Type]=\"Entrée\",VLOOKUP(Inpute[Subid],INDIRECT(\"Entree\"&Inpute[Catid]),2,0),\"\")),\"\")","v":"Air Alpha Auto"},"","",{"$f":"YEAR(C3)","v":2018},{"$f":"TEXT(C3,\"mmmm\")","v":"janvier"},{"$f":"CONCATENATE(TEXT(Inpute[Date],\"jj/mm/aaaa\"),\" \",Inpute[Type],\" \",Inpute[Somme],\" \",Inpute[Compte],\" \",Inpute[Du/Au],\" \",Inpute[Description],\" \",Inpute[Catégorie],\" \",Inpute[Sous-Catégorie],\" \",Inpute[Référence],\" \",Inpute[Commentaires],\" \",Inpute[Année],\" \",Inpute[Mois])","v":"02/01/2018 Sortie 212,49 Compte Courant  Air Alpha Assurance Air Alpha Auto   2018 janvier"},null,null,null,null,null,null,null,null,"**",null,1,"02/01/2018","Sortie",212.49,"Compte Courant","","Air Alpha",7,"Assurance","7.1","Air Alpha Auto","","",2018,"janvier","02/01/2018 Sortie 212,49 Compte Courant  Air Alpha Assurance Air Alpha Auto   2018 janvier"]
[null,null,null,null,null,null,null,null,null,null,null,null,null,null,null,null,null,null,null,null,null,null,null,null,null,null,null,2,"01/01/2018","Sortie",27.65,"Compte Courant","","Mcdonald",1,"Alimentation","1.3","Fast-Food","","",2018,"janvier","01/01/2018 Sortie 27,65 Compte Courant  Mcdonald Alimentation Fast-Food   2018 janvier"]
[null,null,null,null,null,null,null,null,null,null,null,null,null,null,null,null,null,null,null,null,null,null,null,null,null,null,null,3,"01/01/2018","Sortie",14.4,"Compte Courant","","Tabac",10,"Maëva","10.1","Fumette","","",2018,"janvier","01/01/2018 Sortie 14,4 Compte Courant  Tabac Maëva Fumette   2018 janvier"]
[null,null,null,null,null,null,null,null,null,null,null,null,null,null,null,null,null,null,null,null,null,null,null,null,null,null,null,4,"03/01/2018","Sortie",55.01,"Compte Courant","","Drive",1,"Alimentation","1.1","Leclerc","","",2018,"janvier","03/01/2018 Sortie 55,01 Compte Courant  Drive Alimentation Leclerc   2018 janvier"]
[null,null,null,null,null,null,null,null,null,null,null,null,null,null,null,null,null,null,null,null,null,null,null,null,null,null,null,5,"03/01/2018","Sortie",4.1100000000000003,"Compte Courant","","Fruits & Légumes",1,"Alimentation","1.5","L'entrepôt","","",2018,"janvier","03/01/2018 Sortie 4,11 Compte Courant  Fruits & Légumes Alimentation L'entrepôt   2018 janvier"]
[null,null,null,null,null,null,null,null,null,null,null,null,null,null,null,null,null,null,null,null,null,null,null,null,null,null,null,6,"04/01/2018","Entrée",89,"Compte Courant","Maman","Virement Noël Famille",4,"Cadeau","4.2","Noël","","",2018,"janvier","04/01/2018 Entrée 89 Compte Courant Maman Virement Noël Famille Cadeau Noël   2018 janvier"]
[null,null,null,null,null,null,null,null,null,null,null,null,null,null,null,null,null,null,null,null,null,null,null,null,null,null,null,7,"03/01/2018","Sortie",25,"Compte Courant","","Medecin",11,"Soins","11.1","Frais Médicaux","","",2018,"janvier","03/01/2018 Sortie 25 Compte Courant  Medecin Soins Frais Médicaux   2018 janvier"]
[null,null,null,null,null,null,null,null,null,null,null,null,null,null,null,null,null,null,null,null,null,null,null,null,null,null,null,8,"03/01/2018","Sortie",9.9,"Compte Courant","","Photo",10,"Maëva","10.3","Autre Dépense Maeva","","",2018,"janvier","03/01/2018 Sortie 9,9 Compte Courant  Photo Maëva Autre Dépense Maeva   2018 janvier"]
[null,null,null,null,null,null,null,null,null,null,null,null,null,null,null,null,null,null,null,null,null,null,null,null,null,null,null,9,"08/01/2018","Budget",43,"Compte Courant",null,"EDF",2,"Logement","2.2","Electricité",null,null,2018,"janvier","08/01/2018 Budget 43 Compte Courant  EDF Logement Electricité   2018 janvier"]
[null,null,null,null,null,null,null,null,null,null,null,null,null,null,null,null,null,null,null,null,null,null,null,null,null,null,null,10,"08/02/2018","Budget",43,"Compte Courant",null,"EDF",2,"Logement","2.2","Electricité",null,null,2018,"février","08/02/2018 Budget 43 Compte Courant  EDF Logement Electricité   2018 février"]
[null,null,null,null,null,null,null,null,null,null,null,null,null,null,null,null,null,null,null,null,null,null,null,null,null,null,null,11,"08/03/2018","Budget",43,"Compte Courant",null,"EDF",2,"Logement","2.2","Electricité",null,null,2018,"mars","08/03/2018 Budget 43 Compte Courant  EDF Logement Electricité   2018 mars"]
[null,null,null,null,null,null,null,null,null,null,null,null,null,null,null,null,null,null,null,null,null,null,null,null,null,null,null,12,"08/04/2018","Budget",43,"Compte Courant",null,"EDF",2,"Logement","2.2","Electricité",null,null,2018,"avril","08/04/2018 Budget 43 Compte Courant  EDF Logement Electricité   2018 avril"]
[null,null,null,null,null,null,null,null,null,null,null,null,null,null,null,null,null,null,null,null,null,null,null,null,null,null,null,13,"08/05/2018","Budget",43,"Compte Courant",null,"EDF",2,"Logement","2.2","Electricité",null,null,2018,"mai","08/05/2018 Budget 43 Compte Courant  EDF Logement Electricité   2018 mai"]
[null,null,null,null,null,null,null,null,null,null,null,null,null,null,null,null,null,null,null,null,null,null,null,null,null,null,null,14,"08/06/2018","Budget",43,"Compte Courant",null,"EDF",2,"Logement","2.2","Electricité",null,null,2018,"juin","08/06/2018 Budget 43 Compte Courant  EDF Logement Electricité   2018 juin"]
[null,null,null,null,null,null,null,null,null,null,null,null,null,null,null,null,null,null,null,null,null,null,null,null,null,null,null,15,"08/07/2018","Budget",43,"Compte Courant",null,"EDF",2,"Logement","2.2","Electricité",null,null,2018,"juillet","08/07/2018 Budget 43 Compte Courant  EDF Logement Electricité   2018 juillet"]
[null,null,null,null,null,null,null,null,null,null,null,null,null,null,null,null,null,null,null,null,null,null,null,null,null,null,null,16,"08/08/2018","Budget",43,"Compte Courant",null,"EDF",2,"Logement","2.2","Electricité",null,null,2018,"août","08/08/2018 Budget 43 Compte Courant  EDF Logement Electricité   2018 août"]
[null,null,null,null,null,null,null,null,null,null,null,null,null,null,null,null,null,null,null,null,null,null,null,null,null,null,null,17,"08/09/2018","Budget",43,"Compte Courant",null,"EDF",2,"Logement","2.2","Electricité",null,null,2018,"septembre","08/09/2018 Budget 43 Compte Courant  EDF Logement Electricité   2018 septembre"]
[null,null,null,null,null,null,null,null,null,null,null,null,null,null,null,null,null,null,null,null,null,null,null,null,null,null,null,18,"08/10/2018","Budget",43,"Compte Courant",null,"EDF",2,"Logement","2.2","Electricité",null,null,2018,"octobre","08/10/2018 Budget 43 Compte Courant  EDF Logement Electricité   2018 octobre"]
[null,null,null,null,null,null,null,null,null,null,null,null,null,null,null,null,null,null,null,null,null,null,null,null,null,null,null,19,"08/11/2018","Budget",43,"Compte Courant",null,"EDF",2,"Logement","2.2","Electricité",null,null,2018,"novembre","08/11/2018 Budget 43 Compte Courant  EDF Logement Electricité   2018 novembre"]
[null,null,null,null,null,null,null,null,null,null,null,null,null,null,null,null,null,null,null,null,null,null,null,null,null,null,null,20,"08/12/2018","Budget",43,"Compte Courant",null,"EDF",2,"Logement","2.2","Electricité",null,null,2018,"décembre","08/12/2018 Budget 43 Compte Courant  EDF Logement Electricité   2018 décembre"]
[null,null,null,null,null,null,null,null,null,null,null,null,null,null,null,null,null,null,null,null,null,null,null,null,null,null,null,21,"08/01/2019","Budget",43,"Compte Courant",null,"EDF",2,"Logement","2.2","Electricité",null,null,2019,"janvier","08/01/2019 Budget 43 Compte Courant  EDF Logement Electricité   2019 janvier"]
[null,null,null,null,null,null,null,null,null,null,null,null,null,null,null,null,null,null,null,null,null,null,null,null,null,null,null,22,"08/01/2018","Sortie",43,"Compte Courant","","EDF",2,"Logement","2.2","Electricité","","",2018,"janvier","08/01/2018 Sortie 43 Compte Courant  EDF Logement Electricité   2018 janvier"]
[null,null,null,null,null,null,null,null,null,null,null,null,null,null,null,null,null,null,null,null,null,null,null,null,null,null,null,23,"08/01/2018","Entrée",16.5,"Compte Courant","","Sécurité Sociale",3,"Remboursement","3.1","Medecin","","",2018,"janvier","08/01/2018 Entrée 16,5 Compte Courant  Sécurité Sociale Remboursement Medecin   2018 janvier"]
[null,null,null,null,null,null,null,null,null,null,null,null,null,null,null,null,null,null,null,null,null,null,null,null,null,null,null,24,"05/01/2018","Entrée",326,"Compte Courant","","CAF",2,"CAF","2.1","APL","","",2018,"janvier","05/01/2018 Entrée 326 Compte Courant  CAF CAF APL   2018 janvier"]
[null,null,null,null,null,null,null,null,null,null,null,null,null,null,null,null,null,null,null,null,null,null,null,null,null,null,null,25,"05/01/2018","Sortie",9.9,"Compte Courant","","Coiffeur",5,"Loisirs","5.3","Coiffeur","","",2018,"janvier","05/01/2018 Sortie 9,9 Compte Courant  Coiffeur Loisirs Coiffeur   2018 janvier"]
[null,null,null,null,null,null,null,null,null,null,null,null,null,null,null,null,null,null,null,null,null,null,null,null,null,null,null,26,"05/01/2018","Sortie",45,"Compte Courant","","Epargne PEL",2,"Logement","2.4","Autre Dépense Logement","","",2018,"janvier","05/01/2018 Sortie 45 Compte Courant  Epargne PEL Logement Autre Dépense Logement   2018 janvier"]
[null,null,null,null,null,null,null,null,null,null,null,null,null,null,null,null,null,null,null,null,null,null,null,null,null,null,null,27,"05/01/2018","Budget",45,"Compte Courant",null,"Epargne PEL",2,"Logement","2.4","Autre Dépense Logement",null,null,2018,"janvier","05/01/2018 Budget 45 Compte Courant  Epargne PEL Logement Autre Dépense Logement   2018 janvier"]
[null,null,null,null,null,null,null,null,null,null,null,null,null,null,null,null,null,null,null,null,null,null,null,null,null,null,null,28,"05/02/2018","Budget",45,"Compte Courant",null,"Epargne PEL",2,"Logement","2.4","Autre Dépense Logement",null,null,2018,"février","05/02/2018 Budget 45 Compte Courant  Epargne PEL Logement Autre Dépense Logement   2018 février"]
[null,null,null,null,null,null,null,null,null,null,null,null,null,null,null,null,null,null,null,null,null,null,null,null,null,null,null,29,"05/03/2018","Budget",45,"Compte Courant",null,"Epargne PEL",2,"Logement","2.4","Autre Dépense Logement",null,null,2018,"mars","05/03/2018 Budget 45 Compte Courant  Epargne PEL Logement Autre Dépense Logement   2018 mars"]
[null,null,null,null,null,null,null,null,null,null,null,null,null,null,null,null,null,null,null,null,null,null,null,null,null,null,null,30,"05/04/2018","Budget",45,"Compte Courant",null,"Epargne PEL",2,"Logement","2.4","Autre Dépense Logement",null,null,2018,"avril","05/04/2018 Budget 45 Compte Courant  Epargne PEL Logement Autre Dépense Logement   2018 avril"]
[null,null,null,null,null,null,null,null,null,null,null,null,null,null,null,null,null,null,null,null,null,null,null,null,null,null,null,31,"05/05/2018","Budget",45,"Compte Courant",null,"Epargne PEL",2,"Logement","2.4","Autre Dépense Logement",null,null,2018,"mai","05/05/2018 Budget 45 Compte Courant  Epargne PEL Logement Autre Dépense Logement   2018 mai"]
[null,null,null,null,null,null,null,null,null,null,null,null,null,null,null,null,null,null,null,null,null,null,null,null,null,null,null,32,"05/06/2018","Budget",45,"Compte Courant",null,"Epargne PEL",2,"Logement","2.4","Autre Dépense Logement",null,null,2018,"juin","05/06/2018 Budget 45 Compte Courant  Epargne PEL Logement Autre Dépense Logement   2018 juin"]
[null,null,null,null,null,null,null,null,null,null,null,null,null,null,null,null,null,null,null,null,null,null,null,null,null,null,null,33,"05/07/2018","Budget",45,"Compte Courant",null,"Epargne PEL",2,"Logement","2.4","Autre Dépense Logement",null,null,2018,"juillet","05/07/2018 Budget 45 Compte Courant  Epargne PEL Logement Autre Dépense Logement   2018 juillet"]
[null,null,null,null,null,null,null,null,null,null,null,null,null,null,null,null,null,null,null,null,null,null,null,null,null,null,null,34,"05/08/2018","Budget",45,"Compte Courant",null,"Epargne PEL",2,"Logement","2.4","Autre Dépense Logement",null,null,2018,"août","05/08/2018 Budget 45 Compte Courant  Epargne PEL Logement Autre Dépense Logement   2018 août"]
[null,null,null,null,null,null,null,null,null,null,null,null,null,null,null,null,null,null,null,null,null,null,null,null,null,null,null,35,"05/09/2018","Budget",45,"Compte Courant",null,"Epargne PEL",2,"Logement","2.4","Autre Dépense Logement",null,null,2018,"septembre","05/09/2018 Budget 45 Compte Courant  Epargne PEL Logement Autre Dépense Logement   2018 septembre"]
[null,null,null,null,null,null,null,null,null,null,null,null,null,null,null,null,null,null,null,null,null,null,null,null,null,null,null,36,"05/10/2018","Budget",45,"Compte Courant",null,"Epargne PEL",2,"Logement","2.4","Autre Dépense Logement",null,null,2018,"octobre","05/10/2018 Budget 45 Compte Courant  Epargne PEL Logement Autre Dépense Logement   2018 octobre"]
[null,null,null,null,null,null,null,null,null,null,null,null,null,null,null,null,null,null,null,null,null,null,null,null,null,null,null,37,"05/11/2018","Budget",45,"Compte Courant",null,"Epargne PEL",2,"Logement","2.4","Autre Dépense Logement",null,null,2018,"novembre","05/11/2018 Budget 45 Compte Courant  Epargne PEL Logement Autre Dépense Logement   2018 novembre"]
[null,null,null,null,null,null,null,null,null,null,null,null,null,null,null,null,null,null,null,null,null,null,null,null,null,null,null,38,"05/12/2018","Budget",45,"Compte Courant",null,"Epargne PEL",2,"Logement","2.4","Autre Dépense Logement",null,null,2018,"décembre","05/12/2018 Budget 45 Compte Courant  Epargne PEL Logement Autre Dépense Logement   2018 décembre"]
{"$rows_left_out":394}
{"sheet":"Analyse","index":2,"n_rows":28,"n_cols":23,"rows_kept":28,"cut":false,"hidden":true,"merged":[]}
[]
[]
[]
[]
[null,null,null,null,null,null,null,null,"Somme de Somme",null,null,null,null,null,null,"Somme de Somme"]
[null,null,null,null,null,null,null,null,null,"Sortie"]
[null,null,null,null,null,null,null,null,"Assurance",212.49,null,null,null,null,null,"Total général"]
[null,null,null,null,null,null,null,null,"Total général",212.49]
[]
[null,null,null,null,null,null,null,null,null,null,null,null,null,null,null,null,null,null,null,null,null,"Sortie",{"$f":"GETPIVOTDATA(\"Somme\",$I$5,\"Type\",\"Sortie\")","v":212.49}]
[null,null,null,null,null,null,null,null,null,null,null,null,null,null,null,null,null,null,null,null,null,"Entrée",{"$f":"GETPIVOTDATA(\"Somme\",$P$5,\"Type\",\"Entrée\")","v":{"$error":"#REF!"}}]
[]
[]
[]
[]
[]
[]
[]
[]
[]
[]
[]
[]
[null,"Somme de Somme"]
[null,null,"Sortie",null,null,null,null,null,"Janvier","Février","Mars","Avril","Mai","Juin","Juillet","Août","Septembre","Octobre","Novembre","Décembre"]
[null,"Assurance",null,null,null,null,null,"Sortie",{"$f":"IFERROR(GETPIVOTDATA(\"Somme\",Rapport!$B$3,\"Type\",\"Sortie\",\"Mois\",I$25),\"\")","v":212.49},{"$f":"IFERROR(GETPIVOTDATA(\"Somme\",Rapport!$B$3,\"Type\",\"Sortie\",\"Mois\",J$25),\"\")","v":""},{"$f":"IFERROR(GETPIVOTDATA(\"Somme\",Rapport!$B$3,\"Type\",\"Sortie\",\"Mois\",K$25),\"\")","v":""},{"$f":"IFERROR(GETPIVOTDATA(\"Somme\",Rapport!$B$3,\"Type\",\"Sortie\",\"Mois\",L$25),\"\")","v":""},{"$f":"IFERROR(GETPIVOTDATA(\"Somme\",Rapport!$B$3,\"Type\",\"Sortie\",\"Mois\",M$25),\"\")","v":""},{"$f":"IFERROR(GETPIVOTDATA(\"Somme\",Rapport!$B$3,\"Type\",\"Sortie\",\"Mois\",N$25),\"\")","v":""},{"$f":"IFERROR(GETPIVOTDATA(\"Somme\",Rapport!$B$3,\"Type\",\"Sortie\",\"Mois\",O$25),\"\")","v":""},{"$f":"IFERROR(GETPIVOTDATA(\"Somme\",Rapport!$B$3,\"Type\",\"Sortie\",\"Mois\",P$25),\"\")","v":""},{"$f":"IFERROR(GETPIVOTDATA(\"Somme\",Rapport!$B$3,\"Type\",\"Sortie\",\"Mois\",Q$25),\"\")","v":""},{"$f":"IFERROR(GETPIVOTDATA(\"Somme\",Rapport!$B$3,\"Type\",\"Sortie\",\"Mois\",R$25),\"\")","v":""},{"$f":"IFERROR(GETPIVOTDATA(\"Somme\",Rapport!$B$3,\"Type\",\"Sortie\",\"Mois\",S$25),\"\")","v":""},{"$f":"IFERROR(GETPIVOTDATA(\"Somme\",Rapport!$B$3,\"Type\",\"Sortie\",\"Mois\",T$25),\"\")","v":""}]
[null,"Air Alpha Auto",212.49,null,null,null,null,"Budgeter",{"$f":"IFERROR(GETPIVOTDATA(\"Somme\",Rapport!$B$3,\"Type\",\"Budget\",\"Mois\",I$25),\"\")","v":""},{"$f":"IFERROR(GETPIVOTDATA(\"Somme\",Rapport!$B$3,\"Type\",\"Budget\",\"Mois\",J$25),\"\")","v":""},{"$f":"IFERROR(GETPIVOTDATA(\"Somme\",Rapport!$B$3,\"Type\",\"Budget\",\"Mois\",K$25),\"\")","v":""},{"$f":"IFERROR(GETPIVOTDATA(\"Somme\",Rapport!$B$3,\"Type\",\"Budget\",\"Mois\",L$25),\"\")","v":""},{"$f":"IFERROR(GETPIVOTDATA(\"Somme\",Rapport!$B$3,\"Type\",\"Budget\",\"Mois\",M$25),\"\")","v":""},{"$f":"IFERROR(GETPIVOTDATA(\"Somme\",Rapport!$B$3,\"Type\",\"Budget\",\"Mois\",N$25),\"\")","v":""},{"$f":"IFERROR(GETPIVOTDATA(\"Somme\",Rapport!$B$3,\"Type\",\"Budget\",\"Mois\",O$25),\"\")","v":""},{"$f":"IFERROR(GETPIVOTDATA(\"Somme\",Rapport!$B$3,\"Type\",\"Budget\",\"Mois\",P$25),\"\")","v":""},{"$f":"IFERROR(GETPIVOTDATA(\"Somme\",Rapport!$B$3,\"Type\",\"Budget\",\"Mois\",Q$25),\"\")","v":""},{"$f":"IFERROR(GETPIVOTDATA(\"Somme\",Rapport!$B$3,\"Type\",\"Budget\",\"Mois\",R$25),\"\")","v":""},{"$f":"IFERROR(GETPIVOTDATA(\"Somme\",Rapport!$B$3,\"Type\",\"Budget\",\"Mois\",S$25),\"\")","v":""},{"$f":"IFERROR(GETPIVOTDATA(\"Somme\",Rapport!$B$3,\"Type\",\"Budget\",\"Mois\",T$25),\"\")","v":""}]
[null,null,null,null,null,null,null,"Différence",{"$f":"I27-I26","v":{"$error":"#VALUE!"}},{"$f":"J27-J26","v":{"$error":"#VALUE!"}},{"$error":"#VALUE!"},{"$error":"#VALUE!"},{"$error":"#VALUE!"},{"$error":"#VALUE!"},{"$error":"#VALUE!"},{"$error":"#VALUE!"},{"$error":"#VALUE!"},{"$error":"#VALUE!"},{"$error":"#VALUE!"},{"$error":"#VALUE!"}]

{"sheet":"Home","index":3,"n_rows":0,"n_cols":0,"rows_kept":0,"cut":false,"hidden":false,"merged":[]}

{"sheet":"Rapport","index":4,"n_rows":10,"n_cols":4,"rows_kept":10,"cut":false,"hidden":true,"merged":[]}
[]
[]
[null,"Somme de Somme","Étiquettes de colonnes"]
[null,"Étiquettes de lignes","janvier","Total général"]
[null,"Sortie"]
[null,"Assurance"]
[null,"Air Alpha Auto",212.49,212.49]
[null,"Total Assurance",212.49,212.49]
[null,"Total Sortie",212.49,212.49]
[null,"Total général",212.49,212.49]

{"sheet":"Configuration","index":5,"n_rows":7,"n_cols":5,"rows_kept":7,"cut":false,"hidden":true,"merged":[]}
[]
[null,"Type",null,"Périodicité","Code"]
[null,"Entrée",null,"Journalier","d"]
[null,"Sortie",null,"Hebdomadaire","WW"]
[null,"Budget",null,"Mensuel","M"]
[null,"Transfert",null,"Trimestriel","Q"]
[null,null,null,"Annuel","YYYY"]

{"sheet":"Comptes","index":6,"n_rows":10,"n_cols":6,"rows_kept":10,"cut":false,"hidden":true,"merged":[]}
[]
[]
[]
[null,"ID","Compte","Départ","Caculé","Solde"]
[null,{"$f":"ROW(B5)-4","v":1},"Compte Courant",0,{"$f":"SUM(SUMIFS(Inpute[Somme],Inpute[Type],{\"Entrée\";\"Transfert\"},Inpute[Compte],Comptes!C5))-SUMIFS(Inpute[Somme],Inpute[Compte],Comptes!C5,Inpute[Type],\"Sortie\")","v":-212.49},{"$f":"Compte[Départ]+Compte[Caculé]","v":-212.49}]
[null,2,"Livret Jeune",0,{"$f":"SUM(SUMIFS(Inpute[Somme],Inpute[Type],{\"Entrée\";\"Transfert\"},Inpute[Compte],Comptes!C6))-SUMIFS(Inpute[Somme],Inpute[Compte],Comptes!C6,Inpute[Type],\"Sortie\")","v":0},{"$f":"Compte[Départ]+Compte[Caculé]","v":0}]
[null,3,"Livret A",0,{"$f":"SUM(SUMIFS(Inpute[Somme],Inpute[Type],{\"Entrée\";\"Transfert\"},Inpute[Compte],Comptes!C7))-SUMIFS(Inpute[Somme],Inpute[Compte],Comptes!C7,Inpute[Type],\"Sortie\")","v":0},{"$f":"Compte[Départ]+Compte[Caculé]","v":0}]
[null,4,"PEL",0,{"$f":"SUM(SUMIFS(Inpute[Somme],Inpute[Type],{\"Entrée\";\"Transfert\"},Inpute[Compte],Comptes!C8))-SUMIFS(Inpute[Somme],Inpute[Compte],Comptes!C8,Inpute[Type],\"Sortie\")","v":0},{"$f":"Compte[Départ]+Compte[Caculé]","v":0}]
[null,5,"PEE",0,{"$f":"SUM(SUMIFS(Inpute[Somme],Inpute[Type],{\"Entrée\";\"Transfert\"},Inpute[Compte],Comptes!C9))-SUMIFS(Inpute[Somme],Inpute[Compte],Comptes!C9,Inpute[Type],\"Sortie\")","v":0},{"$f":"Compte[Départ]+Compte[Caculé]","v":0}]
[null,6,"PERCO",0,{"$f":"SUM(SUMIFS(Inpute[Somme],Inpute[Type],{\"Entrée\";\"Transfert\"},Inpute[Compte],Comptes!C10))-SUMIFS(Inpute[Somme],Inpute[Compte],Comptes!C10,Inpute[Type],\"Sortie\")","v":0},{"$f":"Compte[Départ]+Compte[Caculé]","v":0}]