{"text_format":"1","workbook":"xlsx","n_sheets":8,"sheets":["GUIDE","RESULTATS","CLASSEMENT","DATA_1_TEAMS","DATA_1_MATCHS","Kévin Sonilhac","Pronostiqueur 2","Pronostiqueur 3"],"not_rendered":{"charts":0,"images":17,"macros":1,"external_links":0,"defined_names":30,"comments":4,"pivot_tables":0},"unopened":[],"bounds":{"document_bytes":16777216,"sheet_cells":100000,"rows_first":2000,"rows_last":500,"rows_between":2000,"halvings":0,"cell_chars":16384,"cell_head_chars":4096},"cells_cut":0,"cells_raw":0,"read":"whole","date_system":"1900"}

{"sheet":"GUIDE","index":0,"n_rows":151,"n_cols":29,"rows_kept":151,"cut":false,"hidden":false,"merged":[[36,28,36,37],[23,28,23,37],[3,5,3,11],[5,28,5,37],[6,28,6,37],[13,28,13,37],[16,28,16,37],[5,2,5,16],[5,17,5,24],[10,28,10,37],[21,28,21,37],[18,28,18,37],[20,28,20,37],[24,28,24,37],[28,28,28,37],[32,28,32,37]]}
[]
[]
[]
[]
[]
[null,null,"UTILISATION DU FICHIER PRONOSTIC FIFA World Cup 2018",null,null,null,null,null,null,null,null,null,null,null,null,null,null,"Pour les curieux et utilisateurs avertis, ôtez la protection avec le mot de passe : XLD.",null,null,null,null,null,null,null,null,null,null,"VERSIONS"]
[null,null,"1 - COMMENT CA MARCHE?",null,null,null,null,null,null,null,null,null,null,null,null,null,null,null,null,null,null,null,null,null,null,null,null,null,"Version 1.0"]
[null,null,null,null,null,null,null,null,null,null,null,null,null,null,null,null,null,null,null,null,null,null,null,null,null,null,null,null,"Cette version 1.0 a été réalisée à partir de la version 2.6 (JCGL) du fichier précédemment créé pour"]
[null,null,"Merci d'avoir téléchargé \"FIFA World Cup Russia 2018 - XLD\".",null,null,null,null,null,null,null,null,null,null,null,null,"REGLES DE CALCUL DES POINTS ATTRIBUES :",null,null,null,null,null,null,null,null,null,null,null,null," la coupe du monde 2014."]
[null,null,"L'origine de ce fichier remonte à la coupe du monde 2014. Il a été créé par David Aubert, webmaster du site Excel Downloads :"]
[null,null,"https://www.excel-downloads.com",null,null,null,null,null,null,null,null,null,null,null,null,null,null,null,null,null,null,null,null,null,null,null,null,null,"Version 1.0a"]
[null,null,"Il a été ensuite amélioré par les membres du site et plus particulièrement par JCGL, que je remercie chaleureusement!!",null,null,null,null,null,null,null,null,null,null,null,null,null,null,null,null,null,null,null,null,null,null,null,null,null,"Correction d'une erreur de calcul des points pour l'équipe du Nigeria."]
[null,null,"Rendez vous régulièrement sur la page de téléchargement du fichier pour suivre les mises à jour ou participer aux discussions relatives"]
[null,null,"au programme :",null,"https://www.excel-downloads.com/resources/coupe-du-monde-football-russie-2018.1075/",null,null,null,null,null,null,null,null,null,null,null,null,null,null,null,null,null,null,null,null,null,null,null,"Version 1.1"]
[null,null,null,null,null,null,null,null,null,null,null,null,null,null,null,null,null,null,null,null,null,null,null,null,null,null,null,null,"Affichage dynamique du classement groupe par groupe en fonction des résultats des matchs."]
[null,null,"Ce fichier va vous permettre d'organiser un concours de pronostics pour 1 à 200 joueurs. ",null,null,null,null,null,null,null,null,null,null,null,null,null,null,null,null,null,null,null,null,null,null,null,null,null,"Possibilité de jouer jusqu'à 200 pronostiqueurs."]
[null,null,"Avant la coupe du monde, créez un onglet par pronostiqueur et saisissez les pronostics des joueurs.",null,null,null,null,null,null,null,null,null,null,null,null,null,null,null,null,null,null,null,null,null,null,null,null,null,"Correction des liens dans l'onglet \"Classement\" (merci Job75 et Modeste!)"]
[null,null,"Lorsque la Coupe du Monde débute, il ne vous reste plus qu'à saisir les résultats des matchs au jour le jour et "]
[null,null,"voir évoluer les scores et classements des pronostiqueurs jusqu'à la Finale, dans l'onglet \"CLASSEMENT\".",null,null,null,null,null,null,null,null,null,null,null,null,null,null,null,null,null,null,null,null,null,null,null,null,null,"Version 1.1a"]
[null,null,null,null,null,null,null,null,null,null,null,null,null,null,null,null,null,null,null,null,null,null,null,null,null,null,null,null,"Correction d'une erreur de typo sans impact sur la qualité des données (merci jimdk)."]
[null,null,"Commençons tout d'abord par voir comment créer les onglets des pronostiqueurs…"]
[null,null,null,null,null,null,null,null,null,null,null,null,null,null,null,null,null,null,null,null,null,null,null,null,null,null,null,null,"Version 1.1b"]
[null,null,null,null,null,null,null,null,null,null,null,null,null,null,null,null,null,null,null,null,null,null,null,null,null,null,null,null,"Possibilité de calculer les scores des pronostiqueurs en intégrant les bonifications des phases finales ou non."]
[null,null,"2 - AJOUT DES PRONOSTIQUEURS",null,null,null,null,null,null,null,null,null,null,null,null,null,null,null,null,null,null,null,null,null,null,null,null,null,"Indicateurs visuels (couleurs) en face des matchs ou équipes générant des points aux pronostiqueurs (utile"]
[null,null,null,null,null,null,null,null,null,null,null,null,null,null,null,null,null,null,null,null,null,null,null,null,null,null,null,null,"pour faire les contrôles)."]
[null,null,"IMPORTANT : pour le bon fonctionnement du fichier, il est crucial que les onglets \"RESULTATS\", \"CLASSEMENT\" et \"GUIDE\" restent positionnés avant les onglets de pronostics."]
[null,null,"Faite donc en sorte de ne jamais déplacer un fichier de pronostic avant ou entre ces onglets."]
[]
[null,null,"Suivre les étapes imagées ci-dessous :"]
[null,null,"Le fichier d'origine comporte un seul pronostiqueur nommé \"Pronostiqueur 1\"."]
[null,null,"Dupliquez cet onglet autant de fois que nécessaire et renommez le ainsi que ses copies avec les noms des pronostiqueurs."]
[]
[]
[]
[]
[]
[]
[]
[]
[]
[]
[]
[]
[]
[]
[]
[]
[null,null,"3 - SAISIE DES PRONOSTIQUES"]
[]
[null,null,"La saisie des pronostics d'effectue dans les onglets que vous avez créés tel qu'expliqué dans la partie \"2 - AJOUT DES PRONOSTIQUEURS\" de ce guide."]
[]
[null,null,"EN PHASE DE GROUPES"]
[]
[null,null,"Saisir les scores pour chaque matchs dans les colonnes \"Buts\"",null,null,null,null,null,null,null,null,"Les points et les statistiques sont calculés automatiquement "]
[null,null,"Les vainqueurs sont automatiquement mis en évidence sur fond rouge.",null,null,null,null,null,null,null,null,"dans les tableaux récapitulatifs des groupes."]
[]
[]
[]
[]
[]
[]
[]
[]
[]
[]
[]
[]
[]
[null,null,"1/8èmes de FINALE"]
[]
[null,null,"Dans 99% des cas, les règles de la FIFA permettent de départager tous les pays",null,null,null,null,null,null,null,null,"Si les règles de calcul de la FIFA ne permettent pas de départager les ex-aequos,"]
[null,null,"et il y a très peu de chances qu'il y ait des ex-aequos.",null,null,null,null,null,null,null,null,"alors le tableau des huitièmes de finales mettra en évidences les ex-aequos qui"]
[null,null,"Après avoir saisi tous les scores en phases de groupes, le tableau des huitièmes de finales doit être ainsi :",null,null,null,null,null,null,null,null,"seront départagés par un tirage au sort."]
[null,null,null,null,null,null,null,null,null,null,null,"Le tableau ressemblera à cela :"]
[]
[]
[]
[]
[]
[]
[]
[]
[]
[]
[]
[]
[]
[]
[]
[null,null,null,null,null,null,null,null,null,null,null,null,"Dans ce cas, il y a des ex-aequos dans le groupe B qui seront départagés par un "]
[null,null,null,null,null,null,null,null,null,null,null,null,"tirage au sort. Choisissez les pays dans la liste déroulante."]
[null,null,null,null,null,null,null,null,null,null,null,null,"ATTENTION, dans ce cas, les modifications apportées aux scores dans la phase "]
[null,null,null,null,null,null,null,null,null,null,null,null,"de groupe ne seront plus répercutées dans le tableau des huitièmes de finales."]
[null,null,null,null,null,null,null,null,null,null,null,null,"Il faudra reprendre un fichier vierge et ressaisir les scores pour faire une autre "]
[null,null,null,null,null,null,null,null,null,null,null,null,"simulation."]
[]
[null,null,"SAISIE DES SCORES EN PHASE FINALE"]
[]
[null,null,"Saisissez les scores des huitèmes de finales dans les colonnes \"Buts\"."]
[null,null,"En cas d'égalité, départagez les équipes aux tirs au buts en inscrivant les scores"]
[null,null,"dans les colonnes \"Pen\"."]
[null,null,"Vos pronostics des huitièmes de finales se répercutent automatiquement dans le "]
[null,null,"tableau des quarts de finales qu'il faudra renseigner de la même façon et ainsi "]
[null,null,"de suite jusqu'à la finale!!"]
[]
[]
[]
[]
[]
[]
[]
[]
[]
[]
[]
[]
[]
[]
[]
[]
[]
[]
[null,null,"4 - SAISIE DES RESULTATS PENDANT LA COUPE DU MONDE & CLASSEMENT DES PRONOSTIQUEURS"]
[]
[null,null,"Dès que la coupe du monde démarre, ne touchez plus aux pronositques."]
[null,null,"Il suffit maintenant de saisir les résultats régulièrement (ou en fin de Coupe du Monde) pour découvrir le vainqueur du concours de pronostics!!"]
[]
[null,null,"La saisie des résultats s'efectue dans l'onglet \"RESULTATS\" comme vous l'avez fait pour les onglets des pronostiqueurs."]
[]
[null,null,"Le score des pronostiqueurs est automatiquement mis à jour dans les onglets des pronostiqueurs (en haut à droite) :"]
[]
[]
[]
[]
[]
[]
[]
[]
[]
[]
[]
[]
[]
[]
[]
[]
[null,null,"Le classement des pronostiqueurs est lui aussi mis à jour au fil de la saisie des résultats.",null,null,null,null,null,null,null,null,"Si vous ne souhaitez pas que les points attribués pour chaque 1/8ème de finaliste trouvé"]
[null,null,"Onglet \"CLASSEMENT\" :",null,null,null,null,null,null,null,null,"soient additionnés au score des pronostiqueurs pendant la saisie des résultats des phases"]
[null,null,null,null,null,null,null,null,null,null,null,"de groupe, vous pouvez désactiver le calcul des scores des phases finales."]
[null,null,null,null,null,null,null,null,null,null,null,"Attention, il est impératif que cette sélection soit sur OUI lorsque les phases de poules sont"]
[null,null,null,null,null,null,null,null,null,null,null,"terminées. Sinon, le classement ne prendra pas en compte les phases finales."]

{"sheet":"RESULTATS","index":1,"n_rows":138,"n_cols":45,"rows_kept":138,"cut":false,"hidden":false,"merged":[[6,30,6,37],[6,38,6,43],[6,18,6,27],[3,9,3,12],[2,9,2,11],[5,18,5,27],[5,30,5,44],[5,1,5,13]]}
[]
[null,"RESULTATS REELS"]
[]
[null,"A SAISIR SUR CETTE PAGE"]
[]
[null,"SAISIE DES RESULTATS",null,null,null,null,null,null,null,null,null,null,null,null,null,null,null,null,"GROUPES",null,null,null,null,null,null,null,null,null,null,null,"PHASES FINALES"]
[null,"Date","Heure","Match","Groupe",1,"N",2,null,"Buts",null,null,"Buts",null,null,null,null,null,"   suivi des scores||||||||||||||||||||||||||||||||||||||||||||||||||||||||||||||||||||",null,null,null,null,null,null,null,null,null,null,null,"Dernière saisie des scores >>>",null,null,null,null,null,null,null,"jeudi 22 février 2018 à 12:34:41"]
[null,{"$f":"VLOOKUP($D8,TABLEAU_MATCHS[#All],2,FALSE)","v":"2018-06-14"},{"$f":"VLOOKUP($D8,TABLEAU_MATCHS[#All],3,FALSE)","v":"18:00:00"},1,{"$f":"\"Groupe \"&VLOOKUP($I8,TABLEAU_TEAMS[[#All],[TEAM]:[GROUP_INITIAL_RANK]],2,FALSE)","v":"Groupe A"},null,null,null,{"$f":"VLOOKUP($D8,TABLEAU_MATCHS[#All],4,FALSE)","v":"Russie"},null,null,{"$f":"VLOOKUP($D8,TABLEAU_MATCHS[#All],5,FALSE)","v":"Arabie Saoudite"},null,null,null,null,null,null,"Rg","Groupe A","MJ","G","N","P","BP","BC","+/-","Pts",null,null,"Date","Finale",null,null,"Buts",null,"Pen",null,null,null,"Buts",null,"Pen"]
[null,{"$f":"VLOOKUP($D9,TABLEAU_MATCHS[#All],2,FALSE)","v":"2018-06-15"},{"$f":"VLOOKUP($D9,TABLEAU_MATCHS[#All],3,FALSE)","v":"17:00:00"},2,{"$f":"\"Groupe \"&VLOOKUP($I9,TABLEAU_TEAMS[[#All],[TEAM]:[GROUP_INITIAL_RANK]],2,FALSE)","v":"Groupe A"},null,null,null,{"$f":"VLOOKUP($D9,TABLEAU_MATCHS[#All],4,FALSE)","v":"Egypte"},null,null,{"$f":"VLOOKUP($D9,TABLEAU_MATCHS[#All],5,FALSE)","v":"Uruguay"},null,null,null,null,{"$f":"INDEX($Q60:$Q63,MATCH(SMALL(COUNTIF($Q60:$Q63,\">=\"&$Q60:$Q63),ROW(INDIRECT(\"1:\"&ROWS($Q60:$Q63)))),COUNTIF($Q60:$Q63,\">=\"&$Q60:$Q63),0))","v":"00000Uruguay"},{"$f":"INDEX($R60:$R63,MATCH(SMALL(COUNTIF($Q60:$Q63,\">=\"&$Q60:$Q63),ROW(INDIRECT(\"1:\"&ROWS($Q60:$Q63)))),COUNTIF($Q60:$Q63,\">=\"&$Q60:$Q63),0))","v":0},{"$f":"INDEX($S60:$S63,MATCH(SMALL(COUNTIF($Q60:$Q63,\">=\"&$Q60:$Q63),ROW(INDIRECT(\"1:\"&ROWS($Q60:$Q63)))),COUNTIF($Q60:$Q63,\">=\"&$Q60:$Q63),0))","v":1},{"$f":"INDEX($T60:$T63,MATCH(SMALL(COUNTIF($Q60:$Q63,\">=\"&$Q60:$Q63),ROW(INDIRECT(\"1:\"&ROWS($Q60:$Q63)))),COUNTIF($Q60:$Q63,\">=\"&$Q60:$Q63),0))","v":"Uruguay"},{"$f":"SUMPRODUCT((Teams1=T9)*(Teams1_Score<>\"\"))+SUMPRODUCT((Teams2=T9)*(Teams2_Score<>\"\"))","v":0},{"$f":"SUMPRODUCT((Teams1=T9)*(Teams1_Score>Teams2_Score))+SUMPRODUCT((Teams2=T9)*(Teams2_Score>Teams1_Score))","v":0},{"$f":"SUMPRODUCT((Teams1=T9)*(Teams1_Score=Teams2_Score)*(Teams1_Score<>\"\"))+SUMPRODUCT((Teams2=T9)*(Teams2_Score=Teams1_Score)*(Teams2_Score<>\"\"))","v":0},{"$f":"SUMPRODUCT((Teams1=T9)*(Teams1_Score<Teams2_Score))+SUMPRODUCT((Teams2=T9)*(Teams2_Score<Teams1_Score))","v":0},{"$f":"SUMPRODUCT((Teams1=T9)*(Teams1_Score))+SUMPRODUCT((Teams2=T9)*(Teams2_Score))","v":0},{"$f":"SUMPRODUCT((Teams1=T9)*(Teams2_Score))+SUMPRODUCT((Teams2=T9)*(Teams1_Score))","v":0},{"$f":"Y9-Z9","v":0},{"$f":"3*V9+W9","v":0}]
[null,{"$f":"VLOOKUP($D10,TABLEAU_MATCHS[#All],2,FALSE)","v":"2018-06-15"},{"$f":"VLOOKUP($D10,TABLEAU_MATCHS[#All],3,FALSE)","v":"18:00:00"},3,{"$f":"\"Groupe \"&VLOOKUP($I10,TABLEAU_TEAMS[[#All],[TEAM]:[GROUP_INITIAL_RANK]],2,FALSE)","v":"Groupe B"},null,null,null,{"$f":"VLOOKUP($D10,TABLEAU_MATCHS[#All],4,FALSE)","v":"Maroc"},null,null,{"$f":"VLOOKUP($D10,TABLEAU_MATCHS[#All],5,FALSE)","v":"RI Iran"},null,null,null,null,"00000Russie",0,1,"Russie",{"$f":"SUMPRODUCT((Teams1=T10)*(Teams1_Score<>\"\"))+SUMPRODUCT((Teams2=T10)*(Teams2_Score<>\"\"))","v":0},{"$f":"SUMPRODUCT((Teams1=T10)*(Teams1_Score>Teams2_Score))+SUMPRODUCT((Teams2=T10)*(Teams2_Score>Teams1_Score))","v":0},{"$f":"SUMPRODUCT((Teams1=T10)*(Teams1_Score=Teams2_Score)*(Teams1_Score<>\"\"))+SUMPRODUCT((Teams2=T10)*(Teams2_Score=Teams1_Score)*(Teams2_Score<>\"\"))","v":0},{"$f":"SUMPRODUCT((Teams1=T10)*(Teams1_Score<Teams2_Score))+SUMPRODUCT((Teams2=T10)*(Teams2_Score<Teams1_Score))","v":0},{"$f":"SUMPRODUCT((Teams1=T10)*(Teams1_Score))+SUMPRODUCT((Teams2=T10)*(Teams2_Score))","v":0},{"$f":"SUMPRODUCT((Teams1=T10)*(Teams2_Score))+SUMPRODUCT((Teams2=T10)*(Teams1_Score))","v":0},{"$f":"Y10-Z10","v":0},{"$f":"3*V10+W10","v":0},null,null,"2018-07-15",null,{"$f":"+IF(AI18<>\"\",IF(AH18>AN18,AG18,AM18),\"Vainqueur 1\")","v":"Vainqueur 1"},{"$f":"AI10*10+AK10","v":0},null,null,null,null,{"$f":"+IF(AI19<>\"\",IF(AH19>AN19,AG19,AM19),\"Vainqueur 2\")","v":"Vainqueur 2"},{"$f":"AO10*10+AQ10","v":0},null,null,null,null,{"$f":"IF(AI10<>\"\",IF(AH10>AN10,AG10,AM10),\"\")","v":""}]
[null,{"$f":"VLOOKUP($D11,TABLEAU_MATCHS[#All],2,FALSE)","v":"2018-06-15"},{"$f":"VLOOKUP($D11,TABLEAU_MATCHS[#All],3,FALSE)","v":"21:00:00"},4,{"$f":"\"Groupe \"&VLOOKUP($I11,TABLEAU_TEAMS[[#All],[TEAM]:[GROUP_INITIAL_RANK]],2,FALSE)","v":"Groupe B"},null,null,null,{"$f":"VLOOKUP($D11,TABLEAU_MATCHS[#All],4,FALSE)","v":"Portugal"},null,null,{"$f":"VLOOKUP($D11,TABLEAU_MATCHS[#All],5,FALSE)","v":"Espagne"},null,null,null,null,"00000Egypte",0,1,"Egypte",{"$f":"SUMPRODUCT((Teams1=T11)*(Teams1_Score<>\"\"))+SUMPRODUCT((Teams2=T11)*(Teams2_Score<>\"\"))","v":0},{"$f":"SUMPRODUCT((Teams1=T11)*(Teams1_Score>Teams2_Score))+SUMPRODUCT((Teams2=T11)*(Teams2_Score>Teams1_Score))","v":0},{"$f":"SUMPRODUCT((Teams1=T11)*(Teams1_Score=Teams2_Score)*(Teams1_Score<>\"\"))+SUMPRODUCT((Teams2=T11)*(Teams2_Score=Teams1_Score)*(Teams2_Score<>\"\"))","v":0},{"$f":"SUMPRODUCT((Teams1=T11)*(Teams1_Score<Teams2_Score))+SUMPRODUCT((Teams2=T11)*(Teams2_Score<Teams1_Score))","v":0},{"$f":"SUMPRODUCT((Teams1=T11)*(Teams1_Score))+SUMPRODUCT((Teams2=T11)*(Teams2_Score))","v":0},{"$f":"SUMPRODUCT((Teams1=T11)*(Teams2_Score))+SUMPRODUCT((Teams2=T11)*(Teams1_Score))","v":0},0,0]
[null,{"$f":"VLOOKUP($D12,TABLEAU_MATCHS[#All],2,FALSE)","v":"2018-06-16"},{"$f":"VLOOKUP($D12,TABLEAU_MATCHS[#All],3,FALSE)","v":"13:00:00"},5,{"$f":"\"Groupe \"&VLOOKUP($I12,TABLEAU_TEAMS[[#All],[TEAM]:[GROUP_INITIAL_RANK]],2,FALSE)","v":"Groupe C"},null,null,null,{"$f":"VLOOKUP($D12,TABLEAU_MATCHS[#All],4,FALSE)","v":"France"},null,null,{"$f":"VLOOKUP($D12,TABLEAU_MATCHS[#All],5,FALSE)","v":"Australie"},null,null,null,null,"00000Arabie Saoudite",0,1,"Arabie Saoudite",{"$f":"SUMPRODUCT((Teams1=T12)*(Teams1_Score<>\"\"))+SUMPRODUCT((Teams2=T12)*(Teams2_Score<>\"\"))","v":0},{"$f":"SUMPRODUCT((Teams1=T12)*(Teams1_Score>Teams2_Score))+SUMPRODUCT((Teams2=T12)*(Teams2_Score>Teams1_Score))","v":0},{"$f":"SUMPRODUCT((Teams1=T12)*(Teams1_Score=Teams2_Score)*(Teams1_Score<>\"\"))+SUMPRODUCT((Teams2=T12)*(Teams2_Score=Teams1_Score)*(Teams2_Score<>\"\"))","v":0},{"$f":"SUMPRODUCT((Teams1=T12)*(Teams1_Score<Teams2_Score))+SUMPRODUCT((Teams2=T12)*(Teams2_Score<Teams1_Score))","v":0},{"$f":"SUMPRODUCT((Teams1=T12)*(Teams1_Score))+SUMPRODUCT((Teams2=T12)*(Teams2_Score))","v":0},{"$f":"SUMPRODUCT((Teams1=T12)*(Teams2_Score))+SUMPRODUCT((Teams2=T12)*(Teams1_Score))","v":0},0,0,null,null,"Date","Petite Finale",null,null,"Buts",null,"Pen",null,null,null,"Buts",null,"Pen"]
[null,{"$f":"VLOOKUP($D13,TABLEAU_MATCHS[#All],2,FALSE)","v":"2018-06-16"},{"$f":"VLOOKUP($D13,TABLEAU_MATCHS[#All],3,FALSE)","v":"19:00:00"},6,{"$f":"\"Groupe \"&VLOOKUP($I13,TABLEAU_TEAMS[[#All],[TEAM]:[GROUP_INITIAL_RANK]],2,FALSE)","v":"Groupe C"},null,null,null,{"$f":"VLOOKUP($D13,TABLEAU_MATCHS[#All],4,FALSE)","v":"Pérou"},null,null,{"$f":"VLOOKUP($D13,TABLEAU_MATCHS[#All],5,FALSE)","v":"Danemark"}]
[null,{"$f":"VLOOKUP($D14,TABLEAU_MATCHS[#All],2,FALSE)","v":"2018-06-16"},{"$f":"VLOOKUP($D14,TABLEAU_MATCHS[#All],3,FALSE)","v":"16:00:00"},7,{"$f":"\"Groupe \"&VLOOKUP($I14,TABLEAU_TEAMS[[#All],[TEAM]:[GROUP_INITIAL_RANK]],2,FALSE)","v":"Groupe D"},null,null,null,{"$f":"VLOOKUP($D14,TABLEAU_MATCHS[#All],4,FALSE)","v":"Argentine"},null,null,{"$f":"VLOOKUP($D14,TABLEAU_MATCHS[#All],5,FALSE)","v":"Islande"},null,null,null,null,null,null,"Rg","Groupe B","MJ","G","N","P","BP","BC","+/-","Pts",null,null,"2018-07-14",null,{"$f":"+IF(AI18<>\"\",IF(AH18>AN18,AM18,AG18),\"Perdant 1\")","v":"Perdant 1"},{"$f":"AI14*10+AK14","v":0},null,null,null,null,{"$f":"+IF(AI19<>\"\",IF(AH19>AN19,AM19,AG19),\"Perdant 2\")","v":"Perdant 2"},{"$f":"AO14*10+AQ14","v":0}]
[null,{"$f":"VLOOKUP($D15,TABLEAU_MATCHS[#All],2,FALSE)","v":"2018-06-16"},{"$f":"VLOOKUP($D15,TABLEAU_MATCHS[#All],3,FALSE)","v":"21:00:00"},8,{"$f":"\"Groupe \"&VLOOKUP($I15,TABLEAU_TEAMS[[#All],[TEAM]:[GROUP_INITIAL_RANK]],2,FALSE)","v":"Groupe D"},null,null,null,{"$f":"VLOOKUP($D15,TABLEAU_MATCHS[#All],4,FALSE)","v":"Croatie"},null,null,{"$f":"VLOOKUP($D15,TABLEAU_MATCHS[#All],5,FALSE)","v":"Nigeria"},null,null,null,null,{"$f":"INDEX($Q66:$Q69,MATCH(SMALL(COUNTIF($Q66:$Q69,\">=\"&$Q66:$Q69),ROW(INDIRECT(\"1:\"&ROWS($Q66:$Q69)))),COUNTIF($Q66:$Q69,\">=\"&$Q66:$Q69),0))","v":"00000RI Iran"},{"$f":"INDEX($R66:$R69,MATCH(SMALL(COUNTIF($Q66:$Q69,\">=\"&$Q66:$Q69),ROW(INDIRECT(\"1:\"&ROWS($Q66:$Q69)))),COUNTIF($Q66:$Q69,\">=\"&$Q66:$Q69),0))","v":0},{"$f":"INDEX($S66:$S69,MATCH(SMALL(COUNTIF($Q66:$Q69,\">=\"&$Q66:$Q69),ROW(INDIRECT(\"1:\"&ROWS($Q66:$Q69)))),COUNTIF($Q66:$Q69,\">=\"&$Q66:$Q69),0))","v":1},{"$f":"INDEX($T66:$T69,MATCH(SMALL(COUNTIF($Q66:$Q69,\">=\"&$Q66:$Q69),ROW(INDIRECT(\"1:\"&ROWS($Q66:$Q69)))),COUNTIF($Q66:$Q69,\">=\"&$Q66:$Q69),0))","v":"RI Iran"},{"$f":"SUMPRODUCT((Teams1=T15)*(Teams1_Score<>\"\"))+SUMPRODUCT((Teams2=T15)*(Teams2_Score<>\"\"))","v":0},{"$f":"SUMPRODUCT((Teams1=T15)*(Teams1_Score>Teams2_Score))+SUMPRODUCT((Teams2=T15)*(Teams2_Score>Teams1_Score))","v":0},{"$f":"SUMPRODUCT((Teams1=T15)*(Teams1_Score=Teams2_Score)*(Teams1_Score<>\"\"))+SUMPRODUCT((Teams2=T15)*(Teams2_Score=Teams1_Score)*(Teams2_Score<>\"\"))","v":0},{"$f":"SUMPRODUCT((Teams1=T15)*(Teams1_Score<Teams2_Score))+SUMPRODUCT((Teams2=T15)*(Teams2_Score<Teams1_Score))","v":0},{"$f":"SUMPRODUCT((Teams1=T15)*(Teams1_Score))+SUMPRODUCT((Teams2=T15)*(Teams2_Score))","v":0},{"$f":"SUMPRODUCT((Teams1=T15)*(Teams2_Score))+SUMPRODUCT((Teams2=T15)*(Teams1_Score))","v":0},{"$f":"Y15-Z15","v":0},{"$f":"3*V15+W15","v":0}]
[null,{"$f":"VLOOKUP($D16,TABLEAU_MATCHS[#All],2,FALSE)","v":"2018-06-17"},{"$f":"VLOOKUP($D16,TABLEAU_MATCHS[#All],3,FALSE)","v":"16:00:00"},9,{"$f":"\"Groupe \"&VLOOKUP($I16,TABLEAU_TEAMS[[#All],[TEAM]:[GROUP_INITIAL_RANK]],2,FALSE)","v":"Groupe E"},null,null,null,{"$f":"VLOOKUP($D16,TABLEAU_MATCHS[#All],4,FALSE)","v":"Costa Rica"},null,null,{"$f":"VLOOKUP($D16,TABLEAU_MATCHS[#All],5,FALSE)","v":"Serbie"},null,null,null,null,"00000Portugal",0,1,"Portugal",{"$f":"SUMPRODUCT((Teams1=T16)*(Teams1_Score<>\"\"))+SUMPRODUCT((Teams2=T16)*(Teams2_Score<>\"\"))","v":0},{"$f":"SUMPRODUCT((Teams1=T16)*(Teams1_Score>Teams2_Score))+SUMPRODUCT((Teams2=T16)*(Teams2_Score>Teams1_Score))","v":0},{"$f":"SUMPRODUCT((Teams1=T16)*(Teams1_Score=Teams2_Score)*(Teams1_Score<>\"\"))+SUMPRODUCT((Teams2=T16)*(Teams2_Score=Teams1_Score)*(Teams2_Score<>\"\"))","v":0},{"$f":"SUMPRODUCT((Teams1=T16)*(Teams1_Score<Teams2_Score))+SUMPRODUCT((Teams2=T16)*(Teams2_Score<Teams1_Score))","v":0},{"$f":"SUMPRODUCT((Teams1=T16)*(Teams1_Score))+SUMPRODUCT((Teams2=T16)*(Teams2_Score))","v":0},{"$f":"SUMPRODUCT((Teams1=T16)*(Teams2_Score))+SUMPRODUCT((Teams2=T16)*(Teams1_Score))","v":0},0,0,null,null,"Date","Demi Finale",null,null,"Buts",null,"Pen",null,null,null,"Buts",null,"Pen"]
[null,{"$f":"VLOOKUP($D17,TABLEAU_MATCHS[#All],2,FALSE)","v":"2018-06-17"},{"$f":"VLOOKUP($D17,TABLEAU_MATCHS[#All],3,FALSE)","v":"21:00:00"},10,{"$f":"\"Groupe \"&VLOOKUP($I17,TABLEAU_TEAMS[[#All],[TEAM]:[GROUP_INITIAL_RANK]],2,FALSE)","v":"Groupe E"},null,null,null,{"$f":"VLOOKUP($D17,TABLEAU_MATCHS[#All],4,FALSE)","v":"Brésil"},null,null,{"$f":"VLOOKUP($D17,TABLEAU_MATCHS[#All],5,FALSE)","v":"Suisse"},null,null,null,null,"00000Maroc",0,1,"Maroc",{"$f":"SUMPRODUCT((Teams1=T17)*(Teams1_Score<>\"\"))+SUMPRODUCT((Teams2=T17)*(Teams2_Score<>\"\"))","v":0},{"$f":"SUMPRODUCT((Teams1=T17)*(Teams1_Score>Teams2_Score))+SUMPRODUCT((Teams2=T17)*(Teams2_Score>Teams1_Score))","v":0},{"$f":"SUMPRODUCT((Teams1=T17)*(Teams1_Score=Teams2_Score)*(Teams1_Score<>\"\"))+SUMPRODUCT((Teams2=T17)*(Teams2_Score=Teams1_Score)*(Teams2_Score<>\"\"))","v":0},{"$f":"SUMPRODUCT((Teams1=T17)*(Teams1_Score<Teams2_Score))+SUMPRODUCT((Teams2=T17)*(Teams2_Score<Teams1_Score))","v":0},{"$f":"SUMPRODUCT((Teams1=T17)*(Teams1_Score))+SUMPRODUCT((Teams2=T17)*(Teams2_Score))","v":0},{"$f":"SUMPRODUCT((Teams1=T17)*(Teams2_Score))+SUMPRODUCT((Teams2=T17)*(Teams1_Score))","v":0},0,0]
[null,{"$f":"VLOOKUP($D18,TABLEAU_MATCHS[#All],2,FALSE)","v":"2018-06-17"},{"$f":"VLOOKUP($D18,TABLEAU_MATCHS[#All],3,FALSE)","v":"18:00:00"},11,{"$f":"\"Groupe \"&VLOOKUP($I18,TABLEAU_TEAMS[[#All],[TEAM]:[GROUP_INITIAL_RANK]],2,FALSE)","v":"Groupe F"},null,null,null,{"$f":"VLOOKUP($D18,TABLEAU_MATCHS[#All],4,FALSE)","v":"Allemagne"},null,null,{"$f":"VLOOKUP($D18,TABLEAU_MATCHS[#All],5,FALSE)","v":"Mexique"},null,null,null,null,"00000Espagne",0,1,"Espagne",{"$f":"SUMPRODUCT((Teams1=T18)*(Teams1_Score<>\"\"))+SUMPRODUCT((Teams2=T18)*(Teams2_Score<>\"\"))","v":0},{"$f":"SUMPRODUCT((Teams1=T18)*(Teams1_Score>Teams2_Score))+SUMPRODUCT((Teams2=T18)*(Teams2_Score>Teams1_Score))","v":0},{"$f":"SUMPRODUCT((Teams1=T18)*(Teams1_Score=Teams2_Score)*(Teams1_Score<>\"\"))+SUMPRODUCT((Teams2=T18)*(Teams2_Score=Teams1_Score)*(Teams2_Score<>\"\"))","v":0},{"$f":"SUMPRODUCT((Teams1=T18)*(Teams1_Score<Teams2_Score))+SUMPRODUCT((Teams2=T18)*(Teams2_Score<Teams1_Score))","v":0},{"$f":"SUMPRODUCT((Teams1=T18)*(Teams1_Score))+SUMPRODUCT((Teams2=T18)*(Teams2_Score))","v":0},{"$f":"SUMPRODUCT((Teams1=T18)*(Teams2_Score))+SUMPRODUCT((Teams2=T18)*(Teams1_Score))","v":0},0,0,null,null,"2018-07-10",1,{"$f":"+IF(AI23<>\"\",IF(AH23>AN23,AG23,AM23),\"Vainqueur A\")","v":"Vainqueur A"},{"$f":"AI18*10+AK18","v":0},null,null,null,null,{"$f":"+IF(AI25<>\"\",IF(AH25>AN25,AG25,AM25),\"Vainqueur C\")","v":"Vainqueur C"},{"$f":"AO18*10+AQ18","v":0}]
[null,{"$f":"VLOOKUP($D19,TABLEAU_MATCHS[#All],2,FALSE)","v":"2018-06-18"},{"$f":"VLOOKUP($D19,TABLEAU_MATCHS[#All],3,FALSE)","v":"15:00:00"},12,{"$f":"\"Groupe \"&VLOOKUP($I19,TABLEAU_TEAMS[[#All],[TEAM]:[GROUP_INITIAL_RANK]],2,FALSE)","v":"Groupe F"},null,null,null,{"$f":"VLOOKUP($D19,TABLEAU_MATCHS[#All],4,FALSE)","v":"Suède"},null,null,{"$f":"VLOOKUP($D19,TABLEAU_MATCHS[#All],5,FALSE)","v":"République de Corée"},null,null,null,null,null,null,null,null,null,null,null,null,null,null,null,null,null,null,"2018-07-11",2,{"$f":"+IF(AI24<>\"\",IF(AH24>AN24,AG24,AM24),\"Vainqueur B\")","v":"Vainqueur B"},0,null,null,null,null,{"$f":"+IF(AI26<>\"\",IF(AH26>AN26,AG26,AM26),\"Vainqueur D\")","v":"Vainqueur D"},0]
[null,{"$f":"VLOOKUP($D20,TABLEAU_MATCHS[#All],2,FALSE)","v":"2018-06-18"},{"$f":"VLOOKUP($D20,TABLEAU_MATCHS[#All],3,FALSE)","v":"18:00:00"},13,{"$f":"\"Groupe \"&VLOOKUP($I20,TABLEAU_TEAMS[[#All],[TEAM]:[GROUP_INITIAL_RANK]],2,FALSE)","v":"Groupe G"},null,null,null,{"$f":"VLOOKUP($D20,TABLEAU_MATCHS[#All],4,FALSE)","v":"Belgique"},null,null,{"$f":"VLOOKUP($D20,TABLEAU_MATCHS[#All],5,FALSE)","v":"Panama"},null,null,null,null,null,null,"Rg","Groupe C","MJ","G","N","P","BP","BC","+/-","Pts"]
[null,{"$f":"VLOOKUP($D21,TABLEAU_MATCHS[#All],2,FALSE)","v":"2018-06-18"},{"$f":"VLOOKUP($D21,TABLEAU_MATCHS[#All],3,FALSE)","v":"21:00:00"},14,{"$f":"\"Groupe \"&VLOOKUP($I21,TABLEAU_TEAMS[[#All],[TEAM]:[GROUP_INITIAL_RANK]],2,FALSE)","v":"Groupe G"},null,null,null,{"$f":"VLOOKUP($D21,TABLEAU_MATCHS[#All],4,FALSE)","v":"Tunisie"},null,null,{"$f":"VLOOKUP($D21,TABLEAU_MATCHS[#All],5,FALSE)","v":"Angleterre"},null,null,null,null,{"$f":"INDEX($Q72:$Q75,MATCH(SMALL(COUNTIF($Q72:$Q75,\">=\"&$Q72:$Q75),ROW(INDIRECT(\"1:\"&ROWS($Q72:$Q75)))),COUNTIF($Q72:$Q75,\">=\"&$Q72:$Q75),0))","v":"00000Pérou"},{"$f":"INDEX($R72:$R75,MATCH(SMALL(COUNTIF($Q72:$Q75,\">=\"&$Q72:$Q75),ROW(INDIRECT(\"1:\"&ROWS($Q72:$Q75)))),COUNTIF($Q72:$Q75,\">=\"&$Q72:$Q75),0))","v":0},{"$f":"INDEX($S72:$S75,MATCH(SMALL(COUNTIF($Q72:$Q75,\">=\"&$Q72:$Q75),ROW(INDIRECT(\"1:\"&ROWS($Q72:$Q75)))),COUNTIF($Q72:$Q75,\">=\"&$Q72:$Q75),0))","v":1},{"$f":"INDEX($T72:$T75,MATCH(SMALL(COUNTIF($Q72:$Q75,\">=\"&$Q72:$Q75),ROW(INDIRECT(\"1:\"&ROWS($Q72:$Q75)))),COUNTIF($Q72:$Q75,\">=\"&$Q72:$Q75),0))","v":"Pérou"},{"$f":"SUMPRODUCT((Teams1=T21)*(Teams1_Score<>\"\"))+SUMPRODUCT((Teams2=T21)*(Teams2_Score<>\"\"))","v":0},{"$f":"SUMPRODUCT((Teams1=T21)*(Teams1_Score>Teams2_Score))+SUMPRODUCT((Teams2=T21)*(Teams2_Score>Teams1_Score))","v":0},{"$f":"SUMPRODUCT((Teams1=T21)*(Teams1_Score=Teams2_Score)*(Teams1_Score<>\"\"))+SUMPRODUCT((Teams2=T21)*(Teams2_Score=Teams1_Score)*(Teams2_Score<>\"\"))","v":0},{"$f":"SUMPRODUCT((Teams1=T21)*(Teams1_Score<Teams2_Score))+SUMPRODUCT((Teams2=T21)*(Teams2_Score<Teams1_Score))","v":0},{"$f":"SUMPRODUCT((Teams1=T21)*(Teams1_Score))+SUMPRODUCT((Teams2=T21)*(Teams2_Score))","v":0},{"$f":"SUMPRODUCT((Teams1=T21)*(Teams2_Score))+SUMPRODUCT((Teams2=T21)*(Teams1_Score))","v":0},{"$f":"Y21-Z21","v":0},{"$f":"3*V21+W21","v":0},null,null,"Date","Quart de Finale",null,null,"Buts",null,"Pen",null,null,null,"Buts",null,"Pen"]
[null,{"$f":"VLOOKUP($D22,TABLEAU_MATCHS[#All],2,FALSE)","v":"2018-06-19"},{"$f":"VLOOKUP($D22,TABLEAU_MATCHS[#All],3,FALSE)","v":"15:00:00"},15,{"$f":"\"Groupe \"&VLOOKUP($I22,TABLEAU_TEAMS[[#All],[TEAM]:[GROUP_INITIAL_RANK]],2,FALSE)","v":"Groupe H"},null,null,null,{"$f":"VLOOKUP($D22,TABLEAU_MATCHS[#All],4,FALSE)","v":"Colombie"},null,null,{"$f":"VLOOKUP($D22,TABLEAU_MATCHS[#All],5,FALSE)","v":"Japon"},null,null,null,null,"00000France",0,1,"France",{"$f":"SUMPRODUCT((Teams1=T22)*(Teams1_Score<>\"\"))+SUMPRODUCT((Teams2=T22)*(Teams2_Score<>\"\"))","v":0},{"$f":"SUMPRODUCT((Teams1=T22)*(Teams1_Score>Teams2_Score))+SUMPRODUCT((Teams2=T22)*(Teams2_Score>Teams1_Score))","v":0},{"$f":"SUMPRODUCT((Teams1=T22)*(Teams1_Score=Teams2_Score)*(Teams1_Score<>\"\"))+SUMPRODUCT((Teams2=T22)*(Teams2_Score=Teams1_Score)*(Teams2_Score<>\"\"))","v":0},{"$f":"SUMPRODUCT((Teams1=T22)*(Teams1_Score<Teams2_Score))+SUMPRODUCT((Teams2=T22)*(Teams2_Score<Teams1_Score))","v":0},{"$f":"SUMPRODUCT((Teams1=T22)*(Teams1_Score))+SUMPRODUCT((Teams2=T22)*(Teams2_Score))","v":0},{"$f":"SUMPRODUCT((Teams1=T22)*(Teams2_Score))+SUMPRODUCT((Teams2=T22)*(Teams1_Score))","v":0},0,0]
[null,{"$f":"VLOOKUP($D23,TABLEAU_MATCHS[#All],2,FALSE)","v":"2018-06-19"},{"$f":"VLOOKUP($D23,TABLEAU_MATCHS[#All],3,FALSE)","v":"18:00:00"},16,{"$f":"\"Groupe \"&VLOOKUP($I23,TABLEAU_TEAMS[[#All],[TEAM]:[GROUP_INITIAL_RANK]],2,FALSE)","v":"Groupe H"},null,null,null,{"$f":"VLOOKUP($D23,TABLEAU_MATCHS[#All],4,FALSE)","v":"Pologne"},null,null,{"$f":"VLOOKUP($D23,TABLEAU_MATCHS[#All],5,FALSE)","v":"Sénégal"},null,null,null,null,"00000Danemark",0,1,"Danemark",{"$f":"SUMPRODUCT((Teams1=T23)*(Teams1_Score<>\"\"))+SUMPRODUCT((Teams2=T23)*(Teams2_Score<>\"\"))","v":0},{"$f":"SUMPRODUCT((Teams1=T23)*(Teams1_Score>Teams2_Score))+SUMPRODUCT((Teams2=T23)*(Teams2_Score>Teams1_Score))","v":0},{"$f":"SUMPRODUCT((Teams1=T23)*(Teams1_Score=Teams2_Score)*(Teams1_Score<>\"\"))+SUMPRODUCT((Teams2=T23)*(Teams2_Score=Teams1_Score)*(Teams2_Score<>\"\"))","v":0},{"$f":"SUMPRODUCT((Teams1=T23)*(Teams1_Score<Teams2_Score))+SUMPRODUCT((Teams2=T23)*(Teams2_Score<Teams1_Score))","v":0},{"$f":"SUMPRODUCT((Teams1=T23)*(Teams1_Score))+SUMPRODUCT((Teams2=T23)*(Teams2_Score))","v":0},{"$f":"SUMPRODUCT((Teams1=T23)*(Teams2_Score))+SUMPRODUCT((Teams2=T23)*(Teams1_Score))","v":0},0,0,null,null,"2018-07-06","A",{"$f":"+IF(AI30<>\"\",IF(AH30>AN30,AG30,AM30),\"Vainqueur 1\")","v":"Vainqueur 1"},{"$f":"AI23*10+AK23","v":0},null,null,null,null,{"$f":"+IF(AI32<>\"\",IF(AH32>AN32,AG32,AM32),\"Vainqueur 3\")","v":"Vainqueur 3"},{"$f":"AO23*10+AQ23","v":0}]
[null,{"$f":"VLOOKUP($D24,TABLEAU_MATCHS[#All],2,FALSE)","v":"2018-06-19"},{"$f":"VLOOKUP($D24,TABLEAU_MATCHS[#All],3,FALSE)","v":"21:00:00"},17,{"$f":"\"Groupe \"&VLOOKUP($I24,TABLEAU_TEAMS[[#All],[TEAM]:[GROUP_INITIAL_RANK]],2,FALSE)","v":"Groupe A"},null,null,null,{"$f":"VLOOKUP($D24,TABLEAU_MATCHS[#All],4,FALSE)","v":"Russie"},null,null,{"$f":"VLOOKUP($D24,TABLEAU_MATCHS[#All],5,FALSE)","v":"Egypte"},null,null,null,null,"00000Australie",0,1,"Australie",{"$f":"SUMPRODUCT((Teams1=T24)*(Teams1_Score<>\"\"))+SUMPRODUCT((Teams2=T24)*(Teams2_Score<>\"\"))","v":0},{"$f":"SUMPRODUCT((Teams1=T24)*(Teams1_Score>Teams2_Score))+SUMPRODUCT((Teams2=T24)*(Teams2_Score>Teams1_Score))","v":0},{"$f":"SUMPRODUCT((Teams1=T24)*(Teams1_Score=Teams2_Score)*(Teams1_Score<>\"\"))+SUMPRODUCT((Teams2=T24)*(Teams2_Score=Teams1_Score)*(Teams2_Score<>\"\"))","v":0},{"$f":"SUMPRODUCT((Teams1=T24)*(Teams1_Score<Teams2_Score))+SUMPRODUCT((Teams2=T24)*(Teams2_Score<Teams1_Score))","v":0},{"$f":"SUMPRODUCT((Teams1=T24)*(Teams1_Score))+SUMPRODUCT((Teams2=T24)*(Teams2_Score))","v":0},{"$f":"SUMPRODUCT((Teams1=T24)*(Teams2_Score))+SUMPRODUCT((Teams2=T24)*(Teams1_Score))","v":0},0,0,null,null,"2018-07-07","B",{"$f":"+IF(AI31<>\"\",IF(AH31>AN31,AG31,AM31),\"Vainqueur 2\")","v":"Vainqueur 2"},0,null,null,null,null,{"$f":"+IF(AI33<>\"\",IF(AH33>AN33,AG33,AM33),\"Vainqueur 4\")","v":"Vainqueur 4"},0]
[null,{"$f":"VLOOKUP($D25,TABLEAU_MATCHS[#All],2,FALSE)","v":"2018-06-20"},{"$f":"VLOOKUP($D25,TABLEAU_MATCHS[#All],3,FALSE)","v":"18:00:00"},18,{"$f":"\"Groupe \"&VLOOKUP($I25,TABLEAU_TEAMS[[#All],[TEAM]:[GROUP_INITIAL_RANK]],2,FALSE)","v":"Groupe A"},null,null,null,{"$f":"VLOOKUP($D25,TABLEAU_MATCHS[#All],4,FALSE)","v":"Uruguay"},null,null,{"$f":"VLOOKUP($D25,TABLEAU_MATCHS[#All],5,FALSE)","v":"Arabie Saoudite"},null,null,null,null,null,null,null,null,null,null,null,null,null,null,null,null,null,null,"2018-07-06","C",{"$f":"+IF(AI34<>\"\",IF(AH34>AN34,AG34,AM34),\"Vainqueur 5\")","v":"Vainqueur 5"},0,null,null,null,null,{"$f":"+IF(AI36<>\"\",IF(AH36>AN36,AG36,AM36),\"Vainqueur 7\")","v":"Vainqueur 7"},0]
[null,{"$f":"VLOOKUP($D26,TABLEAU_MATCHS[#All],2,FALSE)","v":"2018-06-20"},{"$f":"VLOOKUP($D26,TABLEAU_MATCHS[#All],3,FALSE)","v":"15:00:00"},19,{"$f":"\"Groupe \"&VLOOKUP($I26,TABLEAU_TEAMS[[#All],[TEAM]:[GROUP_INITIAL_RANK]],2,FALSE)","v":"Groupe B"},null,null,null,{"$f":"VLOOKUP($D26,TABLEAU_MATCHS[#All],4,FALSE)","v":"Portugal"},null,null,{"$f":"VLOOKUP($D26,TABLEAU_MATCHS[#All],5,FALSE)","v":"Maroc"},null,null,null,null,null,null,"Rg","Groupe D","MJ","G","N","P","BP","BC","+/-","Pts",null,null,"2018-07-07","D",{"$f":"+IF(AI35<>\"\",IF(AH35>AN35,AG35,AM35),\"Vainqueur 6\")","v":"Vainqueur 6"},0,null,null,null,null,{"$f":"+IF(AI37<>\"\",IF(AH37>AN37,AG37,AM37),\"Vainqueur 8\")","v":"Vainqueur 8"},0]
[null,{"$f":"VLOOKUP($D27,TABLEAU_MATCHS[#All],2,FALSE)","v":"2018-06-20"},{"$f":"VLOOKUP($D27,TABLEAU_MATCHS[#All],3,FALSE)","v":"21:00:00"},20,{"$f":"\"Groupe \"&VLOOKUP($I27,TABLEAU_TEAMS[[#All],[TEAM]:[GROUP_INITIAL_RANK]],2,FALSE)","v":"Groupe B"},null,null,null,{"$f":"VLOOKUP($D27,TABLEAU_MATCHS[#All],4,FALSE)","v":"RI Iran"},null,null,{"$f":"VLOOKUP($D27,TABLEAU_MATCHS[#All],5,FALSE)","v":"Espagne"},null,null,null,null,{"$f":"INDEX($Q78:$Q81,MATCH(SMALL(COUNTIF($Q78:$Q81,\">=\"&$Q78:$Q81),ROW(INDIRECT(\"1:\"&ROWS($Q78:$Q81)))),COUNTIF($Q78:$Q81,\">=\"&$Q78:$Q81),0))","v":"00000Nigeria"},{"$f":"INDEX($R78:$R81,MATCH(SMALL(COUNTIF($Q78:$Q81,\">=\"&$Q78:$Q81),ROW(INDIRECT(\"1:\"&ROWS($Q78:$Q81)))),COUNTIF($Q78:$Q81,\">=\"&$Q78:$Q81),0))","v":0},{"$f":"INDEX($S78:$S81,MATCH(SMALL(COUNTIF($Q78:$Q81,\">=\"&$Q78:$Q81),ROW(INDIRECT(\"1:\"&ROWS($Q78:$Q81)))),COUNTIF($Q78:$Q81,\">=\"&$Q78:$Q81),0))","v":1},{"$f":"INDEX($T78:$T81,MATCH(SMALL(COUNTIF($Q78:$Q81,\">=\"&$Q78:$Q81),ROW(INDIRECT(\"1:\"&ROWS($Q78:$Q81)))),COUNTIF($Q78:$Q81,\">=\"&$Q78:$Q81),0))","v":"Nigeria"},{"$f":"SUMPRODUCT((Teams1=T27)*(Teams1_Score<>\"\"))+SUMPRODUCT((Teams2=T27)*(Teams2_Score<>\"\"))","v":0},{"$f":"SUMPRODUCT((Teams1=T27)*(Teams1_Score>Teams2_Score))+SUMPRODUCT((Teams2=T27)*(Teams2_Score>Teams1_Score))","v":0},{"$f":"SUMPRODUCT((Teams1=T27)*(Teams1_Score=Teams2_Score)*(Teams1_Score<>\"\"))+SUMPRODUCT((Teams2=T27)*(Teams2_Score=Teams1_Score)*(Teams2_Score<>\"\"))","v":0},{"$f":"SUMPRODUCT((Teams1=T27)*(Teams1_Score<Teams2_Score))+SUMPRODUCT((Teams2=T27)*(Teams2_Score<Teams1_Score))","v":0},{"$f":"SUMPRODUCT((Teams1=T27)*(Teams1_Score))+SUMPRODUCT((Teams2=T27)*(Teams2_Score))","v":0},{"$f":"SUMPRODUCT((Teams1=T27)*(Teams2_Score))+SUMPRODUCT((Teams2=T27)*(Teams1_Score))","v":0},{"$f":"Y27-Z27","v":0},{"$f":"3*V27+W27","v":0}]
[null,{"$f":"VLOOKUP($D28,TABLEAU_MATCHS[#All],2,FALSE)","v":"2018-06-21"},{"$f":"VLOOKUP($D28,TABLEAU_MATCHS[#All],3,FALSE)","v":"16:00:00"},21,{"$f":"\"Groupe \"&VLOOKUP($I28,TABLEAU_TEAMS[[#All],[TEAM]:[GROUP_INITIAL_RANK]],2,FALSE)","v":"Groupe C"},null,null,null,{"$f":"VLOOKUP($D28,TABLEAU_MATCHS[#All],4,FALSE)","v":"Danemark"},null,null,{"$f":"VLOOKUP($D28,TABLEAU_MATCHS[#All],5,FALSE)","v":"Australie"},null,null,null,null,"00000Islande",0,1,"Islande",{"$f":"SUMPRODUCT((Teams1=T28)*(Teams1_Score<>\"\"))+SUMPRODUCT((Teams2=T28)*(Teams2_Score<>\"\"))","v":0},{"$f":"SUMPRODUCT((Teams1=T28)*(Teams1_Score>Teams2_Score))+SUMPRODUCT((Teams2=T28)*(Teams2_Score>Teams1_Score))","v":0},{"$f":"SUMPRODUCT((Teams1=T28)*(Teams1_Score=Teams2_Score)*(Teams1_Score<>\"\"))+SUMPRODUCT((Teams2=T28)*(Teams2_Score=Teams1_Score)*(Teams2_Score<>\"\"))","v":0},{"$f":"SUMPRODUCT((Teams1=T28)*(Teams1_Score<Teams2_Score))+SUMPRODUCT((Teams2=T28)*(Teams2_Score<Teams1_Score))","v":0},{"$f":"SUMPRODUCT((Teams1=T28)*(Teams1_Score))+SUMPRODUCT((Teams2=T28)*(Teams2_Score))","v":0},{"$f":"SUMPRODUCT((Teams1=T28)*(Teams2_Score))+SUMPRODUCT((Teams2=T28)*(Teams1_Score))","v":0},0,0,null,null,"Date","Huitième de Finale",null,null,"Buts",null,"Pen",null,null,null,"Buts",null,"Pen"]
[null,{"$f":"VLOOKUP($D29,TABLEAU_MATCHS[#All],2,FALSE)","v":"2018-06-21"},{"$f":"VLOOKUP($D29,TABLEAU_MATCHS[#All],3,FALSE)","v":"20:00:00"},22,{"$f":"\"Groupe \"&VLOOKUP($I29,TABLEAU_TEAMS[[#All],[TEAM]:[GROUP_INITIAL_RANK]],2,FALSE)","v":"Groupe C"},null,null,null,{"$f":"VLOOKUP($D29,TABLEAU_MATCHS[#All],4,FALSE)","v":"France"},null,null,{"$f":"VLOOKUP($D29,TABLEAU_MATCHS[#All],5,FALSE)","v":"Pérou"},null,null,null,null,"00000Croatie",0,1,"Croatie",{"$f":"SUMPRODUCT((Teams1=T29)*(Teams1_Score<>\"\"))+SUMPRODUCT((Teams2=T29)*(Teams2_Score<>\"\"))","v":0},{"$f":"SUMPRODUCT((Teams1=T29)*(Teams1_Score>Teams2_Score))+SUMPRODUCT((Teams2=T29)*(Teams2_Score>Teams1_Score))","v":0},{"$f":"SUMPRODUCT((Teams1=T29)*(Teams1_Score=Teams2_Score)*(Teams1_Score<>\"\"))+SUMPRODUCT((Teams2=T29)*(Teams2_Score=Teams1_Score)*(Teams2_Score<>\"\"))","v":0},{"$f":"SUMPRODUCT((Teams1=T29)*(Teams1_Score<Teams2_Score))+SUMPRODUCT((Teams2=T29)*(Teams2_Score<Teams1_Score))","v":0},{"$f":"SUMPRODUCT((Teams1=T29)*(Teams1_Score))+SUMPRODUCT((Teams2=T29)*(Teams2_Score))","v":0},{"$f":"SUMPRODUCT((Teams1=T29)*(Teams2_Score))+SUMPRODUCT((Teams2=T29)*(Teams1_Score))","v":0},0,0]
[null,{"$f":"VLOOKUP($D30,TABLEAU_MATCHS[#All],2,FALSE)","v":"2018-06-21"},{"$f":"VLOOKUP($D30,TABLEAU_MATCHS[#All],3,FALSE)","v":"21:00:00"},23,{"$f":"\"Groupe \"&VLOOKUP($I30,TABLEAU_TEAMS[[#All],[TEAM]:[GROUP_INITIAL_RANK]],2,FALSE)","v":"Groupe D"},null,null,null,{"$f":"VLOOKUP($D30,TABLEAU_MATCHS[#All],4,FALSE)","v":"Argentine"},null,null,{"$f":"VLOOKUP($D30,TABLEAU_MATCHS[#All],5,FALSE)","v":"Croatie"},null,null,null,null,"00000Argentine",0,1,"Argentine",{"$f":"SUMPRODUCT((Teams1=T30)*(Teams1_Score<>\"\"))+SUMPRODUCT((Teams2=T30)*(Teams2_Score<>\"\"))","v":0},{"$f":"SUMPRODUCT((Teams1=T30)*(Teams1_Score>Teams2_Score))+SUMPRODUCT((Teams2=T30)*(Teams2_Score>Teams1_Score))","v":0},{"$f":"SUMPRODUCT((Teams1=T30)*(Teams1_Score=Teams2_Score)*(Teams1_Score<>\"\"))+SUMPRODUCT((Teams2=T30)*(Teams2_Score=Teams1_Score)*(Teams2_Score<>\"\"))","v":0},{"$f":"SUMPRODUCT((Teams1=T30)*(Teams1_Score<Teams2_Score))+SUMPRODUCT((Teams2=T30)*(Teams2_Score<Teams1_Score))","v":0},{"$f":"SUMPRODUCT((Teams1=T30)*(Teams1_Score))+SUMPRODUCT((Teams2=T30)*(Teams2_Score))","v":0},{"$f":"SUMPRODUCT((Teams1=T30)*(Teams2_Score))+SUMPRODUCT((Teams2=T30)*(Teams1_Score))","v":0},0,0,null,null,"2018-06-30",1,{"$f":"IF(SUM(U9:U12)=0,\"1er Groupe A\",IF(COUNTIF(S9:S12,1)=1,VLOOKUP(1,S9:T12,2,FALSE),IF(COUNTIF(S9:S12,1)>=2,\"Tirage au Sort A1\")))","v":"1er Groupe A"},{"$f":"AI30*10+AK30","v":0},null,null,null,null,{"$f":"IF(SUM(U15:U18)=0,\"2nd Groupe B\",IF(OR(COUNTIF(S15:S18,1)>1,COUNTIF(S15:S18,2)>1),\"Tirage au sort B2\",VLOOKUP(2,S15:T18,2,FALSE)))","v":"2nd Groupe B"},{"$f":"AO30*10+AQ30","v":0}]
[null,{"$f":"VLOOKUP($D31,TABLEAU_MATCHS[#All],2,FALSE)","v":"2018-06-22"},{"$f":"VLOOKUP($D31,TABLEAU_MATCHS[#All],3,FALSE)","v":"18:00:00"},24,{"$f":"\"Groupe \"&VLOOKUP($I31,TABLEAU_TEAMS[[#All],[TEAM]:[GROUP_INITIAL_RANK]],2,FALSE)","v":"Groupe D"},null,null,null,{"$f":"VLOOKUP($D31,TABLEAU_MATCHS[#All],4,FALSE)","v":"Nigeria"},null,null,{"$f":"VLOOKUP($D31,TABLEAU_MATCHS[#All],5,FALSE)","v":"Islande"},null,null,null,null,null,null,null,null,null,null,null,null,null,null,null,null,null,null,"2018-07-01",2,{"$f":"IF(SUM(U15:U18)=0,\"1er Groupe B\",IF(COUNTIF(S15:S18,1)=1,VLOOKUP(1,S15:T18,2,FALSE),IF(COUNTIF(S15:S18,1)>=2,\"Tirage au Sort B1\")))","v":"1er Groupe B"},{"$f":"AI31*10+AK31","v":0},null,null,null,null,{"$f":"IF(SUM(U9:U12)=0,\"2nd Groupe A\",IF(OR(COUNTIF(S9:S12,1)>1,COUNTIF(S9:S12,2)>1),\"Tirage au sort A2\",VLOOKUP(2,S9:T12,2,FALSE)))","v":"2nd Groupe A"},0]
[null,{"$f":"VLOOKUP($D32,TABLEAU_MATCHS[#All],2,FALSE)","v":"2018-06-22"},{"$f":"VLOOKUP($D32,TABLEAU_MATCHS[#All],3,FALSE)","v":"15:00:00"},25,{"$f":"\"Groupe \"&VLOOKUP($I32,TABLEAU_TEAMS[[#All],[TEAM]:[GROUP_INITIAL_RANK]],2,FALSE)","v":"Groupe E"},null,null,null,{"$f":"VLOOKUP($D32,TABLEAU_MATCHS[#All],4,FALSE)","v":"Brésil"},null,null,{"$f":"VLOOKUP($D32,TABLEAU_MATCHS[#All],5,FALSE)","v":"Costa Rica"},null,null,null,null,null,null,"Rg","Groupe E","MJ","G","N","P","BP","BC","+/-","Pts",null,null,"2017-06-30",3,{"$f":"IF(SUM(U21:U24)=0,\"1er Groupe C\",IF(COUNTIF(S21:S24,1)=1,VLOOKUP(1,S21:T24,2,FALSE),IF(COUNTIF(S21:S24,1)>=2,\"Tirage au Sort C1\")))","v":"1er Groupe C"},0,null,null,null,null,{"$f":"IF(SUM(U27:U30)=0,\"2nd Groupe D\",IF(OR(COUNTIF(S27:S30,1)>1,COUNTIF(S27:S30,2)>1),\"Tirage au sort D2\",VLOOKUP(2,S27:T30,2,FALSE)))","v":"2nd Groupe D"},0]
[null,{"$f":"VLOOKUP($D33,TABLEAU_MATCHS[#All],2,FALSE)","v":"2018-06-22"},{"$f":"VLOOKUP($D33,TABLEAU_MATCHS[#All],3,FALSE)","v":"20:00:00"},26,{"$f":"\"Groupe \"&VLOOKUP($I33,TABLEAU_TEAMS[[#All],[TEAM]:[GROUP_INITIAL_RANK]],2,FALSE)","v":"Groupe E"},null,null,null,{"$f":"VLOOKUP($D33,TABLEAU_MATCHS[#All],4,FALSE)","v":"Serbie"},null,null,{"$f":"VLOOKUP($D33,TABLEAU_MATCHS[#All],5,FALSE)","v":"Suisse"},null,null,null,null,{"$f":"INDEX($Q84:$Q87,MATCH(SMALL(COUNTIF($Q84:$Q87,\">=\"&$Q84:$Q87),ROW(INDIRECT(\"1:\"&ROWS($Q84:$Q87)))),COUNTIF($Q84:$Q87,\">=\"&$Q84:$Q87),0))","v":"00000Suisse"},{"$f":"INDEX($R84:$R87,MATCH(SMALL(COUNTIF($Q84:$Q87,\">=\"&$Q84:$Q87),ROW(INDIRECT(\"1:\"&ROWS($Q84:$Q87)))),COUNTIF($Q84:$Q87,\">=\"&$Q84:$Q87),0))","v":0},{"$f":"INDEX($S84:$S87,MATCH(SMALL(COUNTIF($Q84:$Q87,\">=\"&$Q84:$Q87),ROW(INDIRECT(\"1:\"&ROWS($Q84:$Q87)))),COUNTIF($Q84:$Q87,\">=\"&$Q84:$Q87),0))","v":1},{"$f":"INDEX($T84:$T87,MATCH(SMALL(COUNTIF($Q84:$Q87,\">=\"&$Q84:$Q87),ROW(INDIRECT(\"1:\"&ROWS($Q84:$Q87)))),COUNTIF($Q84:$Q87,\">=\"&$Q84:$Q87),0))","v":"Suisse"},{"$f":"SUMPRODUCT((Teams1=T33)*(Teams1_Score<>\"\"))+SUMPRODUCT((Teams2=T33)*(Teams2_Score<>\"\"))","v":0},{"$f":"SUMPRODUCT((Teams1=T33)*(Teams1_Score>Teams2_Score))+SUMPRODUCT((Teams2=T33)*(Teams2_Score>Teams1_Score))","v":0},{"$f":"SUMPRODUCT((Teams1=T33)*(Teams1_Score=Teams2_Score)*(Teams1_Score<>\"\"))+SUMPRODUCT((Teams2=T33)*(Teams2_Score=Teams1_Score)*(Teams2_Score<>\"\"))","v":0},{"$f":"SUMPRODUCT((Teams1=T33)*(Teams1_Score<Teams2_Score))+SUMPRODUCT((Teams2=T33)*(Teams2_Score<Teams1_Score))","v":0},{"$f":"SUMPRODUCT((Teams1=T33)*(Teams1_Score))+SUMPRODUCT((Teams2=T33)*(Teams2_Score))","v":0},{"$f":"SUMPRODUCT((Teams1=T33)*(Teams2_Score))+SUMPRODUCT((Teams2=T33)*(Teams1_Score))","v":0},{"$f":"Y33-Z33","v":0},{"$f":"3*V33+W33","v":0},null,null,"2018-07-01",4,{"$f":"IF(SUM(U27:U30)=0,\"1er Groupe D\",IF(COUNTIF(S27:S30,1)=1,VLOOKUP(1,S27:T30,2,FALSE),IF(COUNTIF(S27:S30,1)>=2,\"Tirage au Sort D1\")))","v":"1er Groupe D"},0,null,null,null,null,{"$f":"IF(SUM(U21:U24)=0,\"2nd Groupe C\",IF(OR(COUNTIF(S21:S24,1)>1,COUNTIF(S21:S24,2)>1),\"Tirage au sort C2\",VLOOKUP(2,S21:T24,2,FALSE)))","v":"2nd Groupe C"},0]
[null,{"$f":"VLOOKUP($D34,TABLEAU_MATCHS[#All],2,FALSE)","v":"2018-06-23"},{"$f":"VLOOKUP($D34,TABLEAU_MATCHS[#All],3,FALSE)","v":"18:00:00"},27,{"$f":"\"Groupe \"&VLOOKUP($I34,TABLEAU_TEAMS[[#All],[TEAM]:[GROUP_INITIAL_RANK]],2,FALSE)","v":"Groupe F"},null,null,null,{"$f":"VLOOKUP($D34,TABLEAU_MATCHS[#All],4,FALSE)","v":"République de Corée"},null,null,{"$f":"VLOOKUP($D34,TABLEAU_MATCHS[#All],5,FALSE)","v":"Mexique"},null,null,null,null,"00000Serbie",0,1,"Serbie",{"$f":"SUMPRODUCT((Teams1=T34)*(Teams1_Score<>\"\"))+SUMPRODUCT((Teams2=T34)*(Teams2_Score<>\"\"))","v":0},{"$f":"SUMPRODUCT((Teams1=T34)*(Teams1_Score>Teams2_Score))+SUMPRODUCT((Teams2=T34)*(Teams2_Score>Teams1_Score))","v":0},{"$f":"SUMPRODUCT((Teams1=T34)*(Teams1_Score=Teams2_Score)*(Teams1_Score<>\"\"))+SUMPRODUCT((Teams2=T34)*(Teams2_Score=Teams1_Score)*(Teams2_Score<>\"\"))","v":0},{"$f":"SUMPRODUCT((Teams1=T34)*(Teams1_Score<Teams2_Score))+SUMPRODUCT((Teams2=T34)*(Teams2_Score<Teams1_Score))","v":0},{"$f":"SUMPRODUCT((Teams1=T34)*(Teams1_Score))+SUMPRODUCT((Teams2=T34)*(Teams2_Score))","v":0},{"$f":"SUMPRODUCT((Teams1=T34)*(Teams2_Score))+SUMPRODUCT((Teams2=T34)*(Teams1_Score))","v":0},0,0,null,null,"2018-07-02",5,{"$f":"IF(SUM(U33:U36)=0,\"1er Groupe E\",IF(COUNTIF(S33:S36,1)=1,VLOOKUP(1,S33:T36,2,FALSE),IF(COUNTIF(S33:S36,1)>=2,\"Tirage au Sort E1\")))","v":"1er Groupe E"},0,null,null,null,null,{"$f":"IF(SUM(U39:U42)=0,\"2nd Groupe F\",IF(OR(COUNTIF(S39:S42,1)>1,COUNTIF(S39:S42,2)>1),\"Tirage au sort F2\",VLOOKUP(2,S39:T42,2,FALSE)))","v":"2nd Groupe F"},0]
[null,{"$f":"VLOOKUP($D35,TABLEAU_MATCHS[#All],2,FALSE)","v":"2018-06-23"},{"$f":"VLOOKUP($D35,TABLEAU_MATCHS[#All],3,FALSE)","v":"21:00:00"},28,{"$f":"\"Groupe \"&VLOOKUP($I35,TABLEAU_TEAMS[[#All],[TEAM]:[GROUP_INITIAL_RANK]],2,FALSE)","v":"Groupe F"},null,null,null,{"$f":"VLOOKUP($D35,TABLEAU_MATCHS[#All],4,FALSE)","v":"Allemagne"},null,null,{"$f":"VLOOKUP($D35,TABLEAU_MATCHS[#All],5,FALSE)","v":"Suède"},null,null,null,null,"00000Costa Rica",0,1,"Costa Rica",{"$f":"SUMPRODUCT((Teams1=T35)*(Teams1_Score<>\"\"))+SUMPRODUCT((Teams2=T35)*(Teams2_Score<>\"\"))","v":0},{"$f":"SUMPRODUCT((Teams1=T35)*(Teams1_Score>Teams2_Score))+SUMPRODUCT((Teams2=T35)*(Teams2_Score>Teams1_Score))","v":0},{"$f":"SUMPRODUCT((Teams1=T35)*(Teams1_Score=Teams2_Score)*(Teams1_Score<>\"\"))+SUMPRODUCT((Teams2=T35)*(Teams2_Score=Teams1_Score)*(Teams2_Score<>\"\"))","v":0},{"$f":"SUMPRODUCT((Teams1=T35)*(Teams1_Score<Teams2_Score))+SUMPRODUCT((Teams2=T35)*(Teams2_Score<Teams1_Score))","v":0},{"$f":"SUMPRODUCT((Teams1=T35)*(Teams1_Score))+SUMPRODUCT((Teams2=T35)*(Teams2_Score))","v":0},{"$f":"SUMPRODUCT((Teams1=T35)*(Teams2_Score))+SUMPRODUCT((Teams2=T35)*(Teams1_Score))","v":0},0,0,null,null,"2018-07-03",6,{"$f":"IF(SUM(U39:U42)=0,\"1er Groupe F\",IF(COUNTIF(S39:S42,1)=1,VLOOKUP(1,S39:T42,2,FALSE),IF(COUNTIF(S39:S42,1)>=2,\"Tirage au Sort F1\")))","v":"1er Groupe F"},0,null,null,null,null,{"$f":"IF(SUM(U33:U36)=0,\"2nd Groupe E\",IF(OR(COUNTIF(S33:S36,1)>1,COUNTIF(S33:S36,2)>1),\"Tirage au sort E2\",VLOOKUP(2,S33:T36,2,FALSE)))","v":"2nd Groupe E"},0]
[null,{"$f":"VLOOKUP($D36,TABLEAU_MATCHS[#All],2,FALSE)","v":"2018-06-23"},{"$f":"VLOOKUP($D36,TABLEAU_MATCHS[#All],3,FALSE)","v":"15:00:00"},29,{"$f":"\"Groupe \"&VLOOKUP($I36,TABLEAU_TEAMS[[#All],[TEAM]:[GROUP_INITIAL_RANK]],2,FALSE)","v":"Groupe G"},null,null,null,{"$f":"VLOOKUP($D36,TABLEAU_MATCHS[#All],4,FALSE)","v":"Belgique"},null,null,{"$f":"VLOOKUP($D36,TABLEAU_MATCHS[#All],5,FALSE)","v":"Tunisie"},null,null,null,null,"00000Brésil",0,1,"Brésil",{"$f":"SUMPRODUCT((Teams1=T36)*(Teams1_Score<>\"\"))+SUMPRODUCT((Teams2=T36)*(Teams2_Score<>\"\"))","v":0},{"$f":"SUMPRODUCT((Teams1=T36)*(Teams1_Score>Teams2_Score))+SUMPRODUCT((Teams2=T36)*(Teams2_Score>Teams1_Score))","v":0},{"$f":"SUMPRODUCT((Teams1=T36)*(Teams1_Score=Teams2_Score)*(Teams1_Score<>\"\"))+SUMPRODUCT((Teams2=T36)*(Teams2_Score=Teams1_Score)*(Teams2_Score<>\"\"))","v":0},{"$f":"SUMPRODUCT((Teams1=T36)*(Teams1_Score<Teams2_Score))+SUMPRODUCT((Teams2=T36)*(Teams2_Score<Teams1_Score))","v":0},{"$f":"SUMPRODUCT((Teams1=T36)*(Teams1_Score))+SUMPRODUCT((Teams2=T36)*(Teams2_Score))","v":0},{"$f":"SUMPRODUCT((Teams1=T36)*(Teams2_Score))+SUMPRODUCT((Teams2=T36)*(Teams1_Score))","v":0},0,0,null,null,"2018-07-02",7,{"$f":"IF(SUM(U45:U48)=0,\"1er Groupe G\",IF(COUNTIF(S45:S48,1)=1,VLOOKUP(1,S45:T48,2,FALSE),IF(COUNTIF(S45:S48,1)>=2,\"Tirage au Sort G1\")))","v":"1er Groupe G"},0,null,null,null,null,{"$f":"IF(SUM(U51:U54)=0,\"2nd Groupe H\",IF(OR(COUNTIF(S51:S54,1)>1,COUNTIF(S51:S54,2)>1),\"Tirage au sort H2\",VLOOKUP(2,S51:T54,2,FALSE)))","v":"2nd Groupe H"},0]
[null,{"$f":"VLOOKUP($D37,TABLEAU_MATCHS[#All],2,FALSE)","v":"2018-06-24"},{"$f":"VLOOKUP($D37,TABLEAU_MATCHS[#All],3,FALSE)","v":"15:00:00"},30,{"$f":"\"Groupe \"&VLOOKUP($I37,TABLEAU_TEAMS[[#All],[TEAM]:[GROUP_INITIAL_RANK]],2,FALSE)","v":"Groupe G"},null,null,null,{"$f":"VLOOKUP($D37,TABLEAU_MATCHS[#All],4,FALSE)","v":"Angleterre"},null,null,{"$f":"VLOOKUP($D37,TABLEAU_MATCHS[#All],5,FALSE)","v":"Panama"},null,null,null,null,null,null,null,null,null,null,null,null,null,null,null,null,null,null,"2018-07-03",8,{"$f":"IF(SUM(U51:U54)=0,\"1er Groupe H\",IF(COUNTIF(S51:S54,1)=1,VLOOKUP(1,S51:T54,2,FALSE),IF(COUNTIF(S51:S54,1)>=2,\"Tirage au Sort H1\")))","v":"1er Groupe H"},0,null,null,null,null,{"$f":"IF(SUM(U45:U48)=0,\"2nd Groupe G\",IF(OR(COUNTIF(S45:S48,1)>1,COUNTIF(S45:S48,2)>1),\"Tirage au sort G2\",VLOOKUP(2,S45:T48,2,FALSE)))","v":"2nd Groupe G"},0]
[null,{"$f":"VLOOKUP($D38,TABLEAU_MATCHS[#All],2,FALSE)","v":"2018-06-24"},{"$f":"VLOOKUP($D38,TABLEAU_MATCHS[#All],3,FALSE)","v":"20:00:00"},31,{"$f":"\"Groupe \"&VLOOKUP($I38,TABLEAU_TEAMS[[#All],[TEAM]:[GROUP_INITIAL_RANK]],2,FALSE)","v":"Groupe H"},null,null,null,{"$f":"VLOOKUP($D38,TABLEAU_MATCHS[#All],4,FALSE)","v":"Japon"},null,null,{"$f":"VLOOKUP($D38,TABLEAU_MATCHS[#All],5,FALSE)","v":"Sénégal"},null,null,null,null,null,null,"Rg","Groupe F","MJ","G","N","P","BP","BC","+/-","Pts"]
[null,{"$f":"VLOOKUP($D39,TABLEAU_MATCHS[#All],2,FALSE)","v":"2018-06-24"},{"$f":"VLOOKUP($D39,TABLEAU_MATCHS[#All],3,FALSE)","v":"21:00:00"},32,{"$f":"\"Groupe \"&VLOOKUP($I39,TABLEAU_TEAMS[[#All],[TEAM]:[GROUP_INITIAL_RANK]],2,FALSE)","v":"Groupe H"},null,null,null,{"$f":"VLOOKUP($D39,TABLEAU_MATCHS[#All],4,FALSE)","v":"Pologne"},null,null,{"$f":"VLOOKUP($D39,TABLEAU_MATCHS[#All],5,FALSE)","v":"Colombie"},null,null,null,null,{"$f":"INDEX($Q90:$Q93,MATCH(SMALL(COUNTIF($Q90:$Q93,\">=\"&$Q90:$Q93),ROW(INDIRECT(\"1:\"&ROWS($Q90:$Q93)))),COUNTIF($Q90:$Q93,\">=\"&$Q90:$Q93),0))","v":"00000Suède"},{"$f":"INDEX($R90:$R93,MATCH(SMALL(COUNTIF($Q90:$Q93,\">=\"&$Q90:$Q93),ROW(INDIRECT(\"1:\"&ROWS($Q90:$Q93)))),COUNTIF($Q90:$Q93,\">=\"&$Q90:$Q93),0))","v":0},{"$f":"INDEX($S90:$S93,MATCH(SMALL(COUNTIF($Q90:$Q93,\">=\"&$Q90:$Q93),ROW(INDIRECT(\"1:\"&ROWS($Q90:$Q93)))),COUNTIF($Q90:$Q93,\">=\"&$Q90:$Q93),0))","v":1},{"$f":"INDEX($T90:$T93,MATCH(SMALL(COUNTIF($Q90:$Q93,\">=\"&$Q90:$Q93),ROW(INDIRECT(\"1:\"&ROWS($Q90:$Q93)))),COUNTIF($Q90:$Q93,\">=\"&$Q90:$Q93),0))","v":"Suède"},{"$f":"SUMPRODUCT((Teams1=T39)*(Teams1_Score<>\"\"))+SUMPRODUCT((Teams2=T39)*(Teams2_Score<>\"\"))","v":0},{"$f":"SUMPRODUCT((Teams1=T39)*(Teams1_Score>Teams2_Score))+SUMPRODUCT((Teams2=T39)*(Teams2_Score>Teams1_Score))","v":0},{"$f":"SUMPRODUCT((Teams1=T39)*(Teams1_Score=Teams2_Score)*(Teams1_Score<>\"\"))+SUMPRODUCT((Teams2=T39)*(Teams2_Score=Teams1_Score)*(Teams2_Score<>\"\"))","v":0},{"$f":"SUMPRODUCT((Teams1=T39)*(Teams1_Score<Teams2_Score))+SUMPRODUCT((Teams2=T39)*(Teams2_Score<Teams1_Score))","v":0},{"$f":"SUMPRODUCT((Teams1=T39)*(Teams1_Score))+SUMPRODUCT((Teams2=T39)*(Teams2_Score))","v":0},{"$f":"SUMPRODUCT((Teams1=T39)*(Teams2_Score))+SUMPRODUCT((Teams2=T39)*(Teams1_Score))","v":0},{"$f":"Y39-Z39","v":0},{"$f":"3*V39+W39","v":0}]
[null,{"$f":"VLOOKUP($D40,TABLEAU_MATCHS[#All],2,FALSE)","v":"2018-06-25"},{"$f":"VLOOKUP($D40,TABLEAU_MATCHS[#All],3,FALSE)","v":"18:00:00"},33,{"$f":"\"Groupe \"&VLOOKUP($I40,TABLEAU_TEAMS[[#All],[TEAM]:[GROUP_INITIAL_RANK]],2,FALSE)","v":"Groupe A"},null,null,null,{"$f":"VLOOKUP($D40,TABLEAU_MATCHS[#All],4,FALSE)","v":"Uruguay"},null,null,{"$f":"VLOOKUP($D40,TABLEAU_MATCHS[#All],5,FALSE)","v":"Russie"},null,null,null,null,"00000République de Corée",0,1,"République de Corée",{"$f":"SUMPRODUCT((Teams1=T40)*(Teams1_Score<>\"\"))+SUMPRODUCT((Teams2=T40)*(Teams2_Score<>\"\"))","v":0},{"$f":"SUMPRODUCT((Teams1=T40)*(Teams1_Score>Teams2_Score))+SUMPRODUCT((Teams2=T40)*(Teams2_Score>Teams1_Score))","v":0},{"$f":"SUMPRODUCT((Teams1=T40)*(Teams1_Score=Teams2_Score)*(Teams1_Score<>\"\"))+SUMPRODUCT((Teams2=T40)*(Teams2_Score=Teams1_Score)*(Teams2_Score<>\"\"))","v":0},{"$f":"SUMPRODUCT((Teams1=T40)*(Teams1_Score<Teams2_Score))+SUMPRODUCT((Teams2=T40)*(Teams2_Score<Teams1_Score))","v":0},{"$f":"SUMPRODUCT((Teams1=T40)*(Teams1_Score))+SUMPRODUCT((Teams2=T40)*(Teams2_Score))","v":0},{"$f":"SUMPRODUCT((Teams1=T40)*(Teams2_Score))+SUMPRODUCT((Teams2=T40)*(Teams1_Score))","v":0},0,0]
[null,{"$f":"VLOOKUP($D41,TABLEAU_MATCHS[#All],2,FALSE)","v":"2018-06-25"},{"$f":"VLOOKUP($D41,TABLEAU_MATCHS[#All],3,FALSE)","v":"17:00:00"},34,{"$f":"\"Groupe \"&VLOOKUP($I41,TABLEAU_TEAMS[[#All],[TEAM]:[GROUP_INITIAL_RANK]],2,FALSE)","v":"Groupe A"},null,null,null,{"$f":"VLOOKUP($D41,TABLEAU_MATCHS[#All],4,FALSE)","v":"Arabie Saoudite"},null,null,{"$f":"VLOOKUP($D41,TABLEAU_MATCHS[#All],5,FALSE)","v":"Egypte"},null,null,null,null,"00000Mexique",0,1,"Mexique",{"$f":"SUMPRODUCT((Teams1=T41)*(Teams1_Score<>\"\"))+SUMPRODUCT((Teams2=T41)*(Teams2_Score<>\"\"))","v":0},{"$f":"SUMPRODUCT((Teams1=T41)*(Teams1_Score>Teams2_Score))+SUMPRODUCT((Teams2=T41)*(Teams2_Score>Teams1_Score))","v":0},{"$f":"SUMPRODUCT((Teams1=T41)*(Teams1_Score=Teams2_Score)*(Teams1_Score<>\"\"))+SUMPRODUCT((Teams2=T41)*(Teams2_Score=Teams1_Score)*(Teams2_Score<>\"\"))","v":0},{"$f":"SUMPRODUCT((Teams1=T41)*(Teams1_Score<Teams2_Score))+SUMPRODUCT((Teams2=T41)*(Teams2_Score<Teams1_Score))","v":0},{"$f":"SUMPRODUCT((Teams1=T41)*(Teams1_Score))+SUMPRODUCT((Teams2=T41)*(Teams2_Score))","v":0},{"$f":"SUMPRODUCT((Teams1=T41)*(Teams2_Score))+SUMPRODUCT((Teams2=T41)*(Teams1_Score))","v":0},0,0]
[null,{"$f":"VLOOKUP($D42,TABLEAU_MATCHS[#All],2,FALSE)","v":"2018-06-25"},{"$f":"VLOOKUP($D42,TABLEAU_MATCHS[#All],3,FALSE)","v":"21:00:00"},35,{"$f":"\"Groupe \"&VLOOKUP($I42,TABLEAU_TEAMS[[#All],[TEAM]:[GROUP_INITIAL_RANK]],2,FALSE)","v":"Groupe B"},null,null,null,{"$f":"VLOOKUP($D42,TABLEAU_MATCHS[#All],4,FALSE)","v":"RI Iran"},null,null,{"$f":"VLOOKUP($D42,TABLEAU_MATCHS[#All],5,FALSE)","v":"Portugal"},null,null,null,null,"00000Allemagne",0,1,"Allemagne",{"$f":"SUMPRODUCT((Teams1=T42)*(Teams1_Score<>\"\"))+SUMPRODUCT((Teams2=T42)*(Teams2_Score<>\"\"))","v":0},{"$f":"SUMPRODUCT((Teams1=T42)*(Teams1_Score>Teams2_Score))+SUMPRODUCT((Teams2=T42)*(Teams2_Score>Teams1_Score))","v":0},{"$f":"SUMPRODUCT((Teams1=T42)*(Teams1_Score=Teams2_Score)*(Teams1_Score<>\"\"))+SUMPRODUCT((Teams2=T42)*(Teams2_Score=Teams1_Score)*(Teams2_Score<>\"\"))","v":0},{"$f":"SUMPRODUCT((Teams1=T42)*(Teams1_Score<Teams2_Score))+SUMPRODUCT((Teams2=T42)*(Teams2_Score<Teams1_Score))","v":0},{"$f":"SUMPRODUCT((Teams1=T42)*(Teams1_Score))+SUMPRODUCT((Teams2=T42)*(Teams2_Score))","v":0},{"$f":"SUMPRODUCT((Teams1=T42)*(Teams2_Score))+SUMPRODUCT((Teams2=T42)*(Teams1_Score))","v":0},0,0]
[null,{"$f":"VLOOKUP($D43,TABLEAU_MATCHS[#All],2,FALSE)","v":"2018-06-25"},{"$f":"VLOOKUP($D43,TABLEAU_MATCHS[#All],3,FALSE)","v":"20:00:00"},36,{"$f":"\"Groupe \"&VLOOKUP($I43,TABLEAU_TEAMS[[#All],[TEAM]:[GROUP_INITIAL_RANK]],2,FALSE)","v":"Groupe B"},null,null,null,{"$f":"VLOOKUP($D43,TABLEAU_MATCHS[#All],4,FALSE)","v":"Espagne"},null,null,{"$f":"VLOOKUP($D43,TABLEAU_MATCHS[#All],5,FALSE)","v":"Maroc"}]
[null,{"$f":"VLOOKUP($D44,TABLEAU_MATCHS[#All],2,FALSE)","v":"2018-06-26"},{"$f":"VLOOKUP($D44,TABLEAU_MATCHS[#All],3,FALSE)","v":"17:00:00"},37,{"$f":"\"Groupe \"&VLOOKUP($I44,TABLEAU_TEAMS[[#All],[TEAM]:[GROUP_INITIAL_RANK]],2,FALSE)","v":"Groupe C"},null,null,null,{"$f":"VLOOKUP($D44,TABLEAU_MATCHS[#All],4,FALSE)","v":"Danemark"},null,null,{"$f":"VLOOKUP($D44,TABLEAU_MATCHS[#All],5,FALSE)","v":"France"},null,null,null,null,null,null,"Rg","Groupe G","MJ","G","N","P","BP","BC","+/-","Pts"]
[null,{"$f":"VLOOKUP($D45,TABLEAU_MATCHS[#All],2,FALSE)","v":"2018-06-26"},{"$f":"VLOOKUP($D45,TABLEAU_MATCHS[#All],3,FALSE)","v":"17:00:00"},38,{"$f":"\"Groupe \"&VLOOKUP($I45,TABLEAU_TEAMS[[#All],[TEAM]:[GROUP_INITIAL_RANK]],2,FALSE)","v":"Groupe C"},null,null,null,{"$f":"VLOOKUP($D45,TABLEAU_MATCHS[#All],4,FALSE)","v":"Australie"},null,null,{"$f":"VLOOKUP($D45,TABLEAU_MATCHS[#All],5,FALSE)","v":"Pérou"},null,null,null,null,{"$f":"INDEX($Q96:$Q99,MATCH(SMALL(COUNTIF($Q96:$Q99,\">=\"&$Q96:$Q99),ROW(INDIRECT(\"1:\"&ROWS($Q96:$Q99)))),COUNTIF($Q96:$Q99,\">=\"&$Q96:$Q99),0))","v":"00000Tunisie"},{"$f":"INDEX($R96:$R99,MATCH(SMALL(COUNTIF($Q96:$Q99,\">=\"&$Q96:$Q99),ROW(INDIRECT(\"1:\"&ROWS($Q96:$Q99)))),COUNTIF($Q96:$Q99,\">=\"&$Q96:$Q99),0))","v":0},{"$f":"INDEX($S96:$S99,MATCH(SMALL(COUNTIF($Q96:$Q99,\">=\"&$Q96:$Q99),ROW(INDIRECT(\"1:\"&ROWS($Q96:$Q99)))),COUNTIF($Q96:$Q99,\">=\"&$Q96:$Q99),0))","v":1},{"$f":"INDEX($T96:$T99,MATCH(SMALL(COUNTIF($Q96:$Q99,\">=\"&$Q96:$Q99),ROW(INDIRECT(\"1:\"&ROWS($Q96:$Q99)))),COUNTIF($Q96:$Q99,\">=\"&$Q96:$Q99),0))","v":"Tunisie"},{"$f":"SUMPRODUCT((Teams1=T45)*(Teams1_Score<>\"\"))+SUMPRODUCT((Teams2=T45)*(Teams2_Score<>\"\"))","v":0},{"$f":"SUMPRODUCT((Teams1=T45)*(Teams1_Score>Teams2_Score))+SUMPRODUCT((Teams2=T45)*(Teams2_Score>Teams1_Score))","v":0},{"$f":"SUMPRODUCT((Teams1=T45)*(Teams1_Score=Teams2_Score)*(Teams1_Score<>\"\"))+SUMPRODUCT((Teams2=T45)*(Teams2_Score=Teams1_Score)*(Teams2_Score<>\"\"))","v":0},{"$f":"SUMPRODUCT((Teams1=T45)*(Teams1_Score<Teams2_Score))+SUMPRODUCT((Teams2=T45)*(Teams2_Score<Teams1_Score))","v":0},{"$f":"SUMPRODUCT((Teams1=T45)*(Teams1_Score))+SUMPRODUCT((Teams2=T45)*(Teams2_Score))","v":0},{"$f":"SUMPRODUCT((Teams1=T45)*(Teams2_Score))+SUMPRODUCT((Teams2=T45)*(Teams1_Score))","v":0},{"$f":"Y45-Z45","v":0},{"$f":"3*V45+W45","v":0}]
[null,{"$f":"VLOOKUP($D46,TABLEAU_MATCHS[#All],2,FALSE)","v":"2018-06-26"},{"$f":"VLOOKUP($D46,TABLEAU_MATCHS[#All],3,FALSE)","v":"21:00:00"},39,{"$f":"\"Groupe \"&VLOOKUP($I46,TABLEAU_TEAMS[[#All],[TEAM]:[GROUP_INITIAL_RANK]],2,FALSE)","v":"Groupe D"},null,null,null,{"$f":"VLOOKUP($D46,TABLEAU_MATCHS[#All],4,FALSE)","v":"Nigeria"},null,null,{"$f":"VLOOKUP($D46,TABLEAU_MATCHS[#All],5,FALSE)","v":"Argentine"},null,null,null,null,"00000Panama",0,1,"Panama",{"$f":"SUMPRODUCT((Teams1=T46)*(Teams1_Score<>\"\"))+SUMPRODUCT((Teams2=T46)*(Teams2_Score<>\"\"))","v":0},{"$f":"SUMPRODUCT((Teams1=T46)*(Teams1_Score>Teams2_Score))+SUMPRODUCT((Teams2=T46)*(Teams2_Score>Teams1_Score))","v":0},{"$f":"SUMPRODUCT((Teams1=T46)*(Teams1_Score=Teams2_Score)*(Teams1_Score<>\"\"))+SUMPRODUCT((Teams2=T46)*(Teams2_Score=Teams1_Score)*(Teams2_Score<>\"\"))","v":0},{"$f":"SUMPRODUCT((Teams1=T46)*(Teams1_Score<Teams2_Score))+SUMPRODUCT((Teams2=T46)*(Teams2_Score<Teams1_Score))","v":0},{"$f":"SUMPRODUCT((Teams1=T46)*(Teams1_Score))+SUMPRODUCT((Teams2=T46)*(Teams2_Score))","v":0},{"$f":"SUMPRODUCT((Teams1=T46)*(Teams2_Score))+SUMPRODUCT((Teams2=T46)*(Teams1_Score))","v":0},0,0]
[null,{"$f":"VLOOKUP($D47,TABLEAU_MATCHS[#All],2,FALSE)","v":"2018-06-26"},{"$f":"VLOOKUP($D47,TABLEAU_MATCHS[#All],3,FALSE)","v":"21:00:00"},40,{"$f":"\"Groupe \"&VLOOKUP($I47,TABLEAU_TEAMS[[#All],[TEAM]:[GROUP_INITIAL_RANK]],2,FALSE)","v":"Groupe D"},null,null,null,{"$f":"VLOOKUP($D47,TABLEAU_MATCHS[#All],4,FALSE)","v":"Islande"},null,null,{"$f":"VLOOKUP($D47,TABLEAU_MATCHS[#All],5,FALSE)","v":"Croatie"},null,null,null,null,"00000Belgique",0,1,"Belgique",{"$f":"SUMPRODUCT((Teams1=T47)*(Teams1_Score<>\"\"))+SUMPRODUCT((Teams2=T47)*(Teams2_Score<>\"\"))","v":0},{"$f":"SUMPRODUCT((Teams1=T47)*(Teams1_Score>Teams2_Score))+SUMPRODUCT((Teams2=T47)*(Teams2_Score>Teams1_Score))","v":0},{"$f":"SUMPRODUCT((Teams1=T47)*(Teams1_Score=Teams2_Score)*(Teams1_Score<>\"\"))+SUMPRODUCT((Teams2=T47)*(Teams2_Score=Teams1_Score)*(Teams2_Score<>\"\"))","v":0},{"$f":"SUMPRODUCT((Teams1=T47)*(Teams1_Score<Teams2_Score))+SUMPRODUCT((Teams2=T47)*(Teams2_Score<Teams1_Score))","v":0},{"$f":"SUMPRODUCT((Teams1=T47)*(Teams1_Score))+SUMPRODUCT((Teams2=T47)*(Teams2_Score))","v":0},{"$f":"SUMPRODUCT((Teams1=T47)*(Teams2_Score))+SUMPRODUCT((Teams2=T47)*(Teams1_Score))","v":0},0,0]
[null,{"$f":"VLOOKUP($D48,TABLEAU_MATCHS[#All],2,FALSE)","v":"2018-06-27"},{"$f":"VLOOKUP($D48,TABLEAU_MATCHS[#All],3,FALSE)","v":"21:00:00"},41,{"$f":"\"Groupe \"&VLOOKUP($I48,TABLEAU_TEAMS[[#All],[TEAM]:[GROUP_INITIAL_RANK]],2,FALSE)","v":"Groupe E"},null,null,null,{"$f":"VLOOKUP($D48,TABLEAU_MATCHS[#All],4,FALSE)","v":"Serbie"},null,null,{"$f":"VLOOKUP($D48,TABLEAU_MATCHS[#All],5,FALSE)","v":"Brésil"},null,null,null,null,"00000Angleterre",0,1,"Angleterre",{"$f":"SUMPRODUCT((Teams1=T48)*(Teams1_Score<>\"\"))+SUMPRODUCT((Teams2=T48)*(Teams2_Score<>\"\"))","v":0},{"$f":"SUMPRODUCT((Teams1=T48)*(Teams1_Score>Teams2_Score))+SUMPRODUCT((Teams2=T48)*(Teams2_Score>Teams1_Score))","v":0},{"$f":"SUMPRODUCT((Teams1=T48)*(Teams1_Score=Teams2_Score)*(Teams1_Score<>\"\"))+SUMPRODUCT((Teams2=T48)*(Teams2_Score=Teams1_Score)*(Teams2_Score<>\"\"))","v":0},{"$f":"SUMPRODUCT((Teams1=T48)*(Teams1_Score<Teams2_Score))+SUMPRODUCT((Teams2=T48)*(Teams2_Score<Teams1_Score))","v":0},{"$f":"SUMPRODUCT((Teams1=T48)*(Teams1_Score))+SUMPRODUCT((Teams2=T48)*(Teams2_Score))","v":0},{"$f":"SUMPRODUCT((Teams1=T48)*(Teams2_Score))+SUMPRODUCT((Teams2=T48)*(Teams1_Score))","v":0},0,0]
[null,{"$f":"VLOOKUP($D49,TABLEAU_MATCHS[#All],2,FALSE)","v":"2018-06-27"},{"$f":"VLOOKUP($D49,TABLEAU_MATCHS[#All],3,FALSE)","v":"21:00:00"},42,{"$f":"\"Groupe \"&VLOOKUP($I49,TABLEAU_TEAMS[[#All],[TEAM]:[GROUP_INITIAL_RANK]],2,FALSE)","v":"Groupe E"},null,null,null,{"$f":"VLOOKUP($D49,TABLEAU_MATCHS[#All],4,FALSE)","v":"Suisse"},null,null,{"$f":"VLOOKUP($D49,TABLEAU_MATCHS[#All],5,FALSE)","v":"Costa Rica"}]
[null,{"$f":"VLOOKUP($D50,TABLEAU_MATCHS[#All],2,FALSE)","v":"2018-06-27"},{"$f":"VLOOKUP($D50,TABLEAU_MATCHS[#All],3,FALSE)","v":"19:00:00"},43,{"$f":"\"Groupe \"&VLOOKUP($I50,TABLEAU_TEAMS[[#All],[TEAM]:[GROUP_INITIAL_RANK]],2,FALSE)","v":"Groupe F"},null,null,null,{"$f":"VLOOKUP($D50,TABLEAU_MATCHS[#All],4,FALSE)","v":"Mexique"},null,null,{"$f":"VLOOKUP($D50,TABLEAU_MATCHS[#All],5,FALSE)","v":"Suède"},null,null,null,null,null,null,"Rg","Groupe H","MJ","G","N","P","BP","BC","+/-","Pts"]
[null,{"$f":"VLOOKUP($D51,TABLEAU_MATCHS[#All],2,FALSE)","v":"2018-06-27"},{"$f":"VLOOKUP($D51,TABLEAU_MATCHS[#All],3,FALSE)","v":"17:00:00"},44,{"$f":"\"Groupe \"&VLOOKUP($I51,TABLEAU_TEAMS[[#All],[TEAM]:[GROUP_INITIAL_RANK]],2,FALSE)","v":"Groupe F"},null,null,null,{"$f":"VLOOKUP($D51,TABLEAU_MATCHS[#All],4,FALSE)","v":"République de Corée"},null,null,{"$f":"VLOOKUP($D51,TABLEAU_MATCHS[#All],5,FALSE)","v":"Allemagne"},null,null,null,null,{"$f":"INDEX($Q102:$Q105,MATCH(SMALL(COUNTIF($Q102:$Q105,\">=\"&$Q102:$Q105),ROW(INDIRECT(\"1:\"&ROWS($Q102:$Q105)))),COUNTIF($Q102:$Q105,\">=\"&$Q102:$Q105),0))","v":"00000Sénégal"},{"$f":"INDEX($R102:$R105,MATCH(SMALL(COUNTIF($Q102:$Q105,\">=\"&$Q102:$Q105),ROW(INDIRECT(\"1:\"&ROWS($Q102:$Q105)))),COUNTIF($Q102:$Q105,\">=\"&$Q102:$Q105),0))","v":0},{"$f":"INDEX($S102:$S105,MATCH(SMALL(COUNTIF($Q102:$Q105,\">=\"&$Q102:$Q105),ROW(INDIRECT(\"1:\"&ROWS($Q102:$Q105)))),COUNTIF($Q102:$Q105,\">=\"&$Q102:$Q105),0))","v":1},{"$f":"INDEX($T102:$T105,MATCH(SMALL(COUNTIF($Q102:$Q105,\">=\"&$Q102:$Q105),ROW(INDIRECT(\"1:\"&ROWS($Q102:$Q105)))),COUNTIF($Q102:$Q105,\">=\"&$Q102:$Q105),0))","v":"Sénégal"},{"$f":"SUMPRODUCT((Teams1=T51)*(Teams1_Score<>\"\"))+SUMPRODUCT((Teams2=T51)*(Teams2_Score<>\"\"))","v":0},{"$f":"SUMPRODUCT((Teams1=T51)*(Teams1_Score>Teams2_Score))+SUMPRODUCT((Teams2=T51)*(Teams2_Score>Teams1_Score))","v":0},{"$f":"SUMPRODUCT((Teams1=T51)*(Teams1_Score=Teams2_Score)*(Teams1_Score<>\"\"))+SUMPRODUCT((Teams2=T51)*(Teams2_Score=Teams1_Score)*(Teams2_Score<>\"\"))","v":0},{"$f":"SUMPRODUCT((Teams1=T51)*(Teams1_Score<Teams2_Score))+SUMPRODUCT((Teams2=T51)*(Teams2_Score<Teams1_Score))","v":0},{"$f":"SUMPRODUCT((Teams1=T51)*(Teams1_Score))+SUMPRODUCT((Teams2=T51)*(Teams2_Score))","v":0},{"$f":"SUMPRODUCT((Teams1=T51)*(Teams2_Score))+SUMPRODUCT((Teams2=T51)*(Teams1_Score))","v":0},{"$f":"Y51-Z51","v":0},{"$f":"3*V51+W51","v":0}]
[null,{"$f":"VLOOKUP($D52,TABLEAU_MATCHS[#All],2,FALSE)","v":"2018-06-28"},{"$f":"VLOOKUP($D52,TABLEAU_MATCHS[#All],3,FALSE)","v":"21:00:00"},45,{"$f":"\"Groupe \"&VLOOKUP($I52,TABLEAU_TEAMS[[#All],[TEAM]:[GROUP_INITIAL_RANK]],2,FALSE)","v":"Groupe G"},null,null,null,{"$f":"VLOOKUP($D52,TABLEAU_MATCHS[#All],4,FALSE)","v":"Panama"},null,null,{"$f":"VLOOKUP($D52,TABLEAU_MATCHS[#All],5,FALSE)","v":"Tunisie"},null,null,null,null,"00000Pologne",0,1,"Pologne",{"$f":"SUMPRODUCT((Teams1=T52)*(Teams1_Score<>\"\"))+SUMPRODUCT((Teams2=T52)*(Teams2_Score<>\"\"))","v":0},{"$f":"SUMPRODUCT((Teams1=T52)*(Teams1_Score>Teams2_Score))+SUMPRODUCT((Teams2=T52)*(Teams2_Score>Teams1_Score))","v":0},{"$f":"SUMPRODUCT((Teams1=T52)*(Teams1_Score=Teams2_Score)*(Teams1_Score<>\"\"))+SUMPRODUCT((Teams2=T52)*(Teams2_Score=Teams1_Score)*(Teams2_Score<>\"\"))","v":0},{"$f":"SUMPRODUCT((Teams1=T52)*(Teams1_Score<Teams2_Score))+SUMPRODUCT((Teams2=T52)*(Teams2_Score<Teams1_Score))","v":0},{"$f":"SUMPRODUCT((Teams1=T52)*(Teams1_Score))+SUMPRODUCT((Teams2=T52)*(Teams2_Score))","v":0},{"$f":"SUMPRODUCT((Teams1=T52)*(Teams2_Score))+SUMPRODUCT((Teams2=T52)*(Teams1_Score))","v":0},0,0]
[null,{"$f":"VLOOKUP($D53,TABLEAU_MATCHS[#All],2,FALSE)","v":"2018-06-28"},{"$f":"VLOOKUP($D53,TABLEAU_MATCHS[#All],3,FALSE)","v":"20:00:00"},46,{"$f":"\"Groupe \"&VLOOKUP($I53,TABLEAU_TEAMS[[#All],[TEAM]:[GROUP_INITIAL_RANK]],2,FALSE)","v":"Groupe G"},null,null,null,{"$f":"VLOOKUP($D53,TABLEAU_MATCHS[#All],4,FALSE)","v":"Angleterre"},null,null,{"$f":"VLOOKUP($D53,TABLEAU_MATCHS[#All],5,FALSE)","v":"Belgique"},null,null,null,null,"00000Japon",0,1,"Japon",{"$f":"SUMPRODUCT((Teams1=T53)*(Teams1_Score<>\"\"))+SUMPRODUCT((Teams2=T53)*(Teams2_Score<>\"\"))","v":0},{"$f":"SUMPRODUCT((Teams1=T53)*(Teams1_Score>Teams2_Score))+SUMPRODUCT((Teams2=T53)*(Teams2_Score>Teams1_Score))","v":0},{"$f":"SUMPRODUCT((Teams1=T53)*(Teams1_Score=Teams2_Score)*(Teams1_Score<>\"\"))+SUMPRODUCT((Teams2=T53)*(Teams2_Score=Teams1_Score)*(Teams2_Score<>\"\"))","v":0},{"$f":"SUMPRODUCT((Teams1=T53)*(Teams1_Score<Teams2_Score))+SUMPRODUCT((Teams2=T53)*(Teams2_Score<Teams1_Score))","v":0},{"$f":"SUMPRODUCT((Teams1=T53)*(Teams1_Score))+SUMPRODUCT((Teams2=T53)*(Teams2_Score))","v":0},{"$f":"SUMPRODUCT((Teams1=T53)*(Teams2_Score))+SUMPRODUCT((Teams2=T53)*(Teams1_Score))","v":0},0,0]
[null,{"$f":"VLOOKUP($D54,TABLEAU_MATCHS[#All],2,FALSE)","v":"2018-06-28"},{"$f":"VLOOKUP($D54,TABLEAU_MATCHS[#All],3,FALSE)","v":"17:00:00"},47,{"$f":"\"Groupe \"&VLOOKUP($I54,TABLEAU_TEAMS[[#All],[TEAM]:[GROUP_INITIAL_RANK]],2,FALSE)","v":"Groupe H"},null,null,null,{"$f":"VLOOKUP($D54,TABLEAU_MATCHS[#All],4,FALSE)","v":"Japon"},null,null,{"$f":"VLOOKUP($D54,TABLEAU_MATCHS[#All],5,FALSE)","v":"Pologne"},null,null,null,null,"00000Colombie",0,1,"Colombie",{"$f":"SUMPRODUCT((Teams1=T54)*(Teams1_Score<>\"\"))+SUMPRODUCT((Teams2=T54)*(Teams2_Score<>\"\"))","v":0},{"$f":"SUMPRODUCT((Teams1=T54)*(Teams1_Score>Teams2_Score))+SUMPRODUCT((Teams2=T54)*(Teams2_Score>Teams1_Score))","v":0},{"$f":"SUMPRODUCT((Teams1=T54)*(Teams1_Score=Teams2_Score)*(Teams1_Score<>\"\"))+SUMPRODUCT((Teams2=T54)*(Teams2_Score=Teams1_Score)*(Teams2_Score<>\"\"))","v":0},{"$f":"SUMPRODUCT((Teams1=T54)*(Teams1_Score<Teams2_Score))+SUMPRODUCT((Teams2=T54)*(Teams2_Score<Teams1_Score))","v":0},{"$f":"SUMPRODUCT((Teams1=T54)*(Teams1_Score))+SUMPRODUCT((Teams2=T54)*(Teams2_Score))","v":0},{"$f":"SUMPRODUCT((Teams1=T54)*(Teams2_Score))+SUMPRODUCT((Teams2=T54)*(Teams1_Score))","v":0},0,0]
[null,{"$f":"VLOOKUP($D55,TABLEAU_MATCHS[#All],2,FALSE)","v":"2018-06-28"},{"$f":"VLOOKUP($D55,TABLEAU_MATCHS[#All],3,FALSE)","v":"18:00:00"},48,{"$f":"\"Groupe \"&VLOOKUP($I55,TABLEAU_TEAMS[[#All],[TEAM]:[GROUP_INITIAL_RANK]],2,FALSE)","v":"Groupe H"},null,null,null,{"$f":"VLOOKUP($D55,TABLEAU_MATCHS[#All],4,FALSE)","v":"Sénégal"},null,null,{"$f":"VLOOKUP($D55,TABLEAU_MATCHS[#All],5,FALSE)","v":"Colombie"}]
[]
[]
[]
[null,"Tirage au sort A1",null,null,null,null,null,null,null,null,null,null,null,null,null,null,null,null,"Rg","Groupe A","MJ","G","N","P","BP","BC","+/-","Pts"]
[null,{"$f":"IF(ROWS($1:1)<=COUNTIF($S$9:$S$12,1),INDEX($T$9:$T$12,SMALL(IF($S$9:$S$12=1,ROW(INDIRECT(\"1:\"&ROWS($S$9:$S$12)))),ROWS($1:1))),\"\")","v":"Uruguay"},null,null,null,null,null,null,null,null,null,null,null,null,null,"A_1",{"$f":"TEXT(R60,\"00000\")&T60","v":"00000Russie"},{"$f":"AB60*1000+AA60*100+Y60*10","v":0},{"$f":"RANK(R60,$R60:$R63,0)","v":1},{"$f":"VLOOKUP(P60,TABLEAU_TEAMS[#All],2,FALSE)","v":"Russie"},{"$f":"SUMPRODUCT((Teams1=T60)*(Teams1_Score<>\"\"))+SUMPRODUCT((Teams2=T60)*(Teams2_Score<>\"\"))","v":0},{"$f":"SUMPRODUCT((Teams1=T60)*(Teams1_Score>Teams2_Score))+SUMPRODUCT((Teams2=T60)*(Teams2_Score>Teams1_Score))","v":0},{"$f":"SUMPRODUCT((Teams1=T60)*(Teams1_Score=Teams2_Score)*(Teams1_Score<>\"\"))+SUMPRODUCT((Teams2=T60)*(Teams2_Score=Teams1_Score)*(Teams2_Score<>\"\"))","v":0},{"$f":"SUMPRODUCT((Teams1=T60)*(Teams1_Score<Teams2_Score))+SUMPRODUCT((Teams2=T60)*(Teams2_Score<Teams1_Score))","v":0},{"$f":"SUMPRODUCT((Teams1=T60)*(Teams1_Score))+SUMPRODUCT((Teams2=T60)*(Teams2_Score))","v":0},{"$f":"SUMPRODUCT((Teams1=T60)*(Teams2_Score))+SUMPRODUCT((Teams2=T60)*(Teams1_Score))","v":0},{"$f":"Y60-Z60","v":0},{"$f":"3*V60+W60","v":0}]
[null,{"$f":"IF(ROWS($1:2)<=COUNTIF($S$9:$S$12,1),INDEX($T$9:$T$12,SMALL(IF($S$9:$S$12=1,ROW(INDIRECT(\"1:\"&ROWS($S$9:$S$12)))),ROWS($1:2))),\"\")","v":"Russie"},null,null,null,null,null,null,null,null,null,null,null,null,null,"A_2",{"$f":"TEXT(R61,\"00000\")&T61","v":"00000Arabie Saoudite"},{"$f":"AB61*1000+AA61*100+Y61*10","v":0},{"$f":"RANK(R61,$R60:$R63,0)","v":1},{"$f":"VLOOKUP(P61,TABLEAU_TEAMS[#All],2,FALSE)","v":"Arabie Saoudite"},{"$f":"SUMPRODUCT((Teams1=T61)*(Teams1_Score<>\"\"))+SUMPRODUCT((Teams2=T61)*(Teams2_Score<>\"\"))","v":0},{"$f":"SUMPRODUCT((Teams1=T61)*(Teams1_Score>Teams2_Score))+SUMPRODUCT((Teams2=T61)*(Teams2_Score>Teams1_Score))","v":0},{"$f":"SUMPRODUCT((Teams1=T61)*(Teams1_Score=Teams2_Score)*(Teams1_Score<>\"\"))+SUMPRODUCT((Teams2=T61)*(Teams2_Score=Teams1_Score)*(Teams2_Score<>\"\"))","v":0},{"$f":"SUMPRODUCT((Teams1=T61)*(Teams1_Score<Teams2_Score))+SUMPRODUCT((Teams2=T61)*(Teams2_Score<Teams1_Score))","v":0},{"$f":"SUMPRODUCT((Teams1=T61)*(Teams1_Score))+SUMPRODUCT((Teams2=T61)*(Teams2_Score))","v":0},{"$f":"SUMPRODUCT((Teams1=T61)*(Teams2_Score))+SUMPRODUCT((Teams2=T61)*(Teams1_Score))","v":0},{"$f":"Y61-Z61","v":0},{"$f":"3*V61+W61","v":0}]
[null,{"$f":"IF(ROWS($1:3)<=COUNTIF($S$9:$S$12,1),INDEX($T$9:$T$12,SMALL(IF($S$9:$S$12=1,ROW(INDIRECT(\"1:\"&ROWS($S$9:$S$12)))),ROWS($1:3))),\"\")","v":"Egypte"},null,null,null,null,null,null,null,null,null,null,null,null,null,"A_3",{"$f":"TEXT(R62,\"00000\")&T62","v":"00000Egypte"},{"$f":"AB62*1000+AA62*100+Y62*10","v":0},{"$f":"RANK(R62,$R60:$R63,0)","v":1},{"$f":"VLOOKUP(P62,TABLEAU_TEAMS[#All],2,FALSE)","v":"Egypte"},{"$f":"SUMPRODUCT((Teams1=T62)*(Teams1_Score<>\"\"))+SUMPRODUCT((Teams2=T62)*(Teams2_Score<>\"\"))","v":0},{"$f":"SUMPRODUCT((Teams1=T62)*(Teams1_Score>Teams2_Score))+SUMPRODUCT((Teams2=T62)*(Teams2_Score>Teams1_Score))","v":0},{"$f":"SUMPRODUCT((Teams1=T62)*(Teams1_Score=Teams2_Score)*(Teams1_Score<>\"\"))+SUMPRODUCT((Teams2=T62)*(Teams2_Score=Teams1_Score)*(Teams2_Score<>\"\"))","v":0},{"$f":"SUMPRODUCT((Teams1=T62)*(Teams1_Score<Teams2_Score))+SUMPRODUCT((Teams2=T62)*(Teams2_Score<Teams1_Score))","v":0},{"$f":"SUMPRODUCT((Teams1=T62)*(Teams1_Score))+SUMPRODUCT((Teams2=T62)*(Teams2_Score))","v":0},{"$f":"SUMPRODUCT((Teams1=T62)*(Teams2_Score))+SUMPRODUCT((Teams2=T62)*(Teams1_Score))","v":0},0,0]
[null,{"$f":"IF(ROWS($1:4)<=COUNTIF($S$9:$S$12,1),INDEX($T$9:$T$12,SMALL(IF($S$9:$S$12=1,ROW(INDIRECT(\"1:\"&ROWS($S$9:$S$12)))),ROWS($1:4))),\"\")","v":"Arabie Saoudite"},null,null,null,null,null,null,null,null,null,null,null,null,null,"A_4",{"$f":"TEXT(R63,\"00000\")&T63","v":"00000Uruguay"},{"$f":"AB63*1000+AA63*100+Y63*10","v":0},{"$f":"RANK(R63,$R60:$R63,0)","v":1},{"$f":"VLOOKUP(P63,TABLEAU_TEAMS[#All],2,FALSE)","v":"Uruguay"},{"$f":"SUMPRODUCT((Teams1=T63)*(Teams1_Score<>\"\"))+SUMPRODUCT((Teams2=T63)*(Teams2_Score<>\"\"))","v":0},{"$f":"SUMPRODUCT((Teams1=T63)*(Teams1_Score>Teams2_Score))+SUMPRODUCT((Teams2=T63)*(Teams2_Score>Teams1_Score))","v":0},{"$f":"SUMPRODUCT((Teams1=T63)*(Teams1_Score=Teams2_Score)*(Teams1_Score<>\"\"))+SUMPRODUCT((Teams2=T63)*(Teams2_Score=Teams1_Score)*(Teams2_Score<>\"\"))","v":0},{"$f":"SUMPRODUCT((Teams1=T63)*(Teams1_Score<Teams2_Score))+SUMPRODUCT((Teams2=T63)*(Teams2_Score<Teams1_Score))","v":0},{"$f":"SUMPRODUCT((Teams1=T63)*(Teams1_Score))+SUMPRODUCT((Teams2=T63)*(Teams2_Score))","v":0},{"$f":"SUMPRODUCT((Teams1=T63)*(Teams2_Score))+SUMPRODUCT((Teams2=T63)*(Teams1_Score))","v":0},0,0]
[null,"Tirage au sort A2"]
[null,{"$f":"IF(COUNTIF($S$9:$S$12,1)>1,IF(ROWS($1:1)<=COUNTIF($S$9:$S$12,1),INDEX($T$9:$T$12,SMALL(IF($S$9:$S$12=1,ROW(INDIRECT(\"1:\"&ROWS($S$9:$S$12)))),ROWS($1:1))),\"\"),IF(COUNTIF($S$9:$S$12,2)>1,IF(ROWS($1:1)<=COUNTIF($S$9:$S$12,2),INDEX($T$9:$T$12,SMALL(IF($S$9:$S$12=2,ROW(INDIRECT(\"1:\"&ROWS($S$9:$S$12)))),ROWS($1:1))),\"\")))","v":"Uruguay"},null,null,null,null,null,null,null,null,null,null,null,null,null,null,null,null,"Rg","Groupe B","MJ","G","N","P","BP","BC","Pts","Pts"]
[null,{"$f":"IF(COUNTIF($S$9:$S$12,1)>1,IF(ROWS($1:2)<=COUNTIF($S$9:$S$12,1),INDEX($T$9:$T$12,SMALL(IF($S$9:$S$12=1,ROW(INDIRECT(\"1:\"&ROWS($S$9:$S$12)))),ROWS($1:2))),\"\"),IF(COUNTIF($S$9:$S$12,2)>1,IF(ROWS($1:2)<=COUNTIF($S$9:$S$12,2),INDEX($T$9:$T$12,SMALL(IF($S$9:$S$12=2,ROW(INDIRECT(\"1:\"&ROWS($S$9:$S$12)))),ROWS($1:2))),\"\")))","v":"Russie"},null,null,null,null,null,null,null,null,null,null,null,null,null,"B_1",{"$f":"TEXT(R66,\"00000\")&T66","v":"00000Maroc"},{"$f":"AB66*1000+AA66*100+Y66*10","v":0},{"$f":"RANK(R66,$R66:$R69,0)","v":1},{"$f":"VLOOKUP(P66,TABLEAU_TEAMS[#All],2,FALSE)","v":"Maroc"},{"$f":"SUMPRODUCT((Teams1=T66)*(Teams1_Score<>\"\"))+SUMPRODUCT((Teams2=T66)*(Teams2_Score<>\"\"))","v":0},{"$f":"SUMPRODUCT((Teams1=T66)*(Teams1_Score>Teams2_Score))+SUMPRODUCT((Teams2=T66)*(Teams2_Score>Teams1_Score))","v":0},{"$f":"SUMPRODUCT((Teams1=T66)*(Teams1_Score=Teams2_Score)*(Teams1_Score<>\"\"))+SUMPRODUCT((Teams2=T66)*(Teams2_Score=Teams1_Score)*(Teams2_Score<>\"\"))","v":0},{"$f":"SUMPRODUCT((Teams1=T66)*(Teams1_Score<Teams2_Score))+SUMPRODUCT((Teams2=T66)*(Teams2_Score<Teams1_Score))","v":0},{"$f":"SUMPRODUCT((Teams1=T66)*(Teams1_Score))+SUMPRODUCT((Teams2=T66)*(Teams2_Score))","v":0},{"$f":"SUMPRODUCT((Teams1=T66)*(Teams2_Score))+SUMPRODUCT((Teams2=T66)*(Teams1_Score))","v":0},{"$f":"Y66-Z66","v":0},{"$f":"3*V66+W66","v":0}]
[null,{"$f":"IF(COUNTIF($S$9:$S$12,1)>1,IF(ROWS($1:3)<=COUNTIF($S$9:$S$12,1),INDEX($T$9:$T$12,SMALL(IF($S$9:$S$12=1,ROW(INDIRECT(\"1:\"&ROWS($S$9:$S$12)))),ROWS($1:3))),\"\"),IF(COUNTIF($S$9:$S$12,2)>1,IF(ROWS($1:3)<=COUNTIF($S$9:$S$12,2),INDEX($T$9:$T$12,SMALL(IF($S$9:$S$12=2,ROW(INDIRECT(\"1:\"&ROWS($S$9:$S$12)))),ROWS($1:3))),\"\")))","v":"Egypte"},null,null,null,null,null,null,null,null,null,null,null,null,null,"B_2",{"$f":"TEXT(R67,\"00000\")&T67","v":"00000RI Iran"},{"$f":"AB67*1000+AA67*100+Y67*10","v":0},{"$f":"RANK(R67,$R66:$R69,0)","v":1},{"$f":"VLOOKUP(P67,TABLEAU_TEAMS[#All],2,FALSE)","v":"RI Iran"},{"$f":"SUMPRODUCT((Teams1=T67)*(Teams1_Score<>\"\"))+SUMPRODUCT((Teams2=T67)*(Teams2_Score<>\"\"))","v":0},{"$f":"SUMPRODUCT((Teams1=T67)*(Teams1_Score>Teams2_Score))+SUMPRODUCT((Teams2=T67)*(Teams2_Score>Teams1_Score))","v":0},{"$f":"SUMPRODUCT((Teams1=T67)*(Teams1_Score=Teams2_Score)*(Teams1_Score<>\"\"))+SUMPRODUCT((Teams2=T67)*(Teams2_Score=Teams1_Score)*(Teams2_Score<>\"\"))","v":0},{"$f":"SUMPRODUCT((Teams1=T67)*(Teams1_Score<Teams2_Score))+SUMPRODUCT((Teams2=T67)*(Teams2_Score<Teams1_Score))","v":0},{"$f":"SUMPRODUCT((Teams1=T67)*(Teams1_Score))+SUMPRODUCT((Teams2=T67)*(Teams2_Score))","v":0},{"$f":"SUMPRODUCT((Teams1=T67)*(Teams2_Score))+SUMPRODUCT((Teams2=T67)*(Teams1_Score))","v":0},0,0]
[null,{"$f":"IF(COUNTIF($S$9:$S$12,1)>1,IF(ROWS($1:4)<=COUNTIF($S$9:$S$12,1),INDEX($T$9:$T$12,SMALL(IF($S$9:$S$12=1,ROW(INDIRECT(\"1:\"&ROWS($S$9:$S$12)))),ROWS($1:4))),\"\"),IF(COUNTIF($S$9:$S$12,2)>1,IF(ROWS($1:4)<=COUNTIF($S$9:$S$12,2),INDEX($T$9:$T$12,SMALL(IF($S$9:$S$12=2,ROW(INDIRECT(\"1:\"&ROWS($S$9:$S$12)))),ROWS($1:4))),\"\")))","v":"Arabie Saoudite"},null,null,null,null,null,null,null,null,null,null,null,null,null,"B_3",{"$f":"TEXT(R68,\"00000\")&T68","v":"00000Portugal"},{"$f":"AB68*1000+AA68*100+Y68*10","v":0},{"$f":"RANK(R68,$R66:$R69,0)","v":1},{"$f":"VLOOKUP(P68,TABLEAU_TEAMS[#All],2,FALSE)","v":"Portugal"},{"$f":"SUMPRODUCT((Teams1=T68)*(Teams1_Score<>\"\"))+SUMPRODUCT((Teams2=T68)*(Teams2_Score<>\"\"))","v":0},{"$f":"SUMPRODUCT((Teams1=T68)*(Teams1_Score>Teams2_Score))+SUMPRODUCT((Teams2=T68)*(Teams2_Score>Teams1_Score))","v":0},{"$f":"SUMPRODUCT((Teams1=T68)*(Teams1_Score=Teams2_Score)*(Teams1_Score<>\"\"))+SUMPRODUCT((Teams2=T68)*(Teams2_Score=Teams1_Score)*(Teams2_Score<>\"\"))","v":0},{"$f":"SUMPRODUCT((Teams1=T68)*(Teams1_Score<Teams2_Score))+SUMPRODUCT((Teams2=T68)*(Teams2_Score<Teams1_Score))","v":0},{"$f":"SUMPRODUCT((Teams1=T68)*(Teams1_Score))+SUMPRODUCT((Teams2=T68)*(Teams2_Score))","v":0},{"$f":"SUMPRODUCT((Teams1=T68)*(Teams2_Score))+SUMPRODUCT((Teams2=T68)*(Teams1_Score))","v":0},0,0]
[null,"Tirage au sort B1",null,null,null,null,null,null,null,null,null,null,null,null,null,"B_4",{"$f":"TEXT(R69,\"00000\")&T69","v":"00000Espagne"},{"$f":"AB69*1000+AA69*100+Y69*10","v":0},{"$f":"RANK(R69,$R66:$R69,0)","v":1},{"$f":"VLOOKUP(P69,TABLEAU_TEAMS[#All],2,FALSE)","v":"Espagne"},{"$f":"SUMPRODUCT((Teams1=T69)*(Teams1_Score<>\"\"))+SUMPRODUCT((Teams2=T69)*(Teams2_Score<>\"\"))","v":0},{"$f":"SUMPRODUCT((Teams1=T69)*(Teams1_Score>Teams2_Score))+SUMPRODUCT((Teams2=T69)*(Teams2_Score>Teams1_Score))","v":0},{"$f":"SUMPRODUCT((Teams1=T69)*(Teams1_Score=Teams2_Score)*(Teams1_Score<>\"\"))+SUMPRODUCT((Teams2=T69)*(Teams2_Score=Teams1_Score)*(Teams2_Score<>\"\"))","v":0},{"$f":"SUMPRODUCT((Teams1=T69)*(Teams1_Score<Teams2_Score))+SUMPRODUCT((Teams2=T69)*(Teams2_Score<Teams1_Score))","v":0},{"$f":"SUMPRODUCT((Teams1=T69)*(Teams1_Score))+SUMPRODUCT((Teams2=T69)*(Teams2_Score))","v":0},{"$f":"SUMPRODUCT((Teams1=T69)*(Teams2_Score))+SUMPRODUCT((Teams2=T69)*(Teams1_Score))","v":0},0,0]
[null,{"$f":"IF(ROWS($1:1)<=COUNTIF($S$15:$S$18,1),INDEX($T$15:$T$18,SMALL(IF($S$15:$S$18=1,ROW(INDIRECT(\"1:\"&ROWS($S$15:$S$18)))),ROWS($1:1))),\"\")","v":"RI Iran"}]
[null,{"$f":"IF(ROWS($1:2)<=COUNTIF($S$15:$S$18,1),INDEX($T$15:$T$18,SMALL(IF($S$15:$S$18=1,ROW(INDIRECT(\"1:\"&ROWS($S$15:$S$18)))),ROWS($1:2))),\"\")","v":"Portugal"},null,null,null,null,null,null,null,null,null,null,null,null,null,null,null,null,"Rg","Groupe C","MJ","G","N","P","BP","BC","Pts","Pts"]
[null,{"$f":"IF(ROWS($1:3)<=COUNTIF($S$15:$S$18,1),INDEX($T$15:$T$18,SMALL(IF($S$15:$S$18=1,ROW(INDIRECT(\"1:\"&ROWS($S$15:$S$18)))),ROWS($1:3))),\"\")","v":"Maroc"},null,null,null,null,null,null,null,null,null,null,null,null,null,"C_1",{"$f":"TEXT(R72,\"00000\")&T72","v":"00000France"},{"$f":"AB72*1000+AA72*100+Y72*10","v":0},{"$f":"RANK(R72,$R72:$R75,0)","v":1},{"$f":"VLOOKUP(P72,TABLEAU_TEAMS[#All],2,FALSE)","v":"France"},{"$f":"SUMPRODUCT((Teams1=T72)*(Teams1_Score<>\"\"))+SUMPRODUCT((Teams2=T72)*(Teams2_Score<>\"\"))","v":0},{"$f":"SUMPRODUCT((Teams1=T72)*(Teams1_Score>Teams2_Score))+SUMPRODUCT((Teams2=T72)*(Teams2_Score>Teams1_Score))","v":0},{"$f":"SUMPRODUCT((Teams1=T72)*(Teams1_Score=Teams2_Score)*(Teams1_Score<>\"\"))+SUMPRODUCT((Teams2=T72)*(Teams2_Score=Teams1_Score)*(Teams2_Score<>\"\"))","v":0},{"$f":"SUMPRODUCT((Teams1=T72)*(Teams1_Score<Teams2_Score))+SUMPRODUCT((Teams2=T72)*(Teams2_Score<Teams1_Score))","v":0},{"$f":"SUMPRODUCT((Teams1=T72)*(Teams1_Score))+SUMPRODUCT((Teams2=T72)*(Teams2_Score))","v":0},{"$f":"SUMPRODUCT((Teams1=T72)*(Teams2_Score))+SUMPRODUCT((Teams2=T72)*(Teams1_Score))","v":0},{"$f":"Y72-Z72","v":0},{"$f":"3*V72+W72","v":0}]
[null,{"$f":"IF(ROWS($1:4)<=COUNTIF($S$15:$S$18,1),INDEX($T$15:$T$18,SMALL(IF($S$15:$S$18=1,ROW(INDIRECT(\"1:\"&ROWS($S$15:$S$18)))),ROWS($1:4))),\"\")","v":"Espagne"},null,null,null,null,null,null,null,null,null,null,null,null,null,"C_2",{"$f":"TEXT(R73,\"00000\")&T73","v":"00000Australie"},{"$f":"AB73*1000+AA73*100+Y73*10","v":0},{"$f":"RANK(R73,$R72:$R75,0)","v":1},{"$f":"VLOOKUP(P73,TABLEAU_TEAMS[#All],2,FALSE)","v":"Australie"},{"$f":"SUMPRODUCT((Teams1=T73)*(Teams1_Score<>\"\"))+SUMPRODUCT((Teams2=T73)*(Teams2_Score<>\"\"))","v":0},{"$f":"SUMPRODUCT((Teams1=T73)*(Teams1_Score>Teams2_Score))+SUMPRODUCT((Teams2=T73)*(Teams2_Score>Teams1_Score))","v":0},{"$f":"SUMPRODUCT((Teams1=T73)*(Teams1_Score=Teams2_Score)*(Teams1_Score<>\"\"))+SUMPRODUCT((Teams2=T73)*(Teams2_Score=Teams1_Score)*(Teams2_Score<>\"\"))","v":0},{"$f":"SUMPRODUCT((Teams1=T73)*(Teams1_Score<Teams2_Score))+SUMPRODUCT((Teams2=T73)*(Teams2_Score<Teams1_Score))","v":0},{"$f":"SUMPRODUCT((Teams1=T73)*(Teams1_Score))+SUMPRODUCT((Teams2=T73)*(Teams2_Score))","v":0},{"$f":"SUMPRODUCT((Teams1=T73)*(Teams2_Score))+SUMPRODUCT((Teams2=T73)*(Teams1_Score))","v":0},0,0]
[null,"Tirage au sort B2",null,null,null,null,null,null,null,null,null,null,null,null,null,"C_3",{"$f":"TEXT(R74,\"00000\")&T74","v":"00000Pérou"},{"$f":"AB74*1000+AA74*100+Y74*10","v":0},{"$f":"RANK(R74,$R72:$R75,0)","v":1},{"$f":"VLOOKUP(P74,TABLEAU_TEAMS[#All],2,FALSE)","v":"Pérou"},{"$f":"SUMPRODUCT((Teams1=T74)*(Teams1_Score<>\"\"))+SUMPRODUCT((Teams2=T74)*(Teams2_Score<>\"\"))","v":0},{"$f":"SUMPRODUCT((Teams1=T74)*(Teams1_Score>Teams2_Score))+SUMPRODUCT((Teams2=T74)*(Teams2_Score>Teams1_Score))","v":0},{"$f":"SUMPRODUCT((Teams1=T74)*(Teams1_Score=Teams2_Score)*(Teams1_Score<>\"\"))+SUMPRODUCT((Teams2=T74)*(Teams2_Score=Teams1_Score)*(Teams2_Score<>\"\"))","v":0},{"$f":"SUMPRODUCT((Teams1=T74)*(Teams1_Score<Teams2_Score))+SUMPRODUCT((Teams2=T74)*(Teams2_Score<Teams1_Score))","v":0},{"$f":"SUMPRODUCT((Teams1=T74)*(Teams1_Score))+SUMPRODUCT((Teams2=T74)*(Teams2_Score))","v":0},{"$f":"SUMPRODUCT((Teams1=T74)*(Teams2_Score))+SUMPRODUCT((Teams2=T74)*(Teams1_Score))","v":0},0,0]
[null,{"$f":"IF(COUNTIF($S$15:$S$18,1)>1,IF(ROWS($1:1)<=COUNTIF($S$15:$S$18,1),INDEX($T$15:$T$18,SMALL(IF($S$15:$S$18=1,ROW(INDIRECT(\"1:\"&ROWS($S$15:$S$18)))),ROWS($1:1))),\"\"),IF(COUNTIF($S$15:$S$18,2)>1,IF(ROWS($1:1)<=COUNTIF($S$15:$S$18,2),INDEX($T$15:$T$18,SMALL(IF($S$15:$S$18=2,ROW(INDIRECT(\"1:\"&ROWS($S$15:$S$18)))),ROWS($1:1))),\"\")))","v":"RI Iran"},null,null,null,null,null,null,null,null,null,null,null,null,null,"C_4",{"$f":"TEXT(R75,\"00000\")&T75","v":"00000Danemark"},{"$f":"AB75*1000+AA75*100+Y75*10","v":0},{"$f":"RANK(R75,$R72:$R75,0)","v":1},{"$f":"VLOOKUP(P75,TABLEAU_TEAMS[#All],2,FALSE)","v":"Danemark"},{"$f":"SUMPRODUCT((Teams1=T75)*(Teams1_Score<>\"\"))+SUMPRODUCT((Teams2=T75)*(Teams2_Score<>\"\"))","v":0},{"$f":"SUMPRODUCT((Teams1=T75)*(Teams1_Score>Teams2_Score))+SUMPRODUCT((Teams2=T75)*(Teams2_Score>Teams1_Score))","v":0},{"$f":"SUMPRODUCT((Teams1=T75)*(Teams1_Score=Teams2_Score)*(Teams1_Score<>\"\"))+SUMPRODUCT((Teams2=T75)*(Teams2_Score=Teams1_Score)*(Teams2_Score<>\"\"))","v":0},{"$f":"SUMPRODUCT((Teams1=T75)*(Teams1_Score<Teams2_Score))+SUMPRODUCT((Teams2=T75)*(Teams2_Score<Teams1_Score))","v":0},{"$f":"SUMPRODUCT((Teams1=T75)*(Teams1_Score))+SUMPRODUCT((Teams2=T75)*(Teams2_Score))","v":0},{"$f":"SUMPRODUCT((Teams1=T75)*(Teams2_Score))+SUMPRODUCT((Teams2=T75)*(Teams1_Score))","v":0},0,0]
[null,{"$f":"IF(COUNTIF($S$15:$S$18,1)>1,IF(ROWS($1:2)<=COUNTIF($S$15:$S$18,1),INDEX($T$15:$T$18,SMALL(IF($S$15:$S$18=1,ROW(INDIRECT(\"1:\"&ROWS($S$15:$S$18)))),ROWS($1:2))),\"\"),IF(COUNTIF($S$15:$S$18,2)>1,IF(ROWS($1:2)<=COUNTIF($S$15:$S$18,2),INDEX($T$15:$T$18,SMALL(IF($S$15:$S$18=2,ROW(INDIRECT(\"1:\"&ROWS($S$15:$S$18)))),ROWS($1:2))),\"\")))","v":"Portugal"}]
[null,{"$f":"IF(COUNTIF($S$15:$S$18,1)>1,IF(ROWS($1:3)<=COUNTIF($S$15:$S$18,1),INDEX($T$15:$T$18,SMALL(IF($S$15:$S$18=1,ROW(INDIRECT(\"1:\"&ROWS($S$15:$S$18)))),ROWS($1:3))),\"\"),IF(COUNTIF($S$15:$S$18,2)>1,IF(ROWS($1:3)<=COUNTIF($S$15:$S$18,2),INDEX($T$15:$T$18,SMALL(IF($S$15:$S$18=2,ROW(INDIRECT(\"1:\"&ROWS($S$15:$S$18)))),ROWS($1:3))),\"\")))","v":"Maroc"},null,null,null,null,null,null,null,null,null,null,null,null,null,null,null,null,"Rg","Groupe D","MJ","G","N","P","BP","BC","Pts","Pts"]
[null,{"$f":"IF(COUNTIF($S$15:$S$18,1)>1,IF(ROWS($1:4)<=COUNTIF($S$15:$S$18,1),INDEX($T$15:$T$18,SMALL(IF($S$15:$S$18=1,ROW(INDIRECT(\"1:\"&ROWS($S$15:$S$18)))),ROWS($1:4))),\"\"),IF(COUNTIF($S$15:$S$18,2)>1,IF(ROWS($1:4)<=COUNTIF($S$15:$S$18,2),INDEX($T$15:$T$18,SMALL(IF($S$15:$S$18=2,ROW(INDIRECT(\"1:\"&ROWS($S$15:$S$18)))),ROWS($1:4))),\"\")))","v":"Espagne"},null,null,null,null,null,null,null,null,null,null,null,null,null,"D_1",{"$f":"TEXT(R78,\"00000\")&T78","v":"00000Argentine"},{"$f":"AB78*1000+AA78*100+Y78*10","v":0},{"$f":"RANK(R78,$R78:$R81,0)","v":1},{"$f":"VLOOKUP(P78,TABLEAU_TEAMS[#All],2,FALSE)","v":"Argentine"},{"$f":"SUMPRODUCT((Teams1=T78)*(Teams1_Score<>\"\"))+SUMPRODUCT((Teams2=T78)*(Teams2_Score<>\"\"))","v":0},{"$f":"SUMPRODUCT((Teams1=T78)*(Teams1_Score>Teams2_Score))+SUMPRODUCT((Teams2=T78)*(Teams2_Score>Teams1_Score))","v":0},{"$f":"SUMPRODUCT((Teams1=T78)*(Teams1_Score=Teams2_Score)*(Teams1_Score<>\"\"))+SUMPRODUCT((Teams2=T78)*(Teams2_Score=Teams1_Score)*(Teams2_Score<>\"\"))","v":0},{"$f":"SUMPRODUCT((Teams1=T78)*(Teams1_Score<Teams2_Score))+SUMPRODUCT((Teams2=T78)*(Teams2_Score<Teams1_Score))","v":0},{"$f":"SUMPRODUCT((Teams1=T78)*(Teams1_Score))+SUMPRODUCT((Teams2=T78)*(Teams2_Score))","v":0},{"$f":"SUMPRODUCT((Teams1=T78)*(Teams2_Score))+SUMPRODUCT((Teams2=T78)*(Teams1_Score))","v":0},{"$f":"Y78-Z78","v":0},{"$f":"3*V78+W78","v":0}]
[null,"Tirage au sort C1",null,null,null,null,null,null,null,null,null,null,null,null,null,"D_2",{"$f":"TEXT(R79,\"00000\")&T79","v":"00000Islande"},{"$f":"AB79*1000+AA79*100+Y79*10","v":0},{"$f":"RANK(R79,$R78:$R81,0)","v":1},{"$f":"VLOOKUP(P79,TABLEAU_TEAMS[#All],2,FALSE)","v":"Islande"},{"$f":"SUMPRODUCT((Teams1=T79)*(Teams1_Score<>\"\"))+SUMPRODUCT((Teams2=T79)*(Teams2_Score<>\"\"))","v":0},{"$f":"SUMPRODUCT((Teams1=T79)*(Teams1_Score>Teams2_Score))+SUMPRODUCT((Teams2=T79)*(Teams2_Score>Teams1_Score))","v":0},{"$f":"SUMPRODUCT((Teams1=T79)*(Teams1_Score=Teams2_Score)*(Teams1_Score<>\"\"))+SUMPRODUCT((Teams2=T79)*(Teams2_Score=Teams1_Score)*(Teams2_Score<>\"\"))","v":0},{"$f":"SUMPRODUCT((Teams1=T79)*(Teams1_Score<Teams2_Score))+SUMPRODUCT((Teams2=T79)*(Teams2_Score<Teams1_Score))","v":0},{"$f":"SUMPRODUCT((Teams1=T79)*(Teams1_Score))+SUMPRODUCT((Teams2=T79)*(Teams2_Score))","v":0},{"$f":"SUMPRODUCT((Teams1=T79)*(Teams2_Score))+SUMPRODUCT((Teams2=T79)*(Teams1_Score))","v":0},0,0]
[null,{"$f":"IF(ROWS($1:1)<=COUNTIF($S$21:$S$24,1),INDEX($T$21:$T$24,SMALL(IF($S$21:$S$24=1,ROW(INDIRECT(\"1:\"&ROWS($S$21:$S$24)))),ROWS($1:1))),\"\")","v":"Pérou"},null,null,null,null,null,null,null,null,null,null,null,null,null,"D_3",{"$f":"TEXT(R80,\"00000\")&T80","v":"00000Croatie"},{"$f":"AB80*1000+AA80*100+Y80*10","v":0},{"$f":"RANK(R80,$R78:$R81,0)","v":1},{"$f":"VLOOKUP(P80,TABLEAU_TEAMS[#All],2,FALSE)","v":"Croatie"},{"$f":"SUMPRODUCT((Teams1=T80)*(Teams1_Score<>\"\"))+SUMPRODUCT((Teams2=T80)*(Teams2_Score<>\"\"))","v":0},{"$f":"SUMPRODUCT((Teams1=T80)*(Teams1_Score>Teams2_Score))+SUMPRODUCT((Teams2=T80)*(Teams2_Score>Teams1_Score))","v":0},{"$f":"SUMPRODUCT((Teams1=T80)*(Teams1_Score=Teams2_Score)*(Teams1_Score<>\"\"))+SUMPRODUCT((Teams2=T80)*(Teams2_Score=Teams1_Score)*(Teams2_Score<>\"\"))","v":0},{"$f":"SUMPRODUCT((Teams1=T80)*(Teams1_Score<Teams2_Score))+SUMPRODUCT((Teams2=T80)*(Teams2_Score<Teams1_Score))","v":0},{"$f":"SUMPRODUCT((Teams1=T80)*(Teams1_Score))+SUMPRODUCT((Teams2=T80)*(Teams2_Score))","v":0},{"$f":"SUMPRODUCT((Teams1=T80)*(Teams2_Score))+SUMPRODUCT((Teams2=T80)*(Teams1_Score))","v":0},0,0]
[null,{"$f":"IF(ROWS($1:2)<=COUNTIF($S$21:$S$24,1),INDEX($T$21:$T$24,SMALL(IF($S$21:$S$24=1,ROW(INDIRECT(\"1:\"&ROWS($S$21:$S$24)))),ROWS($1:2))),\"\")","v":"France"},null,null,null,null,null,null,null,null,null,null,null,null,null,"D_4",{"$f":"TEXT(R81,\"00000\")&T81","v":"00000Nigeria"},{"$f":"AB81*1000+AA81*100+Y81*10","v":0},{"$f":"RANK(R81,$R78:$R81,0)","v":1},{"$f":"VLOOKUP(P81,TABLEAU_TEAMS[#All],2,FALSE)","v":"Nigeria"},{"$f":"SUMPRODUCT((Teams1=T81)*(Teams1_Score<>\"\"))+SUMPRODUCT((Teams2=T81)*(Teams2_Score<>\"\"))","v":0},{"$f":"SUMPRODUCT((Teams1=T81)*(Teams1_Score>Teams2_Score))+SUMPRODUCT((Teams2=T81)*(Teams2_Score>Teams1_Score))","v":0},{"$f":"SUMPRODUCT((Teams1=T81)*(Teams1_Score=Teams2_Score)*(Teams1_Score<>\"\"))+SUMPRODUCT((Teams2=T81)*(Teams2_Score=Teams1_Score)*(Teams2_Score<>\"\"))","v":0},{"$f":"SUMPRODUCT((Teams1=T81)*(Teams1_Score<Teams2_Score))+SUMPRODUCT((Teams2=T81)*(Teams2_Score<Teams1_Score))","v":0},{"$f":"SUMPRODUCT((Teams1=T81)*(Teams1_Score))+SUMPRODUCT((Teams2=T81)*(Teams2_Score))","v":0},{"$f":"SUMPRODUCT((Teams1=T81)*(Teams2_Score))+SUMPRODUCT((Teams2=T81)*(Teams1_Score))","v":0},0,0]
[null,{"$f":"IF(ROWS($1:3)<=COUNTIF($S$21:$S$24,1),INDEX($T$21:$T$24,SMALL(IF($S$21:$S$24=1,ROW(INDIRECT(\"1:\"&ROWS($S$21:$S$24)))),ROWS($1:3))),\"\")","v":"Danemark"}]
[null,{"$f":"IF(ROWS($1:4)<=COUNTIF($S$21:$S$24,1),INDEX($T$21:$T$24,SMALL(IF($S$21:$S$24=1,ROW(INDIRECT(\"1:\"&ROWS($S$21:$S$24)))),ROWS($1:4))),\"\")","v":"Australie"},null,null,null,null,null,null,null,null,null,null,null,null,null,null,null,null,"Rg","Groupe E","MJ","G","N","P","BP","BC","Pts","Pts"]
[null,"Tirage au sort C2",null,null,null,null,null,null,null,null,null,null,null,null,null,"E_1",{"$f":"TEXT(R84,\"00000\")&T84","v":"00000Costa Rica"},{"$f":"AB84*1000+AA84*100+Y84*10","v":0},{"$f":"RANK(R84,$R84:$R87,0)","v":1},{"$f":"VLOOKUP(P84,TABLEAU_TEAMS[#All],2,FALSE)","v":"Costa Rica"},{"$f":"SUMPRODUCT((Teams1=T84)*(Teams1_Score<>\"\"))+SUMPRODUCT((Teams2=T84)*(Teams2_Score<>\"\"))","v":0},{"$f":"SUMPRODUCT((Teams1=T84)*(Teams1_Score>Teams2_Score))+SUMPRODUCT((Teams2=T84)*(Teams2_Score>Teams1_Score))","v":0},{"$f":"SUMPRODUCT((Teams1=T84)*(Teams1_Score=Teams2_Score)*(Teams1_Score<>\"\"))+SUMPRODUCT((Teams2=T84)*(Teams2_Score=Teams1_Score)*(Teams2_Score<>\"\"))","v":0},{"$f":"SUMPRODUCT((Teams1=T84)*(Teams1_Score<Teams2_Score))+SUMPRODUCT((Teams2=T84)*(Teams2_Score<Teams1_Score))","v":0},{"$f":"SUMPRODUCT((Teams1=T84)*(Teams1_Score))+SUMPRODUCT((Teams2=T84)*(Teams2_Score))","v":0},{"$f":"SUMPRODUCT((Teams1=T84)*(Teams2_Score))+SUMPRODUCT((Teams2=T84)*(Teams1_Score))","v":0},{"$f":"Y84-Z84","v":0},{"$f":"3*V84+W84","v":0}]
[null,{"$f":"IF(COUNTIF($S$21:$S$24,1)>1,IF(ROWS($1:1)<=COUNTIF($S$21:$S$24,1),INDEX($T$21:$T$24,SMALL(IF($S$21:$S$24=1,ROW(INDIRECT(\"1:\"&ROWS($S$21:$S$24)))),ROWS($1:1))),\"\"),IF(COUNTIF($S$21:$S$24,2)>1,IF(ROWS($1:1)<=COUNTIF($S$21:$S$24,2),INDEX($T$21:$T$24,SMALL(IF($S$21:$S$24=2,ROW(INDIRECT(\"1:\"&ROWS($S$21:$S$24)))),ROWS($1:1))),\"\")))","v":"Pérou"},null,null,null,null,null,null,null,null,null,null,null,null,null,"E_2",{"$f":"TEXT(R85,\"00000\")&T85","v":"00000Serbie"},{"$f":"AB85*1000+AA85*100+Y85*10","v":0},{"$f":"RANK(R85,$R84:$R87,0)","v":1},{"$f":"VLOOKUP(P85,TABLEAU_TEAMS[#All],2,FALSE)","v":"Serbie"},{"$f":"SUMPRODUCT((Teams1=T85)*(Teams1_Score<>\"\"))+SUMPRODUCT((Teams2=T85)*(Teams2_Score<>\"\"))","v":0},{"$f":"SUMPRODUCT((Teams1=T85)*(Teams1_Score>Teams2_Score))+SUMPRODUCT((Teams2=T85)*(Teams2_Score>Teams1_Score))","v":0},{"$f":"SUMPRODUCT((Teams1=T85)*(Teams1_Score=Teams2_Score)*(Teams1_Score<>\"\"))+SUMPRODUCT((Teams2=T85)*(Teams2_Score=Teams1_Score)*(Teams2_Score<>\"\"))","v":0},{"$f":"SUMPRODUCT((Teams1=T85)*(Teams1_Score<Teams2_Score))+SUMPRODUCT((Teams2=T85)*(Teams2_Score<Teams1_Score))","v":0},{"$f":"SUMPRODUCT((Teams1=T85)*(Teams1_Score))+SUMPRODUCT((Teams2=T85)*(Teams2_Score))","v":0},{"$f":"SUMPRODUCT((Teams1=T85)*(Teams2_Score))+SUMPRODUCT((Teams2=T85)*(Teams1_Score))","v":0},0,0]
[null,{"$f":"IF(COUNTIF($S$21:$S$24,1)>1,IF(ROWS($1:2)<=COUNTIF($S$21:$S$24,1),INDEX($T$21:$T$24,SMALL(IF($S$21:$S$24=1,ROW(INDIRECT(\"1:\"&ROWS($S$21:$S$24)))),ROWS($1:2))),\"\"),IF(COUNTIF($S$21:$S$24,2)>1,IF(ROWS($1:2)<=COUNTIF($S$21:$S$24,2),INDEX($T$21:$T$24,SMALL(IF($S$21:$S$24=2,ROW(INDIRECT(\"1:\"&ROWS($S$21:$S$24)))),ROWS($1:2))),\"\")))","v":"France"},null,null,null,null,null,null,null,null,null,null,null,null,null,"E_3",{"$f":"TEXT(R86,\"00000\")&T86","v":"00000Brésil"},{"$f":"AB86*1000+AA86*100+Y86*10","v":0},{"$f":"RANK(R86,$R84:$R87,0)","v":1},{"$f":"VLOOKUP(P86,TABLEAU_TEAMS[#All],2,FALSE)","v":"Brésil"},{"$f":"SUMPRODUCT((Teams1=T86)*(Teams1_Score<>\"\"))+SUMPRODUCT((Teams2=T86)*(Teams2_Score<>\"\"))","v":0},{"$f":"SUMPRODUCT((Teams1=T86)*(Teams1_Score>Teams2_Score))+SUMPRODUCT((Teams2=T86)*(Teams2_Score>Teams1_Score))","v":0},{"$f":"SUMPRODUCT((Teams1=T86)*(Teams1_Score=Teams2_Score)*(Teams1_Score<>\"\"))+SUMPRODUCT((Teams2=T86)*(Teams2_Score=Teams1_Score)*(Teams2_Score<>\"\"))","v":0},{"$f":"SUMPRODUCT((Teams1=T86)*(Teams1_Score<Teams2_Score))+SUMPRODUCT((Teams2=T86)*(Teams2_Score<Teams1_Score))","v":0},{"$f":"SUMPRODUCT((Teams1=T86)*(Teams1_Score))+SUMPRODUCT((Teams2=T86)*(Teams2_Score))","v":0},{"$f":"SUMPRODUCT((Teams1=T86)*(Teams2_Score))+SUMPRODUCT((Teams2=T86)*(Teams1_Score))","v":0},0,0]
[null,{"$f":"IF(COUNTIF($S$21:$S$24,1)>1,IF(ROWS($1:3)<=COUNTIF($S$21:$S$24,1),INDEX($T$21:$T$24,SMALL(IF($S$21:$S$24=1,ROW(INDIRECT(\"1:\"&ROWS($S$21:$S$24)))),ROWS($1:3))),\"\"),IF(COUNTIF($S$21:$S$24,2)>1,IF(ROWS($1:3)<=COUNTIF($S$21:$S$24,2),INDEX($T$21:$T$24,SMALL(IF($S$21:$S$24=2,ROW(INDIRECT(\"1:\"&ROWS($S$21:$S$24)))),ROWS($1:3))),\"\")))","v":"Danemark"},null,null,null,null,null,null,null,null,null,null,null,null,null,"E_4",{"$f":"TEXT(R87,\"00000\")&T87","v":"00000Suisse"},{"$f":"AB87*1000+AA87*100+Y87*10","v":0},{"$f":"RANK(R87,$R84:$R87,0)","v":1},{"$f":"VLOOKUP(P87,TABLEAU_TEAMS[#All],2,FALSE)","v":"Suisse"},{"$f":"SUMPRODUCT((Teams1=T87)*(Teams1_Score<>\"\"))+SUMPRODUCT((Teams2=T87)*(Teams2_Score<>\"\"))","v":0},{"$f":"SUMPRODUCT((Teams1=T87)*(Teams1_Score>Teams2_Score))+SUMPRODUCT((Teams2=T87)*(Teams2_Score>Teams1_Score))","v":0},{"$f":"SUMPRODUCT((Teams1=T87)*(Teams1_Score=Teams2_Score)*(Teams1_Score<>\"\"))+SUMPRODUCT((Teams2=T87)*(Teams2_Score=Teams1_Score)*(Teams2_Score<>\"\"))","v":0},{"$f":"SUMPRODUCT((Teams1=T87)*(Teams1_Score<Teams2_Score))+SUMPRODUCT((Teams2=T87)*(Teams2_Score<Teams1_Score))","v":0},{"$f":"SUMPRODUCT((Teams1=T87)*(Teams1_Score))+SUMPRODUCT((Teams2=T87)*(Teams2_Score))","v":0},{"$f":"SUMPRODUCT((Teams1=T87)*(Teams2_Score))+SUMPRODUCT((Teams2=T87)*(Teams1_Score))","v":0},0,0]
[null,{"$f":"IF(COUNTIF($S$21:$S$24,1)>1,IF(ROWS($1:4)<=COUNTIF($S$21:$S$24,1),INDEX($T$21:$T$24,SMALL(IF($S$21:$S$24=1,ROW(INDIRECT(\"1:\"&ROWS($S$21:$S$24)))),ROWS($1:4))),\"\"),IF(COUNTIF($S$21:$S$24,2)>1,IF(ROWS($1:4)<=COUNTIF($S$21:$S$24,2),INDEX($T$21:$T$24,SMALL(IF($S$21:$S$24=2,ROW(INDIRECT(\"1:\"&ROWS($S$21:$S$24)))),ROWS($1:4))),\"\")))","v":"Australie"}]
[null,"Tirage au sort D1",null,null,null,null,null,null,null,null,null,null,null,null,null,null,null,null,"Rg","Groupe F","MJ","G","N","P","BP","BC","Pts","Pts"]
[null,{"$f":"IF(ROWS($1:1)<=COUNTIF($S$27:$S$30,1),INDEX($T$27:$T$30,SMALL(IF($S$27:$S$30=1,ROW(INDIRECT(\"1:\"&ROWS($S$27:$S$30)))),ROWS($1:1))),\"\")","v":"Nigeria"},null,null,null,null,null,null,null,null,null,null,null,null,null,"F_1",{"$f":"TEXT(R90,\"00000\")&T90","v":"00000Allemagne"},{"$f":"AB90*1000+AA90*100+Y90*10","v":0},{"$f":"RANK(R90,$R90:$R93,0)","v":1},{"$f":"VLOOKUP(P90,TABLEAU_TEAMS[#All],2,FALSE)","v":"Allemagne"},{"$f":"SUMPRODUCT((Teams1=T90)*(Teams1_Score<>\"\"))+SUMPRODUCT((Teams2=T90)*(Teams2_Score<>\"\"))","v":0},{"$f":"SUMPRODUCT((Teams1=T90)*(Teams1_Score>Teams2_Score))+SUMPRODUCT((Teams2=T90)*(Teams2_Score>Teams1_Score))","v":0},{"$f":"SUMPRODUCT((Teams1=T90)*(Teams1_Score=Teams2_Score)*(Teams1_Score<>\"\"))+SUMPRODUCT((Teams2=T90)*(Teams2_Score=Teams1_Score)*(Teams2_Score<>\"\"))","v":0},{"$f":"SUMPRODUCT((Teams1=T90)*(Teams1_Score<Teams2_Score))+SUMPRODUCT((Teams2=T90)*(Teams2_Score<Teams1_Score))","v":0},{"$f":"SUMPRODUCT((Teams1=T90)*(Teams1_Score))+SUMPRODUCT((Teams2=T90)*(Teams2_Score))","v":0},{"$f":"SUMPRODUCT((Teams1=T90)*(Teams2_Score))+SUMPRODUCT((Teams2=T90)*(Teams1_Score))","v":0},{"$f":"Y90-Z90","v":0},{"$f":"3*V90+W90","v":0}]
[null,{"$f":"IF(ROWS($1:2)<=COUNTIF($S$27:$S$30,1),INDEX($T$27:$T$30,SMALL(IF($S$27:$S$30=1,ROW(INDIRECT(\"1:\"&ROWS($S$27:$S$30)))),ROWS($1:2))),\"\")","v":"Islande"},null,null,null,null,null,null,null,null,null,null,null,null,null,"F_2",{"$f":"TEXT(R91,\"00000\")&T91","v":"00000Mexique"},{"$f":"AB91*1000+AA91*100+Y91*10","v":0},{"$f":"RANK(R91,$R90:$R93,0)","v":1},{"$f":"VLOOKUP(P91,TABLEAU_TEAMS[#All],2,FALSE)","v":"Mexique"},{"$f":"SUMPRODUCT((Teams1=T91)*(Teams1_Score<>\"\"))+SUMPRODUCT((Teams2=T91)*(Teams2_Score<>\"\"))","v":0},{"$f":"SUMPRODUCT((Teams1=T91)*(Teams1_Score>Teams2_Score))+SUMPRODUCT((Teams2=T91)*(Teams2_Score>Teams1_Score))","v":0},{"$f":"SUMPRODUCT((Teams1=T91)*(Teams1_Score=Teams2_Score)*(Teams1_Score<>\"\"))+SUMPRODUCT((Teams2=T91)*(Teams2_Score=Teams1_Score)*(Teams2_Score<>\"\"))","v":0},{"$f":"SUMPRODUCT((Teams1=T91)*(Teams1_Score<Teams2_Score))+SUMPRODUCT((Teams2=T91)*(Teams2_Score<Teams1_Score))","v":0},{"$f":"SUMPRODUCT((Teams1=T91)*(Teams1_Score))+SUMPRODUCT((Teams2=T91)*(Teams2_Score))","v":0},{"$f":"SUMPRODUCT((Teams1=T91)*(Teams2_Score))+SUMPRODUCT((Teams2=T91)*(Teams1_Score))","v":0},0,0]
[null,{"$f":"IF(ROWS($1:3)<=COUNTIF($S$27:$S$30,1),INDEX($T$27:$T$30,SMALL(IF($S$27:$S$30=1,ROW(INDIRECT(\"1:\"&ROWS($S$27:$S$30)))),ROWS($1:3))),\"\")","v":"Croatie"},null,null,null,null,null,null,null,null,null,null,null,null,null,"F_3",{"$f":"TEXT(R92,\"00000\")&T92","v":"00000Suède"},{"$f":"AB92*1000+AA92*100+Y92*10","v":0},{"$f":"RANK(R92,$R90:$R93,0)","v":1},{"$f":"VLOOKUP(P92,TABLEAU_TEAMS[#All],2,FALSE)","v":"Suède"},{"$f":"SUMPRODUCT((Teams1=T92)*(Teams1_Score<>\"\"))+SUMPRODUCT((Teams2=T92)*(Teams2_Score<>\"\"))","v":0},{"$f":"SUMPRODUCT((Teams1=T92)*(Teams1_Score>Teams2_Score))+SUMPRODUCT((Teams2=T92)*(Teams2_Score>Teams1_Score))","v":0},{"$f":"SUMPRODUCT((Teams1=T92)*(Teams1_Score=Teams2_Score)*(Teams1_Score<>\"\"))+SUMPRODUCT((Teams2=T92)*(Teams2_Score=Teams1_Score)*(Teams2_Score<>\"\"))","v":0},{"$f":"SUMPRODUCT((Teams1=T92)*(Teams1_Score<Teams2_Score))+SUMPRODUCT((Teams2=T92)*(Teams2_Score<Teams1_Score))","v":0},{"$f":"SUMPRODUCT((Teams1=T92)*(Teams1_Score))+SUMPRODUCT((Teams2=T92)*(Teams2_Score))","v":0},{"$f":"SUMPRODUCT((Teams1=T92)*(Teams2_Score))+SUMPRODUCT((Teams2=T92)*(Teams1_Score))","v":0},0,0]
[null,{"$f":"IF(ROWS($1:4)<=COUNTIF($S$27:$S$30,1),INDEX($T$27:$T$30,SMALL(IF($S$27:$S$30=1,ROW(INDIRECT(\"1:\"&ROWS($S$27:$S$30)))),ROWS($1:4))),\"\")","v":"Argentine"},null,null,null,null,null,null,null,null,null,null,null,null,null,"F_4",{"$f":"TEXT(R93,\"00000\")&T93","v":"00000République de Corée"},{"$f":"AB93*1000+AA93*100+Y93*10","v":0},{"$f":"RANK(R93,$R90:$R93,0)","v":1},{"$f":"VLOOKUP(P93,TABLEAU_TEAMS[#All],2,FALSE)","v":"République de Corée"},{"$f":"SUMPRODUCT((Teams1=T93)*(Teams1_Score<>\"\"))+SUMPRODUCT((Teams2=T93)*(Teams2_Score<>\"\"))","v":0},{"$f":"SUMPRODUCT((Teams1=T93)*(Teams1_Score>Teams2_Score))+SUMPRODUCT((Teams2=T93)*(Teams2_Score>Teams1_Score))","v":0},{"$f":"SUMPRODUCT((Teams1=T93)*(Teams1_Score=Teams2_Score)*(Teams1_Score<>\"\"))+SUMPRODUCT((Teams2=T93)*(Teams2_Score=Teams1_Score)*(Teams2_Score<>\"\"))","v":0},{"$f":"SUMPRODUCT((Teams1=T93)*(Teams1_Score<Teams2_Score))+SUMPRODUCT((Teams2=T93)*(Teams2_Score<Teams1_Score))","v":0},{"$f":"SUMPRODUCT((Teams1=T93)*(Teams1_Score))+SUMPRODUCT((Teams2=T93)*(Teams2_Score))","v":0},{"$f":"SUMPRODUCT((Teams1=T93)*(Teams2_Score))+SUMPRODUCT((Teams2=T93)*(Teams1_Score))","v":0},0,0]
[null,"Tirage au sort D2"]
[null,{"$f":"IF(COUNTIF($S$27:$S$30,1)>1,IF(ROWS($1:1)<=COUNTIF($S$27:$S$30,1),INDEX($T$27:$T$30,SMALL(IF($S$27:$S$30=1,ROW(INDIRECT(\"1:\"&ROWS($S$27:$S$30)))),ROWS($1:1))),\"\"),IF(COUNTIF($S$27:$S$30,2)>1,IF(ROWS($1:1)<=COUNTIF($S$27:$S$30,2),INDEX($T$27:$T$30,SMALL(IF($S$27:$S$30=2,ROW(INDIRECT(\"1:\"&ROWS($S$27:$S$30)))),ROWS($1:1))),\"\")))","v":"Nigeria"},null,null,null,null,null,null,null,null,null,null,null,null,null,null,null,null,"Rg","Groupe G","MJ","G","N","P","BP","BC","Pts","Pts"]
[null,{"$f":"IF(COUNTIF($S$27:$S$30,1)>1,IF(ROWS($1:2)<=COUNTIF($S$27:$S$30,1),INDEX($T$27:$T$30,SMALL(IF($S$27:$S$30=1,ROW(INDIRECT(\"1:\"&ROWS($S$27:$S$30)))),ROWS($1:2))),\"\"),IF(COUNTIF($S$27:$S$30,2)>1,IF(ROWS($1:2)<=COUNTIF($S$27:$S$30,2),INDEX($T$27:$T$30,SMALL(IF($S$27:$S$30=2,ROW(INDIRECT(\"1:\"&ROWS($S$27:$S$30)))),ROWS($1:2))),\"\")))","v":"Islande"},null,null,null,null,null,null,null,null,null,null,null,null,null,"G_1",{"$f":"TEXT(R96,\"00000\")&T96","v":"00000Belgique"},{"$f":"AB96*1000+AA96*100+Y96*10","v":0},{"$f":"RANK(R96,$R96:$R99,0)","v":1},{"$f":"VLOOKUP(P96,TABLEAU_TEAMS[#All],2,FALSE)","v":"Belgique"},{"$f":"SUMPRODUCT((Teams1=T96)*(Teams1_Score<>\"\"))+SUMPRODUCT((Teams2=T96)*(Teams2_Score<>\"\"))","v":0},{"$f":"SUMPRODUCT((Teams1=T96)*(Teams1_Score>Teams2_Score))+SUMPRODUCT((Teams2=T96)*(Teams2_Score>Teams1_Score))","v":0},{"$f":"SUMPRODUCT((Teams1=T96)*(Teams1_Score=Teams2_Score)*(Teams1_Score<>\"\"))+SUMPRODUCT((Teams2=T96)*(Teams2_Score=Teams1_Score)*(Teams2_Score<>\"\"))","v":0},{"$f":"SUMPRODUCT((Teams1=T96)*(Teams1_Score<Teams2_Score))+SUMPRODUCT((Teams2=T96)*(Teams2_Score<Teams1_Score))","v":0},{"$f":"SUMPRODUCT((Teams1=T96)*(Teams1_Score))+SUMPRODUCT((Teams2=T96)*(Teams2_Score))","v":0},{"$f":"SUMPRODUCT((Teams1=T96)*(Teams2_Score))+SUMPRODUCT((Teams2=T96)*(Teams1_Score))","v":0},{"$f":"Y96-Z96","v":0},{"$f":"3*V96+W96","v":0}]
[null,{"$f":"IF(COUNTIF($S$27:$S$30,1)>1,IF(ROWS($1:3)<=COUNTIF($S$27:$S$30,1),INDEX($T$27:$T$30,SMALL(IF($S$27:$S$30=1,ROW(INDIRECT(\"1:\"&ROWS($S$27:$S$30)))),ROWS($1:3))),\"\"),IF(COUNTIF($S$27:$S$30,2)>1,IF(ROWS($1:3)<=COUNTIF($S$27:$S$30,2),INDEX($T$27:$T$30,SMALL(IF($S$27:$S$30=2,ROW(INDIRECT(\"1:\"&ROWS($S$27:$S$30)))),ROWS($1:3))),\"\")))","v":"Croatie"},null,null,null,null,null,null,null,null,null,null,null,null,null,"G_2",{"$f":"TEXT(R97,\"00000\")&T97","v":"00000Panama"},{"$f":"AB97*1000+AA97*100+Y97*10","v":0},{"$f":"RANK(R97,$R96:$R99,0)","v":1},{"$f":"VLOOKUP(P97,TABLEAU_TEAMS[#All],2,FALSE)","v":"Panama"},{"$f":"SUMPRODUCT((Teams1=T97)*(Teams1_Score<>\"\"))+SUMPRODUCT((Teams2=T97)*(Teams2_Score<>\"\"))","v":0},{"$f":"SUMPRODUCT((Teams1=T97)*(Teams1_Score>Teams2_Score))+SUMPRODUCT((Teams2=T97)*(Teams2_Score>Teams1_Score))","v":0},{"$f":"SUMPRODUCT((Teams1=T97)*(Teams1_Score=Teams2_Score)*(Teams1_Score<>\"\"))+SUMPRODUCT((Teams2=T97)*(Teams2_Score=Teams1_Score)*(Teams2_Score<>\"\"))","v":0},{"$f":"SUMPRODUCT((Teams1=T97)*(Teams1_Score<Teams2_Score))+SUMPRODUCT((Teams2=T97)*(Teams2_Score<Teams1_Score))","v":0},{"$f":"SUMPRODUCT((Teams1=T97)*(Teams1_Score))+SUMPRODUCT((Teams2=T97)*(Teams2_Score))","v":0},{"$f":"SUMPRODUCT((Teams1=T97)*(Teams2_Score))+SUMPRODUCT((Teams2=T97)*(Teams1_Score))","v":0},0,0]
[null,{"$f":"IF(COUNTIF($S$27:$S$30,1)>1,IF(ROWS($1:4)<=COUNTIF($S$27:$S$30,1),INDEX($T$27:$T$30,SMALL(IF($S$27:$S$30=1,ROW(INDIRECT(\"1:\"&ROWS($S$27:$S$30)))),ROWS($1:4))),\"\"),IF(COUNTIF($S$27:$S$30,2)>1,IF(ROWS($1:4)<=COUNTIF($S$27:$S$30,2),INDEX($T$27:$T$30,SMALL(IF($S$27:$S$30=2,ROW(INDIRECT(\"1:\"&ROWS($S$27:$S$30)))),ROWS($1:4))),\"\")))","v":"Argentine"},null,null,null,null,null,null,null,null,null,null,null,null,null,"G_3",{"$f":"TEXT(R98,\"00000\")&T98","v":"00000Tunisie"},{"$f":"AB98*1000+AA98*100+Y98*10","v":0},{"$f":"RANK(R98,$R96:$R99,0)","v":1},{"$f":"VLOOKUP(P98,TABLEAU_TEAMS[#All],2,FALSE)","v":"Tunisie"},{"$f":"SUMPRODUCT((Teams1=T98)*(Teams1_Score<>\"\"))+SUMPRODUCT((Teams2=T98)*(Teams2_Score<>\"\"))","v":0},{"$f":"SUMPRODUCT((Teams1=T98)*(Teams1_Score>Teams2_Score))+SUMPRODUCT((Teams2=T98)*(Teams2_Score>Teams1_Score))","v":0},{"$f":"SUMPRODUCT((Teams1=T98)*(Teams1_Score=Teams2_Score)*(Teams1_Score<>\"\"))+SUMPRODUCT((Teams2=T98)*(Teams2_Score=Teams1_Score)*(Teams2_Score<>\"\"))","v":0},{"$f":"SUMPRODUCT((Teams1=T98)*(Teams1_Score<Teams2_Score))+SUMPRODUCT((Teams2=T98)*(Teams2_Score<Teams1_Score))","v":0},{"$f":"SUMPRODUCT((Teams1=T98)*(Teams1_Score))+SUMPRODUCT((Teams2=T98)*(Teams2_Score))","v":0},{"$f":"SUMPRODUCT((Teams1=T98)*(Teams2_Score))+SUMPRODUCT((Teams2=T98)*(Teams1_Score))","v":0},0,0]
[null,"Tirage au sort E1",null,null,null,null,null,null,null,null,null,null,null,null,null,"G_4",{"$f":"TEXT(R99,\"00000\")&T99","v":"00000Angleterre"},{"$f":"AB99*1000+AA99*100+Y99*10","v":0},{"$f":"RANK(R99,$R96:$R99,0)","v":1},{"$f":"VLOOKUP(P99,TABLEAU_TEAMS[#All],2,FALSE)","v":"Angleterre"},{"$f":"SUMPRODUCT((Teams1=T99)*(Teams1_Score<>\"\"))+SUMPRODUCT((Teams2=T99)*(Teams2_Score<>\"\"))","v":0},{"$f":"SUMPRODUCT((Teams1=T99)*(Teams1_Score>Teams2_Score))+SUMPRODUCT((Teams2=T99)*(Teams2_Score>Teams1_Score))","v":0},{"$f":"SUMPRODUCT((Teams1=T99)*(Teams1_Score=Teams2_Score)*(Teams1_Score<>\"\"))+SUMPRODUCT((Teams2=T99)*(Teams2_Score=Teams1_Score)*(Teams2_Score<>\"\"))","v":0},{"$f":"SUMPRODUCT((Teams1=T99)*(Teams1_Score<Teams2_Score))+SUMPRODUCT((Teams2=T99)*(Teams2_Score<Teams1_Score))","v":0},{"$f":"SUMPRODUCT((Teams1=T99)*(Teams1_Score))+SUMPRODUCT((Teams2=T99)*(Teams2_Score))","v":0},{"$f":"SUMPRODUCT((Teams1=T99)*(Teams2_Score))+SUMPRODUCT((Teams2=T99)*(Teams1_Score))","v":0},0,0]
[null,{"$f":"IF(ROWS($1:1)<=COUNTIF($S$33:$S$36,1),INDEX($T$33:$T$36,SMALL(IF($S$33:$S$36=1,ROW(INDIRECT(\"1:\"&ROWS($S$33:$S$36)))),ROWS($1:1))),\"\")","v":"Suisse"}]
[null,{"$f":"IF(ROWS($1:2)<=COUNTIF($S$33:$S$36,1),INDEX($T$33:$T$36,SMALL(IF($S$33:$S$36=1,ROW(INDIRECT(\"1:\"&ROWS($S$33:$S$36)))),ROWS($1:2))),\"\")","v":"Serbie"},null,null,null,null,null,null,null,null,null,null,null,null,null,null,null,null,"Rg","Groupe H","MJ","G","N","P","BP","BC","Pts","Pts"]
[null,{"$f":"IF(ROWS($1:3)<=COUNTIF($S$33:$S$36,1),INDEX($T$33:$T$36,SMALL(IF($S$33:$S$36=1,ROW(INDIRECT(\"1:\"&ROWS($S$33:$S$36)))),ROWS($1:3))),\"\")","v":"Costa Rica"},null,null,null,null,null,null,null,null,null,null,null,null,null,"H_1",{"$f":"TEXT(R102,\"00000\")&T102","v":"00000Colombie"},{"$f":"AB102*1000+AA102*100+Y102*10","v":0},{"$f":"RANK(R102,$R102:$R105,0)","v":1},{"$f":"VLOOKUP(P102,TABLEAU_TEAMS[#All],2,FALSE)","v":"Colombie"},{"$f":"SUMPRODUCT((Teams1=T102)*(Teams1_Score<>\"\"))+SUMPRODUCT((Teams2=T102)*(Teams2_Score<>\"\"))","v":0},{"$f":"SUMPRODUCT((Teams1=T102)*(Teams1_Score>Teams2_Score))+SUMPRODUCT((Teams2=T102)*(Teams2_Score>Teams1_Score))","v":0},{"$f":"SUMPRODUCT((Teams1=T102)*(Teams1_Score=Teams2_Score)*(Teams1_Score<>\"\"))+SUMPRODUCT((Teams2=T102)*(Teams2_Score=Teams1_Score)*(Teams2_Score<>\"\"))","v":0},{"$f":"SUMPRODUCT((Teams1=T102)*(Teams1_Score<Teams2_Score))+SUMPRODUCT((Teams2=T102)*(Teams2_Score<Teams1_Score))","v":0},{"$f":"SUMPRODUCT((Teams1=T102)*(Teams1_Score))+SUMPRODUCT((Teams2=T102)*(Teams2_Score))","v":0},{"$f":"SUMPRODUCT((Teams1=T102)*(Teams2_Score))+SUMPRODUCT((Teams2=T102)*(Teams1_Score))","v":0},{"$f":"Y102-Z102","v":0},{"$f":"3*V102+W102","v":0}]
[null,{"$f":"IF(ROWS($1:4)<=COUNTIF($S$33:$S$36,1),INDEX($T$33:$T$36,SMALL(IF($S$33:$S$36=1,ROW(INDIRECT(\"1:\"&ROWS($S$33:$S$36)))),ROWS($1:4))),\"\")","v":"Brésil"},null,null,null,null,null,null,null,null,null,null,null,null,null,"H_2",{"$f":"TEXT(R103,\"00000\")&T103","v":"00000Japon"},{"$f":"AB103*1000+AA103*100+Y103*10","v":0},{"$f":"RANK(R103,$R102:$R105,0)","v":1},{"$f":"VLOOKUP(P103,TABLEAU_TEAMS[#All],2,FALSE)","v":"Japon"},{"$f":"SUMPRODUCT((Teams1=T103)*(Teams1_Score<>\"\"))+SUMPRODUCT((Teams2=T103)*(Teams2_Score<>\"\"))","v":0},{"$f":"SUMPRODUCT((Teams1=T103)*(Teams1_Score>Teams2_Score))+SUMPRODUCT((Teams2=T103)*(Teams2_Score>Teams1_Score))","v":0},{"$f":"SUMPRODUCT((Teams1=T103)*(Teams1_Score=Teams2_Score)*(Teams1_Score<>\"\"))+SUMPRODUCT((Teams2=T103)*(Teams2_Score=Teams1_Score)*(Teams2_Score<>\"\"))","v":0},{"$f":"SUMPRODUCT((Teams1=T103)*(Teams1_Score<Teams2_Score))+SUMPRODUCT((Teams2=T103)*(Teams2_Score<Teams1_Score))","v":0},{"$f":"SUMPRODUCT((Teams1=T103)*(Teams1_Score))+SUMPRODUCT((Teams2=T103)*(Teams2_Score))","v":0},{"$f":"SUMPRODUCT((Teams1=T103)*(Teams2_Score))+SUMPRODUCT((Teams2=T103)*(Teams1_Score))","v":0},0,0]
[null,"Tirage au sort E2",null,null,null,null,null,null,null,null,null,null,null,null,null,"H_3",{"$f":"TEXT(R104,\"00000\")&T104","v":"00000Pologne"},{"$f":"AB104*1000+AA104*100+Y104*10","v":0},{"$f":"RANK(R104,$R102:$R105,0)","v":1},{"$f":"VLOOKUP(P104,TABLEAU_TEAMS[#All],2,FALSE)","v":"Pologne"},{"$f":"SUMPRODUCT((Teams1=T104)*(Teams1_Score<>\"\"))+SUMPRODUCT((Teams2=T104)*(Teams2_Score<>\"\"))","v":0},{"$f":"SUMPRODUCT((Teams1=T104)*(Teams1_Score>Teams2_Score))+SUMPRODUCT((Teams2=T104)*(Teams2_Score>Teams1_Score))","v":0},{"$f":"SUMPRODUCT((Teams1=T104)*(Teams1_Score=Teams2_Score)*(Teams1_Score<>\"\"))+SUMPRODUCT((Teams2=T104)*(Teams2_Score=Teams1_Score)*(Teams2_Score<>\"\"))","v":0},{"$f":"SUMPRODUCT((Teams1=T104)*(Teams1_Score<Teams2_Score))+SUMPRODUCT((Teams2=T104)*(Teams2_Score<Teams1_Score))","v":0},{"$f":"SUMPRODUCT((Teams1=T104)*(Teams1_Score))+SUMPRODUCT((Teams2=T104)*(Teams2_Score))","v":0},{"$f":"SUMPRODUCT((Teams1=T104)*(Teams2_Score))+SUMPRODUCT((Teams2=T104)*(Teams1_Score))","v":0},0,0]
[null,{"$f":"IF(COUNTIF($S$33:$S$36,1)>1,IF(ROWS($1:1)<=COUNTIF($S$33:$S$36,1),INDEX($T$33:$T$36,SMALL(IF($S$33:$S$36=1,ROW(INDIRECT(\"1:\"&ROWS($S$33:$S$36)))),ROWS($1:1))),\"\"),IF(COUNTIF($S$33:$S$36,2)>1,IF(ROWS($1:1)<=COUNTIF($S$33:$S$36,2),INDEX($T$33:$T$36,SMALL(IF($S$33:$S$36=2,ROW(INDIRECT(\"1:\"&ROWS($S$33:$S$36)))),ROWS($1:1))),\"\")))","v":"Suisse"},null,null,null,null,null,null,null,null,null,null,null,null,null,"H_4",{"$f":"TEXT(R105,\"00000\")&T105","v":"00000Sénégal"},{"$f":"AB105*1000+AA105*100+Y105*10","v":0},{"$f":"RANK(R105,$R102:$R105,0)","v":1},{"$f":"VLOOKUP(P105,TABLEAU_TEAMS[#All],2,FALSE)","v":"Sénégal"},{"$f":"SUMPRODUCT((Teams1=T105)*(Teams1_Score<>\"\"))+SUMPRODUCT((Teams2=T105)*(Teams2_Score<>\"\"))","v":0},{"$f":"SUMPRODUCT((Teams1=T105)*(Teams1_Score>Teams2_Score))+SUMPRODUCT((Teams2=T105)*(Teams2_Score>Teams1_Score))","v":0},{"$f":"SUMPRODUCT((Teams1=T105)*(Teams1_Score=Teams2_Score)*(Teams1_Score<>\"\"))+SUMPRODUCT((Teams2=T105)*(Teams2_Score=Teams1_Score)*(Teams2_Score<>\"\"))","v":0},{"$f":"SUMPRODUCT((Teams1=T105)*(Teams1_Score<Teams2_Score))+SUMPRODUCT((Teams2=T105)*(Teams2_Score<Teams1_Score))","v":0},{"$f":"SUMPRODUCT((Teams1=T105)*(Teams1_Score))+SUMPRODUCT((Teams2=T105)*(Teams2_Score))","v":0},{"$f":"SUMPRODUCT((Teams1=T105)*(Teams2_Score))+SUMPRODUCT((Teams2=T105)*(Teams1_Score))","v":0},0,0]
[null,{"$f":"IF(COUNTIF($S$33:$S$36,1)>1,IF(ROWS($1:2)<=COUNTIF($S$33:$S$36,1),INDEX($T$33:$T$36,SMALL(IF($S$33:$S$36=1,ROW(INDIRECT(\"1:\"&ROWS($S$33:$S$36)))),ROWS($1:2))),\"\"),IF(COUNTIF($S$33:$S$36,2)>1,IF(ROWS($1:2)<=COUNTIF($S$33:$S$36,2),INDEX($T$33:$T$36,SMALL(IF($S$33:$S$36=2,ROW(INDIRECT(\"1:\"&ROWS($S$33:$S$36)))),ROWS($1:2))),\"\")))","v":"Serbie"}]
[null,{"$f":"IF(COUNTIF($S$33:$S$36,1)>1,IF(ROWS($1:3)<=COUNTIF($S$33:$S$36,1),INDEX($T$33:$T$36,SMALL(IF($S$33:$S$36=1,ROW(INDIRECT(\"1:\"&ROWS($S$33:$S$36)))),ROWS($1:3))),\"\"),IF(COUNTIF($S$33:$S$36,2)>1,IF(ROWS($1:3)<=COUNTIF($S$33:$S$36,2),INDEX($T$33:$T$36,SMALL(IF($S$33:$S$36=2,ROW(INDIRECT(\"1:\"&ROWS($S$33:$S$36)))),ROWS($1:3))),\"\")))","v":"Costa Rica"}]
[null,{"$f":"IF(COUNTIF($S$33:$S$36,1)>1,IF(ROWS($1:4)<=COUNTIF($S$33:$S$36,1),INDEX($T$33:$T$36,SMALL(IF($S$33:$S$36=1,ROW(INDIRECT(\"1:\"&ROWS($S$33:$S$36)))),ROWS($1:4))),\"\"),IF(COUNTIF($S$33:$S$36,2)>1,IF(ROWS($1:4)<=COUNTIF($S$33:$S$36,2),INDEX($T$33:$T$36,SMALL(IF($S$33:$S$36=2,ROW(INDIRECT(\"1:\"&ROWS($S$33:$S$36)))),ROWS($1:4))),\"\")))","v":"Brésil"}]
[null,"Tirage au sort F1"]
[null,{"$f":"IF(ROWS($1:1)<=COUNTIF($S$39:$S$42,1),INDEX($T$39:$T$42,SMALL(IF($S$39:$S$42=1,ROW(INDIRECT(\"1:\"&ROWS($S$39:$S$42)))),ROWS($1:1))),\"\")","v":"Suède"}]
[null,{"$f":"IF(ROWS($1:2)<=COUNTIF($S$39:$S$42,1),INDEX($T$39:$T$42,SMALL(IF($S$39:$S$42=1,ROW(INDIRECT(\"1:\"&ROWS($S$39:$S$42)))),ROWS($1:2))),\"\")","v":"République de Corée"}]
[null,{"$f":"IF(ROWS($1:3)<=COUNTIF($S$39:$S$42,1),INDEX($T$39:$T$42,SMALL(IF($S$39:$S$42=1,ROW(INDIRECT(\"1:\"&ROWS($S$39:$S$42)))),ROWS($1:3))),\"\")","v":"Mexique"}]
[null,{"$f":"IF(ROWS($1:4)<=COUNTIF($S$39:$S$42,1),INDEX($T$39:$T$42,SMALL(IF($S$39:$S$42=1,ROW(INDIRECT(\"1:\"&ROWS($S$39:$S$42)))),ROWS($1:4))),\"\")","v":"Allemagne"}]
[null,"Tirage au sort F2"]
[null,{"$f":"IF(COUNTIF($S$39:$S$42,1)>1,IF(ROWS($1:1)<=COUNTIF($S$39:$S$42,1),INDEX($T$39:$T$42,SMALL(IF($S$39:$S$42=1,ROW(INDIRECT(\"1:\"&ROWS($S$39:$S$42)))),ROWS($1:1))),\"\"),IF(COUNTIF($S$39:$S$42,2)>1,IF(ROWS($1:1)<=COUNTIF($S$39:$S$42,2),INDEX($T$39:$T$42,SMALL(IF($S$39:$S$42=2,ROW(INDIRECT(\"1:\"&ROWS($S$39:$S$42)))),ROWS($1:1))),\"\")))","v":"Suède"}]
[null,{"$f":"IF(COUNTIF($S$39:$S$42,1)>1,IF(ROWS($1:2)<=COUNTIF($S$39:$S$42,1),INDEX($T$39:$T$42,SMALL(IF($S$39:$S$42=1,ROW(INDIRECT(\"1:\"&ROWS($S$39:$S$42)))),ROWS($1:2))),\"\"),IF(COUNTIF($S$39:$S$42,2)>1,IF(ROWS($1:2)<=COUNTIF($S$39:$S$42,2),INDEX($T$39:$T$42,SMALL(IF($S$39:$S$42=2,ROW(INDIRECT(\"1:\"&ROWS($S$39:$S$42)))),ROWS($1:2))),\"\")))","v":"République de Corée"}]
[null,{"$f":"IF(COUNTIF($S$39:$S$42,1)>1,IF(ROWS($1:3)<=COUNTIF($S$39:$S$42,1),INDEX($T$39:$T$42,SMALL(IF($S$39:$S$42=1,ROW(INDIRECT(\"1:\"&ROWS($S$39:$S$42)))),ROWS($1:3))),\"\"),IF(COUNTIF($S$39:$S$42,2)>1,IF(ROWS($1:3)<=COUNTIF($S$39:$S$42,2),INDEX($T$39:$T$42,SMALL(IF($S$39:$S$42=2,ROW(INDIRECT(\"1:\"&ROWS($S$39:$S$42)))),ROWS($1:3))),\"\")))","v":"Mexique"}]
[null,{"$f":"IF(COUNTIF($S$39:$S$42,1)>1,IF(ROWS($1:4)<=COUNTIF($S$39:$S$42,1),INDEX($T$39:$T$42,SMALL(IF($S$39:$S$42=1,ROW(INDIRECT(\"1:\"&ROWS($S$39:$S$42)))),ROWS($1:4))),\"\"),IF(COUNTIF($S$39:$S$42,2)>1,IF(ROWS($1:4)<=COUNTIF($S$39:$S$42,2),INDEX($T$39:$T$42,SMALL(IF($S$39:$S$42=2,ROW(INDIRECT(\"1:\"&ROWS($S$39:$S$42)))),ROWS($1:4))),\"\")))","v":"Allemagne"}]
[null,"Tirage au sort G1"]
[null,{"$f":"IF(ROWS($1:1)<=COUNTIF($S$45:$S$48,1),INDEX($T$45:$T$48,SMALL(IF($S$45:$S$48=1,ROW(INDIRECT(\"1:\"&ROWS($S$45:$S$48)))),ROWS($1:1))),\"\")","v":"Tunisie"}]
[null,{"$f":"IF(ROWS($1:2)<=COUNTIF($S$45:$S$48,1),INDEX($T$45:$T$48,SMALL(IF($S$45:$S$48=1,ROW(INDIRECT(\"1:\"&ROWS($S$45:$S$48)))),ROWS($1:2))),\"\")","v":"Panama"}]
[null,{"$f":"IF(ROWS($1:3)<=COUNTIF($S$45:$S$48,1),INDEX($T$45:$T$48,SMALL(IF($S$45:$S$48=1,ROW(INDIRECT(\"1:\"&ROWS($S$45:$S$48)))),ROWS($1:3))),\"\")","v":"Belgique"}]
[null,{"$f":"IF(ROWS($1:4)<=COUNTIF($S$45:$S$48,1),INDEX($T$45:$T$48,SMALL(IF($S$45:$S$48=1,ROW(INDIRECT(\"1:\"&ROWS($S$45:$S$48)))),ROWS($1:4))),\"\")","v":"Angleterre"}]
[null,"Tirage au sort G2"]
[null,{"$f":"IF(COUNTIF($S$45:$S$48,1)>1,IF(ROWS($1:1)<=COUNTIF($S$45:$S$48,1),INDEX($T$45:$T$48,SMALL(IF($S$45:$S$48=1,ROW(INDIRECT(\"1:\"&ROWS($S$45:$S$48)))),ROWS($1:1))),\"\"),IF(COUNTIF($S$45:$S$48,2)>1,IF(ROWS($1:1)<=COUNTIF($S$45:$S$48,2),INDEX($T$45:$T$48,SMALL(IF($S$45:$S$48=2,ROW(INDIRECT(\"1:\"&ROWS($S$45:$S$48)))),ROWS($1:1))),\"\")))","v":"Tunisie"}]
[null,{"$f":"IF(COUNTIF($S$45:$S$48,1)>1,IF(ROWS($1:2)<=COUNTIF($S$45:$S$48,1),INDEX($T$45:$T$48,SMALL(IF($S$45:$S$48=1,ROW(INDIRECT(\"1:\"&ROWS($S$45:$S$48)))),ROWS($1:2))),\"\"),IF(COUNTIF($S$45:$S$48,2)>1,IF(ROWS($1:2)<=COUNTIF($S$45:$S$48,2),INDEX($T$45:$T$48,SMALL(IF($S$45:$S$48=2,ROW(INDIRECT(\"1:\"&ROWS($S$45:$S$48)))),ROWS($1:2))),\"\")))","v":"Panama"}]
[null,{"$f":"IF(COUNTIF($S$45:$S$48,1)>1,IF(ROWS($1:3)<=COUNTIF($S$45:$S$48,1),INDEX($T$45:$T$48,SMALL(IF($S$45:$S$48=1,ROW(INDIRECT(\"1:\"&ROWS($S$45:$S$48)))),ROWS($1:3))),\"\"),IF(COUNTIF($S$45:$S$48,2)>1,IF(ROWS($1:3)<=COUNTIF($S$45:$S$48,2),INDEX($T$45:$T$48,SMALL(IF($S$45:$S$48=2,ROW(INDIRECT(\"1:\"&ROWS($S$45:$S$48)))),ROWS($1:3))),\"\")))","v":"Belgique"}]
[null,{"$f":"IF(COUNTIF($S$45:$S$48,1)>1,IF(ROWS($1:4)<=COUNTIF($S$45:$S$48,1),INDEX($T$45:$T$48,SMALL(IF($S$45:$S$48=1,ROW(INDIRECT(\"1:\"&ROWS($S$45:$S$48)))),ROWS($1:4))),\"\"),IF(COUNTIF($S$45:$S$48,2)>1,IF(ROWS($1:4)<=COUNTIF($S$45:$S$48,2),INDEX($T$45:$T$48,SMALL(IF($S$45:$S$48=2,ROW(INDIRECT(\"1:\"&ROWS($S$45:$S$48)))),ROWS($1:4))),\"\")))","v":"Angleterre"}]
[null,"Tirage au sort H1"]
[null,{"$f":"IF(ROWS($1:1)<=COUNTIF($S$51:$S$54,1),INDEX($T$51:$T$54,SMALL(IF($S$51:$S$54=1,ROW(INDIRECT(\"1:\"&ROWS($S$51:$S$54)))),ROWS($1:1))),\"\")","v":"Sénégal"}]
[null,{"$f":"IF(ROWS($1:2)<=COUNTIF($S$51:$S$54,1),INDEX($T$51:$T$54,SMALL(IF($S$51:$S$54=1,ROW(INDIRECT(\"1:\"&ROWS($S$51:$S$54)))),ROWS($1:2))),\"\")","v":"Pologne"}]
[null,{"$f":"IF(ROWS($1:3)<=COUNTIF($S$51:$S$54,1),INDEX($T$51:$T$54,SMALL(IF($S$51:$S$54=1,ROW(INDIRECT(\"1:\"&ROWS($S$51:$S$54)))),ROWS($1:3))),\"\")","v":"Japon"}]
[null,{"$f":"IF(ROWS($1:4)<=COUNTIF($S$51:$S$54,1),INDEX($T$51:$T$54,SMALL(IF($S$51:$S$54=1,ROW(INDIRECT(\"1:\"&ROWS($S$51:$S$54)))),ROWS($1:4))),\"\")","v":"Colombie"}]
[null,"Tirage au sort H2"]
[null,{"$f":"IF(COUNTIF($S$51:$S$54,1)>1,IF(ROWS($1:1)<=COUNTIF($S$51:$S$54,1),INDEX($T$51:$T$54,SMALL(IF($S$51:$S$54=1,ROW(INDIRECT(\"1:\"&ROWS($S$51:$S$54)))),ROWS($1:1))),\"\"),IF(COUNTIF($S$51:$S$54,2)>1,IF(ROWS($1:1)<=COUNTIF($S$51:$S$54,2),INDEX($T$51:$T$54,SMALL(IF($S$51:$S$54=2,ROW(INDIRECT(\"1:\"&ROWS($S$51:$S$54)))),ROWS($1:1))),\"\")))","v":"Sénégal"}]
[null,{"$f":"IF(COUNTIF($S$51:$S$54,1)>1,IF(ROWS($1:2)<=COUNTIF($S$51:$S$54,1),INDEX($T$51:$T$54,SMALL(IF($S$51:$S$54=1,ROW(INDIRECT(\"1:\"&ROWS($S$51:$S$54)))),ROWS($1:2))),\"\"),IF(COUNTIF($S$51:$S$54,2)>1,IF(ROWS($1:2)<=COUNTIF($S$51:$S$54,2),INDEX($T$51:$T$54,SMALL(IF($S$51:$S$54=2,ROW(INDIRECT(\"1:\"&ROWS($S$51:$S$54)))),ROWS($1:2))),\"\")))","v":"Pologne"}]
[null,{"$f":"IF(COUNTIF($S$51:$S$54,1)>1,IF(ROWS($1:3)<=COUNTIF($S$51:$S$54,1),INDEX($T$51:$T$54,SMALL(IF($S$51:$S$54=1,ROW(INDIRECT(\"1:\"&ROWS($S$51:$S$54)))),ROWS($1:3))),\"\"),IF(COUNTIF($S$51:$S$54,2)>1,IF(ROWS($1:3)<=COUNTIF($S$51:$S$54,2),INDEX($T$51:$T$54,SMALL(IF($S$51:$S$54=2,ROW(INDIRECT(\"1:\"&ROWS($S$51:$S$54)))),ROWS($1:3))),\"\")))","v":"Japon"}]
[null,{"$f":"IF(COUNTIF($S$51:$S$54,1)>1,IF(ROWS($1:4)<=COUNTIF($S$51:$S$54,1),INDEX($T$51:$T$54,SMALL(IF($S$51:$S$54=1,ROW(INDIRECT(\"1:\"&ROWS($S$51:$S$54)))),ROWS($1:4))),\"\"),IF(COUNTIF($S$51:$S$54,2)>1,IF(ROWS($1:4)<=COUNTIF($S$51:$S$54,2),INDEX($T$51:$T$54,SMALL(IF($S$51:$S$54=2,ROW(INDIRECT(\"1:\"&ROWS($S$51:$S$54)))),ROWS($1:4))),\"\")))","v":"Colombie"}]

{"sheet":"CLASSEMENT","index":2,"n_rows":204,"n_cols":21,"rows_kept":204,"cut":false,"hidden":false,"merged":[[13,8,13,12],[14,8,14,12],[15,8,15,12],[0,1,2,14],[5,11,5,12]]}
[null,{"$f":"\"CLASSEMENT DES PRONOSTIQUEURS \"&IF(PHASES_FINALES=\"OUI\",\"EN PHASES FINALES\",\"EN PHASE DE GROUPES\")","v":"CLASSEMENT DES PRONOSTIQUEURS EN PHASE DE GROUPES"},null,null,null,null,null,null,null,null,null,null,null,null,null,null,null,null,{"$f":"IF(ROWS($1:2)<=COUNTA(NomsF),INDEX(NomsF,ROWS($1:2)),\"\")","v":"RESULTATS"}]
[null,null,null,null,null,null,null,null,null,null,null,null,null,null,null,null,null,null,{"$f":"IF(ROWS($1:3)<=COUNTA(NomsF),INDEX(NomsF,ROWS($1:3)),\"\")","v":"CLASSEMENT"}]
[null,null,null,null,null,null,null,null,null,null,null,null,null,null,null,null,null,null,{"$f":"IF(ROWS($1:4)<=COUNTA(NomsF),INDEX(NomsF,ROWS($1:4)),\"\")","v":"DATA_1_TEAMS"}]
[null,null,null,"Nom Pronostiqueur","Lien","Points",null,null,null,null,null,null,null,null,null,null,null,null,{"$f":"IF(ROWS($1:5)<=COUNTA(NomsF),INDEX(NomsF,ROWS($1:5)),\"\")","v":"DATA_1_MATCHS"}]
[null,null,1,{"$f":"IFERROR(INDEX(R$5:R$204,MATCH(LARGE(U$5:U$204,C5),U$5:U$204,0)),\"\")","v":""},{"$f":"HYPERLINK(\"#'\"&D5&\"'!A1\",REPT(\"Cliquez ici pour ouvrir le prono de \"&UPPER(D5),ISREF(INDIRECT(\"'\"&D5&\"'!A1\"))))","v":""},{"$f":"IF(R5<>\"\",IFERROR(LARGE($U$5:$U$204,$C5),\"\"),\"\")","v":""},null,null,"ACTIVER LE CALCUL DES SCORES AVEC PHASES FINALES?",null,null,null,null,null,null,null,null,{"$f":"IFERROR(INDIRECT(\"'\"&S5&\"'!$B$4\"),\"\")","v":"Kévin Sonilhac"},{"$f":"IF(ROWS($1:6)<=COUNTA(NomsF),INDEX(NomsF,ROWS($1:6)),\"\")","v":"Kévin Sonilhac"},{"$f":"IFERROR(INDIRECT(\"'\"&S5&\"'!$Ap$6\"),\"\")","v":0},{"$f":"IFERROR(IF(T5,T5+(ROW()/10^9),\"\"),\"\")","v":""}]
[null,null,2,{"$f":"IFERROR(INDEX(R$5:R$204,MATCH(LARGE(U$5:U$204,C6),U$5:U$204,0)),\"\")","v":""},{"$f":"HYPERLINK(\"#'\"&D6&\"'!A1\",REPT(\"Cliquez ici pour ouvrir le prono de \"&UPPER(D6),ISREF(INDIRECT(\"'\"&D6&\"'!A1\"))))","v":""},{"$f":"IF(R6<>\"\",IFERROR(LARGE($U$5:$U$204,$C6),\"\"),\"\")","v":""},null,null,null,null,null,"NON",null,null,null,null,null,{"$f":"IFERROR(INDIRECT(\"'\"&S6&\"'!$B$4\"),\"\")","v":"Pronostiqueur 2"},{"$f":"IF(ROWS($1:7)<=COUNTA(NomsF),INDEX(NomsF,ROWS($1:7)),\"\")","v":"Pronostiqueur 2"},{"$f":"IFERROR(INDIRECT(\"'\"&S6&\"'!$Ap$6\"),\"\")","v":0},{"$f":"IFERROR(IF(T6,T6+(ROW()/10^9),\"\"),\"\")","v":""}]
[null,null,3,"","","",null,null,null,null,null,null,null,null,null,null,null,"Pronostiqueur 3",{"$f":"IF(ROWS($1:8)<=COUNTA(NomsF),INDEX(NomsF,ROWS($1:8)),\"\")","v":"Pronostiqueur 3"},0,""]
[null,null,4,"","","",null,null,null,null,null,null,null,null,null,null,null,"",{"$f":"IF(ROWS($1:9)<=COUNTA(NomsF),INDEX(NomsF,ROWS($1:9)),\"\")","v":""},"",""]
[null,null,5,"","","",null,null,null,null,null,null,null,null,null,null,null,"",{"$f":"IF(ROWS($1:10)<=COUNTA(NomsF),INDEX(NomsF,ROWS($1:10)),\"\")","v":""},"",""]
[null,null,6,"","","",null,null,null,null,null,null,null,null,null,null,null,"",{"$f":"IF(ROWS($1:11)<=COUNTA(NomsF),INDEX(NomsF,ROWS($1:11)),\"\")","v":""},"",""]
[null,null,7,"","","",null,null,null,null,null,null,null,null,null,null,null,"",{"$f":"IF(ROWS($1:12)<=COUNTA(NomsF),INDEX(NomsF,ROWS($1:12)),\"\")","v":""},"",""]
[null,null,8,"","","",null,null,null,null,null,null,null,null,null,null,null,"",{"$f":"IF(ROWS($1:13)<=COUNTA(NomsF),INDEX(NomsF,ROWS($1:13)),\"\")","v":""},"",""]
[null,null,9,"","","",null,null,null,null,null,null,null,null,null,null,null,"",{"$f":"IF(ROWS($1:14)<=COUNTA(NomsF),INDEX(NomsF,ROWS($1:14)),\"\")","v":""},"",""]
[null,null,10,"","","",null,null,null,null,null,null,null,null,null,null,null,"",{"$f":"IF(ROWS($1:15)<=COUNTA(NomsF),INDEX(NomsF,ROWS($1:15)),\"\")","v":""},"",""]
[null,null,11,"","","",null,null,null,null,null,null,null,null,null,null,null,"",{"$f":"IF(ROWS($1:16)<=COUNTA(NomsF),INDEX(NomsF,ROWS($1:16)),\"\")","v":""},"",""]
[null,null,12,"","","",null,null,null,null,null,null,null,null,null,null,null,"",{"$f":"IF(ROWS($1:17)<=COUNTA(NomsF),INDEX(NomsF,ROWS($1:17)),\"\")","v":""},"",""]
[null,null,13,"",{"$f":"HYPERLINK(\"#'\"&D17&\"'!A1\",REPT(\"Cliquez ici pour ouvrir le prono de \"&UPPER(D17),ISREF(INDIRECT(\"'\"&D17&\"'!A1\"))))","v":""},"",null,null,null,null,null,null,null,null,null,null,null,"",{"$f":"IF(ROWS($1:18)<=COUNTA(NomsF),INDEX(NomsF,ROWS($1:18)),\"\")","v":""},"",""]
[null,null,14,"","","",null,null,null,null,null,null,null,null,null,null,null,"",{"$f":"IF(ROWS($1:19)<=COUNTA(NomsF),INDEX(NomsF,ROWS($1:19)),\"\")","v":""},"",""]
[null,null,15,"","","",null,null,null,null,null,null,null,null,null,null,null,"",{"$f":"IF(ROWS($1:20)<=COUNTA(NomsF),INDEX(NomsF,ROWS($1:20)),\"\")","v":""},"",""]
[null,null,16,"","","",null,null,null,null,null,null,null,null,null,null,null,"",{"$f":"IF(ROWS($1:21)<=COUNTA(NomsF),INDEX(NomsF,ROWS($1:21)),\"\")","v":""},"",""]
[null,null,17,"","","",null,null,null,null,null,null,null,null,null,null,null,"",{"$f":"IF(ROWS($1:22)<=COUNTA(NomsF),INDEX(NomsF,ROWS($1:22)),\"\")","v":""},"",""]
[null,null,18,"","","",null,null,null,null,null,null,null,null,null,null,null,"",{"$f":"IF(ROWS($1:23)<=COUNTA(NomsF),INDEX(NomsF,ROWS($1:23)),\"\")","v":""},"",""]
[null,null,19,"","","",null,null,null,null,null,null,null,null,null,null,null,"",{"$f":"IF(ROWS($1:24)<=COUNTA(NomsF),INDEX(NomsF,ROWS($1:24)),\"\")","v":""},"",""]
[null,null,20,"","","",null,null,null,null,null,null,null,null,null,null,null,"",{"$f":"IF(ROWS($1:25)<=COUNTA(NomsF),INDEX(NomsF,ROWS($1:25)),\"\")","v":""},"",""]
[null,null,21,"","","",null,null,null,null,null,null,null,null,null,null,null,"",{"$f":"IF(ROWS($1:26)<=COUNTA(NomsF),INDEX(NomsF,ROWS($1:26)),\"\")","v":""},"",""]
[null,null,22,"","","",null,null,null,null,null,null,null,null,null,null,null,"",{"$f":"IF(ROWS($1:27)<=COUNTA(NomsF),INDEX(NomsF,ROWS($1:27)),\"\")","v":""},"",""]
[null,null,23,"","","",null,null,null,null,null,null,null,null,null,null,null,"",{"$f":"IF(ROWS($1:28)<=COUNTA(NomsF),INDEX(NomsF,ROWS($1:28)),\"\")","v":""},"",""]
[null,null,24,"","","",null,null,null,null,null,null,null,null,null,null,null,"",{"$f":"IF(ROWS($1:29)<=COUNTA(NomsF),INDEX(NomsF,ROWS($1:29)),\"\")","v":""},"",""]
[null,null,25,"","","",null,null,null,null,null,null,null,null,null,null,null,"",{"$f":"IF(ROWS($1:30)<=COUNTA(NomsF),INDEX(NomsF,ROWS($1:30)),\"\")","v":""},"",""]
[null,null,26,"","","",null,null,null,null,null,null,null,null,null,null,null,"",{"$f":"IF(ROWS($1:31)<=COUNTA(NomsF),INDEX(NomsF,ROWS($1:31)),\"\")","v":""},"",""]
[null,null,27,"","","",null,null,null,null,null,null,null,null,null,null,null,"",{"$f":"IF(ROWS($1:32)<=COUNTA(NomsF),INDEX(NomsF,ROWS($1:32)),\"\")","v":""},"",""]
[null,null,28,"","","",null,null,null,null,null,null,null,null,null,null,null,"",{"$f":"IF(ROWS($1:33)<=COUNTA(NomsF),INDEX(NomsF,ROWS($1:33)),\"\")","v":""},"",""]
[null,null,29,"","","",null,null,null,null,null,null,null,null,null,null,null,"",{"$f":"IF(ROWS($1:34)<=COUNTA(NomsF),INDEX(NomsF,ROWS($1:34)),\"\")","v":""},"",""]
[null,null,30,"","","",null,null,null,null,null,null,null,null,null,null,null,"",{"$f":"IF(ROWS($1:35)<=COUNTA(NomsF),INDEX(NomsF,ROWS($1:35)),\"\")","v":""},"",""]
[null,null,31,"","","",null,null,null,null,null,null,null,null,null,null,null,"",{"$f":"IF(ROWS($1:36)<=COUNTA(NomsF),INDEX(NomsF,ROWS($1:36)),\"\")","v":""},"",""]
[null,null,32,"","","",null,null,null,null,null,null,null,null,null,null,null,"",{"$f":"IF(ROWS($1:37)<=COUNTA(NomsF),INDEX(NomsF,ROWS($1:37)),\"\")","v":""},"",""]
[null,null,33,"","","",null,null,null,null,null,null,null,null,null,null,null,"",{"$f":"IF(ROWS($1:38)<=COUNTA(NomsF),INDEX(NomsF,ROWS($1:38)),\"\")","v":""},"",""]
[null,null,34,"","","",null,null,null,null,null,null,null,null,null,null,null,"",{"$f":"IF(ROWS($1:39)<=COUNTA(NomsF),INDEX(NomsF,ROWS($1:39)),\"\")","v":""},"",""]
[null,null,35,"","","",null,null,null,null,null,null,null,null,null,null,null,"",{"$f":"IF(ROWS($1:40)<=COUNTA(NomsF),INDEX(NomsF,ROWS($1:40)),\"\")","v":""},"",""]
[null,null,36,"","","",null,null,null,null,null,null,null,null,null,null,null,"",{"$f":"IF(ROWS($1:41)<=COUNTA(NomsF),INDEX(NomsF,ROWS($1:41)),\"\")","v":""},"",""]
[null,null,37,"","","",null,null,null,null,null,null,null,null,null,null,null,"",{"$f":"IF(ROWS($1:42)<=COUNTA(NomsF),INDEX(NomsF,ROWS($1:42)),\"\")","v":""},"",""]
[null,null,38,"","","",null,null,null,null,null,null,null,null,null,null,null,"",{"$f":"IF(ROWS($1:43)<=COUNTA(NomsF),INDEX(NomsF,ROWS($1:43)),\"\")","v":""},"",""]
[null,null,39,"","","",null,null,null,null,null,null,null,null,null,null,null,"",{"$f":"IF(ROWS($1:44)<=COUNTA(NomsF),INDEX(NomsF,ROWS($1:44)),\"\")","v":""},"",""]
[null,null,40,"","","",null,null,null,null,null,null,null,null,null,null,null,"",{"$f":"IF(ROWS($1:45)<=COUNTA(NomsF),INDEX(NomsF,ROWS($1:45)),\"\")","v":""},"",""]
[null,null,41,"","","",null,null,null,null,null,null,null,null,null,null,null,"",{"$f":"IF(ROWS($1:46)<=COUNTA(NomsF),INDEX(NomsF,ROWS($1:46)),\"\")","v":""},"",""]
[null,null,42,"","","",null,null,null,null,null,null,null,null,null,null,null,"",{"$f":"IF(ROWS($1:47)<=COUNTA(NomsF),INDEX(NomsF,ROWS($1:47)),\"\")","v":""},"",""]
[null,null,43,"","","",null,null,null,null,null,null,null,null,null,null,null,"",{"$f":"IF(ROWS($1:48)<=COUNTA(NomsF),INDEX(NomsF,ROWS($1:48)),\"\")","v":""},"",""]
[null,null,44,"","","",null,null,null,null,null,null,null,null,null,null,null,"",{"$f":"IF(ROWS($1:49)<=COUNTA(NomsF),INDEX(NomsF,ROWS($1:49)),\"\")","v":""},"",""]
[null,null,45,"","","",null,null,null,null,null,null,null,null,null,null,null,"",{"$f":"IF(ROWS($1:50)<=COUNTA(NomsF),INDEX(NomsF,ROWS($1:50)),\"\")","v":""},"",""]
[null,null,46,"","","",null,null,null,null,null,null,null,null,null,null,null,"",{"$f":"IF(ROWS($1:51)<=COUNTA(NomsF),INDEX(NomsF,ROWS($1:51)),\"\")","v":""},"",""]
[null,null,47,"","","",null,null,null,null,null,null,null,null,null,null,null,"",{"$f":"IF(ROWS($1:52)<=COUNTA(NomsF),INDEX(NomsF,ROWS($1:52)),\"\")","v":""},"",""]
[null,null,48,"","","",null,null,null,null,null,null,null,null,null,null,null,"",{"$f":"IF(ROWS($1:53)<=COUNTA(NomsF),INDEX(NomsF,ROWS($1:53)),\"\")","v":""},"",""]
[null,null,49,"","","",null,null,null,null,null,null,null,null,null,null,null,"",{"$f":"IF(ROWS($1:54)<=COUNTA(NomsF),INDEX(NomsF,ROWS($1:54)),\"\")","v":""},"",""]
[null,null,50,"","","",null,null,null,null,null,null,null,null,null,null,null,"",{"$f":"IF(ROWS($1:55)<=COUNTA(NomsF),INDEX(NomsF,ROWS($1:55)),\"\")","v":""},"",""]
[null,null,51,"","","",null,null,null,null,null,null,null,null,null,null,null,"",{"$f":"IF(ROWS($1:56)<=COUNTA(NomsF),INDEX(NomsF,ROWS($1:56)),\"\")","v":""},"",""]
[null,null,52,"","","",null,null,null,null,null,null,null,null,null,null,null,"",{"$f":"IF(ROWS($1:57)<=COUNTA(NomsF),INDEX(NomsF,ROWS($1:57)),\"\")","v":""},"",""]
[null,null,53,"","","",null,null,null,null,null,null,null,null,null,null,null,"",{"$f":"IF(ROWS($1:58)<=COUNTA(NomsF),INDEX(NomsF,ROWS($1:58)),\"\")","v":""},"",""]
[null,null,54,"","","",null,null,null,null,null,null,null,null,null,null,null,"",{"$f":"IF(ROWS($1:59)<=COUNTA(NomsF),INDEX(NomsF,ROWS($1:59)),\"\")","v":""},"",""]
[null,null,55,"","","",null,null,null,null,null,null,null,null,null,null,null,"",{"$f":"IF(ROWS($1:60)<=COUNTA(NomsF),INDEX(NomsF,ROWS($1:60)),\"\")","v":""},"",""]
[null,null,56,"","","",null,null,null,null,null,null,null,null,null,null,null,"",{"$f":"IF(ROWS($1:61)<=COUNTA(NomsF),INDEX(NomsF,ROWS($1:61)),\"\")","v":""},"",""]
[null,null,57,"","","",null,null,null,null,null,null,null,null,null,null,null,"",{"$f":"IF(ROWS($1:62)<=COUNTA(NomsF),INDEX(NomsF,ROWS($1:62)),\"\")","v":""},"",""]
[null,null,58,"","","",null,null,null,null,null,null,null,null,null,null,null,"",{"$f":"IF(ROWS($1:63)<=COUNTA(NomsF),INDEX(NomsF,ROWS($1:63)),\"\")","v":""},"",""]
[null,null,59,"","","",null,null,null,null,null,null,null,null,null,null,null,"",{"$f":"IF(ROWS($1:64)<=COUNTA(NomsF),INDEX(NomsF,ROWS($1:64)),\"\")","v":""},"",""]
[null,null,60,"","","",null,null,null,null,null,null,null,null,null,null,null,"",{"$f":"IF(ROWS($1:65)<=COUNTA(NomsF),INDEX(NomsF,ROWS($1:65)),\"\")","v":""},"",""]
[null,null,61,"","","",null,null,null,null,null,null,null,null,null,null,null,"",{"$f":"IF(ROWS($1:66)<=COUNTA(NomsF),INDEX(NomsF,ROWS($1:66)),\"\")","v":""},"",""]
[null,null,62,"","","",null,null,null,null,null,null,null,null,null,null,null,"",{"$f":"IF(ROWS($1:67)<=COUNTA(NomsF),INDEX(NomsF,ROWS($1:67)),\"\")","v":""},"",""]
[null,null,63,"","","",null,null,null,null,null,null,null,null,null,null,null,"",{"$f":"IF(ROWS($1:68)<=COUNTA(NomsF),INDEX(NomsF,ROWS($1:68)),\"\")","v":""},"",""]
[null,null,64,"","","",null,null,null,null,null,null,null,null,null,null,null,"",{"$f":"IF(ROWS($1:69)<=COUNTA(NomsF),INDEX(NomsF,ROWS($1:69)),\"\")","v":""},"",""]
[null,null,65,"","","",null,null,null,null,null,null,null,null,null,null,null,"",{"$f":"IF(ROWS($1:70)<=COUNTA(NomsF),INDEX(NomsF,ROWS($1:70)),\"\")","v":""},"",""]
[null,null,66,{"$f":"IFERROR(INDEX(R$5:R$204,MATCH(LARGE(U$5:U$204,C70),U$5:U$204,0)),\"\")","v":""},{"$f":"HYPERLINK(\"#'\"&D70&\"'!A1\",REPT(\"Cliquez ici pour ouvrir le prono de \"&UPPER(D70),ISREF(INDIRECT(\"'\"&D70&\"'!A1\"))))","v":""},{"$f":"IF(R70<>\"\",IFERROR(LARGE($U$5:$U$204,$C70),\"\"),\"\")","v":""},null,null,null,null,null,null,null,null,null,null,null,{"$f":"IFERROR(INDIRECT(\"'\"&S70&\"'!$B$4\"),\"\")","v":""},{"$f":"IF(ROWS($1:71)<=COUNTA(NomsF),INDEX(NomsF,ROWS($1:71)),\"\")","v":""},{"$f":"IFERROR(INDIRECT(\"'\"&S70&\"'!$Ap$6\"),\"\")","v":""},{"$f":"IFERROR(IF(T70,T70+(ROW()/10^9),\"\"),\"\")","v":""}]
[null,null,67,"","","",null,null,null,null,null,null,null,null,null,null,null,"",{"$f":"IF(ROWS($1:72)<=COUNTA(NomsF),INDEX(NomsF,ROWS($1:72)),\"\")","v":""},"",""]
[null,null,68,"","","",null,null,null,null,null,null,null,null,null,null,null,"",{"$f":"IF(ROWS($1:73)<=COUNTA(NomsF),INDEX(NomsF,ROWS($1:73)),\"\")","v":""},"",""]
[null,null,69,"","","",null,null,null,null,null,null,null,null,null,null,null,"",{"$f":"IF(ROWS($1:74)<=COUNTA(NomsF),INDEX(NomsF,ROWS($1:74)),\"\")","v":""},"",""]
[null,null,70,"","","",null,null,null,null,null,null,null,null,null,null,null,"",{"$f":"IF(ROWS($1:75)<=COUNTA(NomsF),INDEX(NomsF,ROWS($1:75)),\"\")","v":""},"",""]
[null,null,71,"","","",null,null,null,null,null,null,null,null,null,null,null,"",{"$f":"IF(ROWS($1:76)<=COUNTA(NomsF),INDEX(NomsF,ROWS($1:76)),\"\")","v":""},"",""]
[null,null,72,"","","",null,null,null,null,null,null,null,null,null,null,null,"",{"$f":"IF(ROWS($1:77)<=COUNTA(NomsF),INDEX(NomsF,ROWS($1:77)),\"\")","v":""},"",""]
[null,null,73,"","","",null,null,null,null,null,null,null,null,null,null,null,"",{"$f":"IF(ROWS($1:78)<=COUNTA(NomsF),INDEX(NomsF,ROWS($1:78)),\"\")","v":""},"",""]
[null,null,74,"","","",null,null,null,null,null,null,null,null,null,null,null,"",{"$f":"IF(ROWS($1:79)<=COUNTA(NomsF),INDEX(NomsF,ROWS($1:79)),\"\")","v":""},"",""]
[null,null,75,"","","",null,null,null,null,null,null,null,null,null,null,null,"",{"$f":"IF(ROWS($1:80)<=COUNTA(NomsF),INDEX(NomsF,ROWS($1:80)),\"\")","v":""},"",""]
[null,null,76,"","","",null,null,null,null,null,null,null,null,null,null,null,"",{"$f":"IF(ROWS($1:81)<=COUNTA(NomsF),INDEX(NomsF,ROWS($1:81)),\"\")","v":""},"",""]
[null,null,77,"","","",null,null,null,null,null,null,null,null,null,null,null,"",{"$f":"IF(ROWS($1:82)<=COUNTA(NomsF),INDEX(NomsF,ROWS($1:82)),\"\")","v":""},"",""]
[null,null,78,"","","",null,null,null,null,null,null,null,null,null,null,null,"",{"$f":"IF(ROWS($1:83)<=COUNTA(NomsF),INDEX(NomsF,ROWS($1:83)),\"\")","v":""},"",""]
[null,null,79,"","","",null,null,null,null,null,null,null,null,null,null,null,"",{"$f":"IF(ROWS($1:84)<=COUNTA(NomsF),INDEX(NomsF,ROWS($1:84)),\"\")","v":""},"",""]
[null,null,80,"","","",null,null,null,null,null,null,null,null,null,null,null,"",{"$f":"IF(ROWS($1:85)<=COUNTA(NomsF),INDEX(NomsF,ROWS($1:85)),\"\")","v":""},"",""]
[null,null,81,"","","",null,null,null,null,null,null,null,null,null,null,null,"",{"$f":"IF(ROWS($1:86)<=COUNTA(NomsF),INDEX(NomsF,ROWS($1:86)),\"\")","v":""},"",""]
[null,null,82,"","","",null,null,null,null,null,null,null,null,null,null,null,"",{"$f":"IF(ROWS($1:87)<=COUNTA(NomsF),INDEX(NomsF,ROWS($1:87)),\"\")","v":""},"",""]
[null,null,83,"","","",null,null,null,null,null,null,null,null,null,null,null,"",{"$f":"IF(ROWS($1:88)<=COUNTA(NomsF),INDEX(NomsF,ROWS($1:88)),\"\")","v":""},"",""]
[null,null,84,"","","",null,null,null,null,null,null,null,null,null,null,null,"",{"$f":"IF(ROWS($1:89)<=COUNTA(NomsF),INDEX(NomsF,ROWS($1:89)),\"\")","v":""},"",""]
[null,null,85,"","","",null,null,null,null,null,null,null,null,null,null,null,"",{"$f":"IF(ROWS($1:90)<=COUNTA(NomsF),INDEX(NomsF,ROWS($1:90)),\"\")","v":""},"",""]
[null,null,86,"","","",null,null,null,null,null,null,null,null,null,null,null,"",{"$f":"IF(ROWS($1:91)<=COUNTA(NomsF),INDEX(NomsF,ROWS($1:91)),\"\")","v":""},"",""]
[null,null,87,"","","",null,null,null,null,null,null,null,null,null,null,null,"",{"$f":"IF(ROWS($1:92)<=COUNTA(NomsF),INDEX(NomsF,ROWS($1:92)),\"\")","v":""},"",""]
[null,null,88,"","","",null,null,null,null,null,null,null,null,null,null,null,"",{"$f":"IF(ROWS($1:93)<=COUNTA(NomsF),INDEX(NomsF,ROWS($1:93)),\"\")","v":""},"",""]
[null,null,89,"","","",null,null,null,null,null,null,null,null,null,null,null,"",{"$f":"IF(ROWS($1:94)<=COUNTA(NomsF),INDEX(NomsF,ROWS($1:94)),\"\")","v":""},"",""]
[null,null,90,"","","",null,null,null,null,null,null,null,null,null,null,null,"",{"$f":"IF(ROWS($1:95)<=COUNTA(NomsF),INDEX(NomsF,ROWS($1:95)),\"\")","v":""},"",""]
[null,null,91,"","","",null,null,null,null,null,null,null,null,null,null,null,"",{"$f":"IF(ROWS($1:96)<=COUNTA(NomsF),INDEX(NomsF,ROWS($1:96)),\"\")","v":""},"",""]
[null,null,92,"","","",null,null,null,null,null,null,null,null,null,null,null,"",{"$f":"IF(ROWS($1:97)<=COUNTA(NomsF),INDEX(NomsF,ROWS($1:97)),\"\")","v":""},"",""]
[null,null,93,"","","",null,null,null,null,null,null,null,null,null,null,null,"",{"$f":"IF(ROWS($1:98)<=COUNTA(NomsF),INDEX(NomsF,ROWS($1:98)),\"\")","v":""},"",""]
[null,null,94,"","","",null,null,null,null,null,null,null,null,null,null,null,"",{"$f":"IF(ROWS($1:99)<=COUNTA(NomsF),INDEX(NomsF,ROWS($1:99)),\"\")","v":""},"",""]
[null,null,95,"","","",null,null,null,null,null,null,null,null,null,null,null,"",{"$f":"IF(ROWS($1:100)<=COUNTA(NomsF),INDEX(NomsF,ROWS($1:100)),\"\")","v":""},"",""]
[null,null,96,"","","",null,null,null,null,null,null,null,null,null,null,null,"",{"$f":"IF(ROWS($1:101)<=COUNTA(NomsF),INDEX(NomsF,ROWS($1:101)),\"\")","v":""},"",""]
[null,null,97,"","","",null,null,null,null,null,null,null,null,null,null,null,"",{"$f":"IF(ROWS($1:102)<=COUNTA(NomsF),INDEX(NomsF,ROWS($1:102)),\"\")","v":""},"",""]
[null,null,98,"","","",null,null,null,null,null,null,null,null,null,null,null,"",{"$f":"IF(ROWS($1:103)<=COUNTA(NomsF),INDEX(NomsF,ROWS($1:103)),\"\")","v":""},"",""]
[null,null,99,"","","",null,null,null,null,null,null,null,null,null,null,null,"",{"$f":"IF(ROWS($1:104)<=COUNTA(NomsF),INDEX(NomsF,ROWS($1:104)),\"\")","v":""},"",""]
[null,null,100,"","","",null,null,null,null,null,null,null,null,null,null,null,"",{"$f":"IF(ROWS($1:105)<=COUNTA(NomsF),INDEX(NomsF,ROWS($1:105)),\"\")","v":""},"",""]
[null,null,101,"","","",null,null,null,null,null,null,null,null,null,null,null,"",{"$f":"IF(ROWS($1:106)<=COUNTA(NomsF),INDEX(NomsF,ROWS($1:106)),\"\")","v":""},"",""]
[null,null,102,"","","",null,null,null,null,null,null,null,null,null,null,null,"",{"$f":"IF(ROWS($1:107)<=COUNTA(NomsF),INDEX(NomsF,ROWS($1:107)),\"\")","v":""},"",""]
[null,null,103,"","","",null,null,null,null,null,null,null,null,null,null,null,"",{"$f":"IF(ROWS($1:108)<=COUNTA(NomsF),INDEX(NomsF,ROWS($1:108)),\"\")","v":""},"",""]
[null,null,104,"","","",null,null,null,null,null,null,null,null,null,null,null,"",{"$f":"IF(ROWS($1:109)<=COUNTA(NomsF),INDEX(NomsF,ROWS($1:109)),\"\")","v":""},"",""]
[null,null,105,"","","",null,null,null,null,null,null,null,null,null,null,null,"",{"$f":"IF(ROWS($1:110)<=COUNTA(NomsF),INDEX(NomsF,ROWS($1:110)),\"\")","v":""},"",""]
[null,null,106,"","","",null,null,null,null,null,null,null,null,null,null,null,"",{"$f":"IF(ROWS($1:111)<=COUNTA(NomsF),INDEX(NomsF,ROWS($1:111)),\"\")","v":""},"",""]
[null,null,107,"","","",null,null,null,null,null,null,null,null,null,null,null,"",{"$f":"IF(ROWS($1:112)<=COUNTA(NomsF),INDEX(NomsF,ROWS($1:112)),\"\")","v":""},"",""]
[null,null,108,"","","",null,null,null,null,null,null,null,null,null,null,null,"",{"$f":"IF(ROWS($1:113)<=COUNTA(NomsF),INDEX(NomsF,ROWS($1:113)),\"\")","v":""},"",""]
[null,null,109,"","","",null,null,null,null,null,null,null,null,null,null,null,"",{"$f":"IF(ROWS($1:114)<=COUNTA(NomsF),INDEX(NomsF,ROWS($1:114)),\"\")","v":""},"",""]
[null,null,110,"","","",null,null,null,null,null,null,null,null,null,null,null,"",{"$f":"IF(ROWS($1:115)<=COUNTA(NomsF),INDEX(NomsF,ROWS($1:115)),\"\")","v":""},"",""]
[null,null,111,"","","",null,null,null,null,null,null,null,null,null,null,null,"",{"$f":"IF(ROWS($1:116)<=COUNTA(NomsF),INDEX(NomsF,ROWS($1:116)),\"\")","v":""},"",""]
[null,null,112,"","","",null,null,null,null,null,null,null,null,null,null,null,"",{"$f":"IF(ROWS($1:117)<=COUNTA(NomsF),INDEX(NomsF,ROWS($1:117)),\"\")","v":""},"",""]
[null,null,113,"","","",null,null,null,null,null,null,null,null,null,null,null,"",{"$f":"IF(ROWS($1:118)<=COUNTA(NomsF),INDEX(NomsF,ROWS($1:118)),\"\")","v":""},"",""]
[null,null,114,"","","",null,null,null,null,null,null,null,null,null,null,null,"",{"$f":"IF(ROWS($1:119)<=COUNTA(NomsF),INDEX(NomsF,ROWS($1:119)),\"\")","v":""},"",""]
[null,null,115,"","","",null,null,null,null,null,null,null,null,null,null,null,"",{"$f":"IF(ROWS($1:120)<=COUNTA(NomsF),INDEX(NomsF,ROWS($1:120)),\"\")","v":""},"",""]
[null,null,116,"","","",null,null,null,null,null,null,null,null,null,null,null,"",{"$f":"IF(ROWS($1:121)<=COUNTA(NomsF),INDEX(NomsF,ROWS($1:121)),\"\")","v":""},"",""]
[null,null,117,"","","",null,null,null,null,null,null,null,null,null,null,null,"",{"$f":"IF(ROWS($1:122)<=COUNTA(NomsF),INDEX(NomsF,ROWS($1:122)),\"\")","v":""},"",""]
[null,null,118,"","","",null,null,null,null,null,null,null,null,null,null,null,"",{"$f":"IF(ROWS($1:123)<=COUNTA(NomsF),INDEX(NomsF,ROWS($1:123)),\"\")","v":""},"",""]
[null,null,119,"","","",null,null,null,null,null,null,null,null,null,null,null,"",{"$f":"IF(ROWS($1:124)<=COUNTA(NomsF),INDEX(NomsF,ROWS($1:124)),\"\")","v":""},"",""]
[null,null,120,"","","",null,null,null,null,null,null,null,null,null,null,null,"",{"$f":"IF(ROWS($1:125)<=COUNTA(NomsF),INDEX(NomsF,ROWS($1:125)),\"\")","v":""},"",""]
[null,null,121,"","","",null,null,null,null,null,null,null,null,null,null,null,"",{"$f":"IF(ROWS($1:126)<=COUNTA(NomsF),INDEX(NomsF,ROWS($1:126)),\"\")","v":""},"",""]
[null,null,122,"","","",null,null,null,null,null,null,null,null,null,null,null,"",{"$f":"IF(ROWS($1:127)<=COUNTA(NomsF),INDEX(NomsF,ROWS($1:127)),\"\")","v":""},"",""]
[null,null,123,"","","",null,null,null,null,null,null,null,null,null,null,null,"",{"$f":"IF(ROWS($1:128)<=COUNTA(NomsF),INDEX(NomsF,ROWS($1:128)),\"\")","v":""},"",""]
[null,null,124,"","","",null,null,null,null,null,null,null,null,null,null,null,"",{"$f":"IF(ROWS($1:129)<=COUNTA(NomsF),INDEX(NomsF,ROWS($1:129)),\"\")","v":""},"",""]
[null,null,125,"","","",null,null,null,null,null,null,null,null,null,null,null,"",{"$f":"IF(ROWS($1:130)<=COUNTA(NomsF),INDEX(NomsF,ROWS($1:130)),\"\")","v":""},"",""]
[null,null,126,"","","",null,null,null,null,null,null,null,null,null,null,null,"",{"$f":"IF(ROWS($1:131)<=COUNTA(NomsF),INDEX(NomsF,ROWS($1:131)),\"\")","v":""},"",""]
[null,null,127,"","","",null,null,null,null,null,null,null,null,null,null,null,"",{"$f":"IF(ROWS($1:132)<=COUNTA(NomsF),INDEX(NomsF,ROWS($1:132)),\"\")","v":""},"",""]
[null,null,128,"","","",null,null,null,null,null,null,null,null,null,null,null,"",{"$f":"IF(ROWS($1:133)<=COUNTA(NomsF),INDEX(NomsF,ROWS($1:133)),\"\")","v":""},"",""]
[null,null,129,"","","",null,null,null,null,null,null,null,null,null,null,null,"",{"$f":"IF(ROWS($1:134)<=COUNTA(NomsF),INDEX(NomsF,ROWS($1:134)),\"\")","v":""},"",""]
[null,null,130,{"$f":"IFERROR(INDEX(R$5:R$204,MATCH(LARGE(U$5:U$204,C134),U$5:U$204,0)),\"\")","v":""},{"$f":"HYPERLINK(\"#'\"&D134&\"'!A1\",REPT(\"Cliquez ici pour ouvrir le prono de \"&UPPER(D134),ISREF(INDIRECT(\"'\"&D134&\"'!A1\"))))","v":""},{"$f":"IF(R134<>\"\",IFERROR(LARGE($U$5:$U$204,$C134),\"\"),\"\")","v":""},null,null,null,null,null,null,null,null,null,null,null,{"$f":"IFERROR(INDIRECT(\"'\"&S134&\"'!$B$4\"),\"\")","v":""},{"$f":"IF(ROWS($1:135)<=COUNTA(NomsF),INDEX(NomsF,ROWS($1:135)),\"\")","v":""},{"$f":"IFERROR(INDIRECT(\"'\"&S134&\"'!$Ap$6\"),\"\")","v":""},{"$f":"IFERROR(IF(T134,T134+(ROW()/10^9),\"\"),\"\")","v":""}]
[null,null,131,"","","",null,null,null,null,null,null,null,null,null,null,null,"",{"$f":"IF(ROWS($1:136)<=COUNTA(NomsF),INDEX(NomsF,ROWS($1:136)),\"\")","v":""},"",""]
[null,null,132,"","","",null,null,null,null,null,null,null,null,null,null,null,"",{"$f":"IF(ROWS($1:137)<=COUNTA(NomsF),INDEX(NomsF,ROWS($1:137)),\"\")","v":""},"",""]
[null,null,133,"","","",null,null,null,null,null,null,null,null,null,null,null,"",{"$f":"IF(ROWS($1:138)<=COUNTA(NomsF),INDEX(NomsF,ROWS($1:138)),\"\")","v":""},"",""]
[null,null,134,"","","",null,null,null,null,null,null,null,null,null,null,null,"",{"$f":"IF(ROWS($1:139)<=COUNTA(NomsF),INDEX(NomsF,ROWS($1:139)),\"\")","v":""},"",""]
[null,null,135,"","","",null,null,null,null,null,null,null,null,null,null,null,"",{"$f":"IF(ROWS($1:140)<=COUNTA(NomsF),INDEX(NomsF,ROWS($1:140)),\"\")","v":""},"",""]
[null,null,136,"","","",null,null,null,null,null,null,null,null,null,null,null,"",{"$f":"IF(ROWS($1:141)<=COUNTA(NomsF),INDEX(NomsF,ROWS($1:141)),\"\")","v":""},"",""]
[null,null,137,"","","",null,null,null,null,null,null,null,null,null,null,null,"",{"$f":"IF(ROWS($1:142)<=COUNTA(NomsF),INDEX(NomsF,ROWS($1:142)),\"\")","v":""},"",""]
[null,null,138,"","","",null,null,null,null,null,null,null,null,null,null,null,"",{"$f":"IF(ROWS($1:143)<=COUNTA(NomsF),INDEX(NomsF,ROWS($1:143)),\"\")","v":""},"",""]
[null,null,139,"","","",null,null,null,null,null,null,null,null,null,null,null,"",{"$f":"IF(ROWS($1:144)<=COUNTA(NomsF),INDEX(NomsF,ROWS($1:144)),\"\")","v":""},"",""]
[null,null,140,"","","",null,null,null,null,null,null,null,null,null,null,null,"",{"$f":"IF(ROWS($1:145)<=COUNTA(NomsF),INDEX(NomsF,ROWS($1:145)),\"\")","v":""},"",""]
[null,null,141,"","","",null,null,null,null,null,null,null,null,null,null,null,"",{"$f":"IF(ROWS($1:146)<=COUNTA(NomsF),INDEX(NomsF,ROWS($1:146)),\"\")","v":""},"",""]
[null,null,142,"","","",null,null,null,null,null,null,null,null,null,null,null,"",{"$f":"IF(ROWS($1:147)<=COUNTA(NomsF),INDEX(NomsF,ROWS($1:147)),\"\")","v":""},"",""]
[null,null,143,"","","",null,null,null,null,null,null,null,null,null,null,null,"",{"$f":"IF(ROWS($1:148)<=COUNTA(NomsF),INDEX(NomsF,ROWS($1:148)),\"\")","v":""},"",""]
[null,null,144,"","","",null,null,null,null,null,null,null,null,null,null,null,"",{"$f":"IF(ROWS($1:149)<=COUNTA(NomsF),INDEX(NomsF,ROWS($1:149)),\"\")","v":""},"",""]
[null,null,145,"","","",null,null,null,null,null,null,null,null,null,null,null,"",{"$f":"IF(ROWS($1:150)<=COUNTA(NomsF),INDEX(NomsF,ROWS($1:150)),\"\")","v":""},"",""]
[null,null,146,"","","",null,null,null,null,null,null,null,null,null,null,null,"",{"$f":"IF(ROWS($1:151)<=COUNTA(NomsF),INDEX(NomsF,ROWS($1:151)),\"\")","v":""},"",""]
[null,null,147,"","","",null,null,null,null,null,null,null,null,null,null,null,"",{"$f":"IF(ROWS($1:152)<=COUNTA(NomsF),INDEX(NomsF,ROWS($1:152)),\"\")","v":""},"",""]
[null,null,148,"","","",null,null,null,null,null,null,null,null,null,null,null,"",{"$f":"IF(ROWS($1:153)<=COUNTA(NomsF),INDEX(NomsF,ROWS($1:153)),\"\")","v":""},"",""]
[null,null,149,"","","",null,null,null,null,null,null,null,null,null,null,null,"",{"$f":"IF(ROWS($1:154)<=COUNTA(NomsF),INDEX(NomsF,ROWS($1:154)),\"\")","v":""},"",""]
[null,null,150,"","","",null,null,null,null,null,null,null,null,null,null,null,"",{"$f":"IF(ROWS($1:155)<=COUNTA(NomsF),INDEX(NomsF,ROWS($1:155)),\"\")","v":""},"",""]
[null,null,151,"","","",null,null,null,null,null,null,null,null,null,null,null,"",{"$f":"IF(ROWS($1:156)<=COUNTA(NomsF),INDEX(NomsF,ROWS($1:156)),\"\")","v":""},"",""]
[null,null,152,"","","",null,null,null,null,null,null,null,null,null,null,null,"",{"$f":"IF(ROWS($1:157)<=COUNTA(NomsF),INDEX(NomsF,ROWS($1:157)),\"\")","v":""},"",""]
[null,null,153,"","","",null,null,null,null,null,null,null,null,null,null,null,"",{"$f":"IF(ROWS($1:158)<=COUNTA(NomsF),INDEX(NomsF,ROWS($1:158)),\"\")","v":""},"",""]
[null,null,154,"","","",null,null,null,null,null,null,null,null,null,null,null,"",{"$f":"IF(ROWS($1:159)<=COUNTA(NomsF),INDEX(NomsF,ROWS($1:159)),\"\")","v":""},"",""]
[null,null,155,"","","",null,null,null,null,null,null,null,null,null,null,null,"",{"$f":"IF(ROWS($1:160)<=COUNTA(NomsF),INDEX(NomsF,ROWS($1:160)),\"\")","v":""},"",""]
[null,null,156,"","","",null,null,null,null,null,null,null,null,null,null,null,"",{"$f":"IF(ROWS($1:161)<=COUNTA(NomsF),INDEX(NomsF,ROWS($1:161)),\"\")","v":""},"",""]
[null,null,157,"","","",null,null,null,null,null,null,null,null,null,null,null,"",{"$f":"IF(ROWS($1:162)<=COUNTA(NomsF),INDEX(NomsF,ROWS($1:162)),\"\")","v":""},"",""]
[null,null,158,"","","",null,null,null,null,null,null,null,null,null,null,null,"",{"$f":"IF(ROWS($1:163)<=COUNTA(NomsF),INDEX(NomsF,ROWS($1:163)),\"\")","v":""},"",""]
[null,null,159,"","","",null,null,null,null,null,null,null,null,null,null,null,"",{"$f":"IF(ROWS($1:164)<=COUNTA(NomsF),INDEX(NomsF,ROWS($1:164)),\"\")","v":""},"",""]
[null,null,160,"","","",null,null,null,null,null,null,null,null,null,null,null,"",{"$f":"IF(ROWS($1:165)<=COUNTA(NomsF),INDEX(NomsF,ROWS($1:165)),\"\")","v":""},"",""]
[null,null,161,"","","",null,null,null,null,null,null,null,null,null,null,null,"",{"$f":"IF(ROWS($1:166)<=COUNTA(NomsF),INDEX(NomsF,ROWS($1:166)),\"\")","v":""},"",""]
[null,null,162,"","","",null,null,null,null,null,null,null,null,null,null,null,"",{"$f":"IF(ROWS($1:167)<=COUNTA(NomsF),INDEX(NomsF,ROWS($1:167)),\"\")","v":""},"",""]
[null,null,163,"","","",null,null,null,null,null,null,null,null,null,null,null,"",{"$f":"IF(ROWS($1:168)<=COUNTA(NomsF),INDEX(NomsF,ROWS($1:168)),\"\")","v":""},"",""]
[null,null,164,"","","",null,null,null,null,null,null,null,null,null,null,null,"",{"$f":"IF(ROWS($1:169)<=COUNTA(NomsF),INDEX(NomsF,ROWS($1:169)),\"\")","v":""},"",""]
[null,null,165,"","","",null,null,null,null,null,null,null,null,null,null,null,"",{"$f":"IF(ROWS($1:170)<=COUNTA(NomsF),INDEX(NomsF,ROWS($1:170)),\"\")","v":""},"",""]
[null,null,166,"","","",null,null,null,null,null,null,null,null,null,null,null,"",{"$f":"IF(ROWS($1:171)<=COUNTA(NomsF),INDEX(NomsF,ROWS($1:171)),\"\")","v":""},"",""]
[null,null,167,"","","",null,null,null,null,null,null,null,null,null,null,null,"",{"$f":"IF(ROWS($1:172)<=COUNTA(NomsF),INDEX(NomsF,ROWS($1:172)),\"\")","v":""},"",""]
[null,null,168,"","","",null,null,null,null,null,null,null,null,null,null,null,"",{"$f":"IF(ROWS($1:173)<=COUNTA(NomsF),INDEX(NomsF,ROWS($1:173)),\"\")","v":""},"",""]
[null,null,169,"","","",null,null,null,null,null,null,null,null,null,null,null,"",{"$f":"IF(ROWS($1:174)<=COUNTA(NomsF),INDEX(NomsF,ROWS($1:174)),\"\")","v":""},"",""]
[null,null,170,"","","",null,null,null,null,null,null,null,null,null,null,null,"",{"$f":"IF(ROWS($1:175)<=COUNTA(NomsF),INDEX(NomsF,ROWS($1:175)),\"\")","v":""},"",""]
[null,null,171,"","","",null,null,null,null,null,null,null,null,null,null,null,"",{"$f":"IF(ROWS($1:176)<=COUNTA(NomsF),INDEX(NomsF,ROWS($1:176)),\"\")","v":""},"",""]
[null,null,172,"","","",null,null,null,null,null,null,null,null,null,null,null,"",{"$f":"IF(ROWS($1:177)<=COUNTA(NomsF),INDEX(NomsF,ROWS($1:177)),\"\")","v":""},"",""]
[null,null,173,"","","",null,null,null,null,null,null,null,null,null,null,null,"",{"$f":"IF(ROWS($1:178)<=COUNTA(NomsF),INDEX(NomsF,ROWS($1:178)),\"\")","v":""},"",""]
[null,null,174,"","","",null,null,null,null,null,null,null,null,null,null,null,"",{"$f":"IF(ROWS($1:179)<=COUNTA(NomsF),INDEX(NomsF,ROWS($1:179)),\"\")","v":""},"",""]
[null,null,175,"","","",null,null,null,null,null,null,null,null,null,null,null,"",{"$f":"IF(ROWS($1:180)<=COUNTA(NomsF),INDEX(NomsF,ROWS($1:180)),\"\")","v":""},"",""]
[null,null,176,"","","",null,null,null,null,null,null,null,null,null,null,null,"",{"$f":"IF(ROWS($1:181)<=COUNTA(NomsF),INDEX(NomsF,ROWS($1:181)),\"\")","v":""},"",""]
[null,null,177,"","","",null,null,null,null,null,null,null,null,null,null,null,"",{"$f":"IF(ROWS($1:182)<=COUNTA(NomsF),INDEX(NomsF,ROWS($1:182)),\"\")","v":""},"",""]
[null,null,178,"","","",null,null,null,null,null,null,null,null,null,null,null,"",{"$f":"IF(ROWS($1:183)<=COUNTA(NomsF),INDEX(NomsF,ROWS($1:183)),\"\")","v":""},"",""]
[null,null,179,"","","",null,null,null,null,null,null,null,null,null,null,null,"",{"$f":"IF(ROWS($1:184)<=COUNTA(NomsF),INDEX(NomsF,ROWS($1:184)),\"\")","v":""},"",""]
[null,null,180,"","","",null,null,null,null,null,null,null,null,null,null,null,"",{"$f":"IF(ROWS($1:185)<=COUNTA(NomsF),INDEX(NomsF,ROWS($1:185)),\"\")","v":""},"",""]
[null,null,181,"","","",null,null,null,null,null,null,null,null,null,null,null,"",{"$f":"IF(ROWS($1:186)<=COUNTA(NomsF),INDEX(NomsF,ROWS($1:186)),\"\")","v":""},"",""]
[null,null,182,"","","",null,null,null,null,null,null,null,null,null,null,null,"",{"$f":"IF(ROWS($1:187)<=COUNTA(NomsF),INDEX(NomsF,ROWS($1:187)),\"\")","v":""},"",""]
[null,null,183,"","","",null,null,null,null,null,null,null,null,null,null,null,"",{"$f":"IF(ROWS($1:188)<=COUNTA(NomsF),INDEX(NomsF,ROWS($1:188)),\"\")","v":""},"",""]
[null,null,184,"","","",null,null,null,null,null,null,null,null,null,null,null,"",{"$f":"IF(ROWS($1:189)<=COUNTA(NomsF),INDEX(NomsF,ROWS($1:189)),\"\")","v":""},"",""]
[null,null,185,"","","",null,null,null,null,null,null,null,null,null,null,null,"",{"$f":"IF(ROWS($1:190)<=COUNTA(NomsF),INDEX(NomsF,ROWS($1:190)),\"\")","v":""},"",""]
[null,null,186,"","","",null,null,null,null,null,null,null,null,null,null,null,"",{"$f":"IF(ROWS($1:191)<=COUNTA(NomsF),INDEX(NomsF,ROWS($1:191)),\"\")","v":""},"",""]
[null,null,187,"","","",null,null,null,null,null,null,null,null,null,null,null,"",{"$f":"IF(ROWS($1:192)<=COUNTA(NomsF),INDEX(NomsF,ROWS($1:192)),\"\")","v":""},"",""]
[null,null,188,"","","",null,null,null,null,null,null,null,null,null,null,null,"",{"$f":"IF(ROWS($1:193)<=COUNTA(NomsF),INDEX(NomsF,ROWS($1:193)),\"\")","v":""},"",""]
[null,null,189,"","","",null,null,null,null,null,null,null,null,null,null,null,"",{"$f":"IF(ROWS($1:194)<=COUNTA(NomsF),INDEX(NomsF,ROWS($1:194)),\"\")","v":""},"",""]
[null,null,190,"","","",null,null,null,null,null,null,null,null,null,null,null,"",{"$f":"IF(ROWS($1:195)<=COUNTA(NomsF),INDEX(NomsF,ROWS($1:195)),\"\")","v":""},"",""]
[null,null,191,"","","",null,null,null,null,null,null,null,null,null,null,null,"",{"$f":"IF(ROWS($1:196)<=COUNTA(NomsF),INDEX(NomsF,ROWS($1:196)),\"\")","v":""},"",""]
[null,null,192,"","","",null,null,null,null,null,null,null,null,null,null,null,"",{"$f":"IF(ROWS($1:197)<=COUNTA(NomsF),INDEX(NomsF,ROWS($1:197)),\"\")","v":""},"",""]
[null,null,193,"","","",null,null,null,null,null,null,null,null,null,null,null,"",{"$f":"IF(ROWS($1:198)<=COUNTA(NomsF),INDEX(NomsF,ROWS($1:198)),\"\")","v":""},"",""]
[null,null,194,{"$f":"IFERROR(INDEX(R$5:R$204,MATCH(LARGE(U$5:U$204,C198),U$5:U$204,0)),\"\")","v":""},{"$f":"HYPERLINK(\"#'\"&D198&\"'!A1\",REPT(\"Cliquez ici pour ouvrir le prono de \"&UPPER(D198),ISREF(INDIRECT(\"'\"&D198&\"'!A1\"))))","v":""},{"$f":"IF(R198<>\"\",IFERROR(LARGE($U$5:$U$204,$C198),\"\"),\"\")","v":""},null,null,null,null,null,null,null,null,null,null,null,{"$f":"IFERROR(INDIRECT(\"'\"&S198&\"'!$B$4\"),\"\")","v":""},{"$f":"IF(ROWS($1:199)<=COUNTA(NomsF),INDEX(NomsF,ROWS($1:199)),\"\")","v":""},{"$f":"IFERROR(INDIRECT(\"'\"&S198&\"'!$Ap$6\"),\"\")","v":""},{"$f":"IFERROR(IF(T198,T198+(ROW()/10^9),\"\"),\"\")","v":""}]
[null,null,195,"","","",null,null,null,null,null,null,null,null,null,null,null,"",{"$f":"IF(ROWS($1:200)<=COUNTA(NomsF),INDEX(NomsF,ROWS($1:200)),\"\")","v":""},"",""]
[null,null,196,"","","",null,null,null,null,null,null,null,null,null,null,null,"",{"$f":"IF(ROWS($1:201)<=COUNTA(NomsF),INDEX(NomsF,ROWS($1:201)),\"\")","v":""},"",""]
[null,null,197,"","","",null,null,null,null,null,null,null,null,null,null,null,"",{"$f":"IF(ROWS($1:202)<=COUNTA(NomsF),INDEX(NomsF,ROWS($1:202)),\"\")","v":""},"",""]
[null,null,198,"","","",null,null,null,null,null,null,null,null,null,null,null,"",{"$f":"IF(ROWS($1:203)<=COUNTA(NomsF),INDEX(NomsF,ROWS($1:203)),\"\")","v":""},"",""]
[null,null,199,"","","",null,null,null,null,null,null,null,null,null,null,null,"",{"$f":"IF(ROWS($1:204)<=COUNTA(NomsF),INDEX(NomsF,ROWS($1:204)),\"\")","v":""},"",""]
[null,null,200,"","","",null,null,null,null,null,null,null,null,null,null,null,"",{"$f":"IF(ROWS($1:204)<=COUNTA(NomsF),INDEX(NomsF,ROWS($1:204)),\"\")","v":""},"",""]

{"sheet":"DATA_1_TEAMS","index":3,"n_rows":33,"n_cols":4,"rows_kept":33,"cut":false,"hidden":true,"merged":[]}
["CODE","TEAM","GROUP","GROUP_INITIAL_RANK"]
[{"$f":"+TABLEAU_TEAMS[[#This Row],[GROUP]]&\"_\"&TABLEAU_TEAMS[[#This Row],[GROUP_INITIAL_RANK]]","v":"A_1"},"Russie","A",1]
[{"$f":"+TABLEAU_TEAMS[[#This Row],[GROUP]]&\"_\"&TABLEAU_TEAMS[[#This Row],[GROUP_INITIAL_RANK]]","v":"A_2"},"Arabie Saoudite","A",2]
[{"$f":"+TABLEAU_TEAMS[[#This Row],[GROUP]]&\"_\"&TABLEAU_TEAMS[[#This Row],[GROUP_INITIAL_RANK]]","v":"A_3"},"Egypte","A",3]
[{"$f":"+TABLEAU_TEAMS[[#This Row],[GROUP]]&\"_\"&TABLEAU_TEAMS[[#This Row],[GROUP_INITIAL_RANK]]","v":"A_4"},"Uruguay","A",4]
[{"$f":"+TABLEAU_TEAMS[[#This Row],[GROUP]]&\"_\"&TABLEAU_TEAMS[[#This Row],[GROUP_INITIAL_RANK]]","v":"B_1"},"Maroc","B",1]
[{"$f":"+TABLEAU_TEAMS[[#This Row],[GROUP]]&\"_\"&TABLEAU_TEAMS[[#This Row],[GROUP_INITIAL_RANK]]","v":"B_2"},"RI Iran","B",2]
[{"$f":"+TABLEAU_TEAMS[[#This Row],[GROUP]]&\"_\"&TABLEAU_TEAMS[[#This Row],[GROUP_INITIAL_RANK]]","v":"B_3"},"Portugal","B",3]
[{"$f":"+TABLEAU_TEAMS[[#This Row],[GROUP]]&\"_\"&TABLEAU_TEAMS[[#This Row],[GROUP_INITIAL_RANK]]","v":"B_4"},"Espagne","B",4]
[{"$f":"+TABLEAU_TEAMS[[#This Row],[GROUP]]&\"_\"&TABLEAU_TEAMS[[#This Row],[GROUP_INITIAL_RANK]]","v":"C_1"},"France","C",1]
[{"$f":"+TABLEAU_TEAMS[[#This Row],[GROUP]]&\"_\"&TABLEAU_TEAMS[[#This Row],[GROUP_INITIAL_RANK]]","v":"C_2"},"Australie","C",2]
[{"$f":"+TABLEAU_TEAMS[[#This Row],[GROUP]]&\"_\"&TABLEAU_TEAMS[[#This Row],[GROUP_INITIAL_RANK]]","v":"C_3"},"Pérou","C",3]
[{"$f":"+TABLEAU_TEAMS[[#This Row],[GROUP]]&\"_\"&TABLEAU_TEAMS[[#This Row],[GROUP_INITIAL_RANK]]","v":"C_4"},"Danemark","C",4]
[{"$f":"+TABLEAU_TEAMS[[#This Row],[GROUP]]&\"_\"&TABLEAU_TEAMS[[#This Row],[GROUP_INITIAL_RANK]]","v":"D_1"},"Argentine","D",1]
[{"$f":"+TABLEAU_TEAMS[[#This Row],[GROUP]]&\"_\"&TABLEAU_TEAMS[[#This Row],[GROUP_INITIAL_RANK]]","v":"D_2"},"Islande","D",2]
[{"$f":"+TABLEAU_TEAMS[[#This Row],[GROUP]]&\"_\"&TABLEAU_TEAMS[[#This Row],[GROUP_INITIAL_RANK]]","v":"D_3"},"Croatie","D",3]
[{"$f":"+TABLEAU_TEAMS[[#This Row],[GROUP]]&\"_\"&TABLEAU_TEAMS[[#This Row],[GROUP_INITIAL_RANK]]","v":"D_4"},"Nigeria","D",4]
[{"$f":"+TABLEAU_TEAMS[[#This Row],[GROUP]]&\"_\"&TABLEAU_TEAMS[[#This Row],[GROUP_INITIAL_RANK]]","v":"E_1"},"Costa Rica","E",1]
[{"$f":"+TABLEAU_TEAMS[[#This Row],[GROUP]]&\"_\"&TABLEAU_TEAMS[[#This Row],[GROUP_INITIAL_RANK]]","v":"E_2"},"Serbie","E",2]
[{"$f":"+TABLEAU_TEAMS[[#This Row],[GROUP]]&\"_\"&TABLEAU_TEAMS[[#This Row],[GROUP_INITIAL_RANK]]","v":"E_3"},"Brésil","E",3]
[{"$f":"+TABLEAU_TEAMS[[#This Row],[GROUP]]&\"_\"&TABLEAU_TEAMS[[#This Row],[GROUP_INITIAL_RANK]]","v":"E_4"},"Suisse","E",4]
[{"$f":"+TABLEAU_TEAMS[[#This Row],[GROUP]]&\"_\"&TABLEAU_TEAMS[[#This Row],[GROUP_INITIAL_RANK]]","v":"F_1"},"Allemagne","F",1]
[{"$f":"+TABLEAU_TEAMS[[#This Row],[GROUP]]&\"_\"&TABLEAU_TEAMS[[#This Row],[GROUP_INITIAL_RANK]]","v":"F_2"},"Mexique","F",2]
[{"$f":"+TABLEAU_TEAMS[[#This Row],[GROUP]]&\"_\"&TABLEAU_TEAMS[[#This Row],[GROUP_INITIAL_RANK]]","v":"F_3"},"Suède","F",3]
[{"$f":"+TABLEAU_TEAMS[[#This Row],[GROUP]]&\"_\"&TABLEAU_TEAMS[[#This Row],[GROUP_INITIAL_RANK]]","v":"F_4"},"République de Corée","F",4]
[{"$f":"+TABLEAU_TEAMS[[#This Row],[GROUP]]&\"_\"&TABLEAU_TEAMS[[#This Row],[GROUP_INITIAL_RANK]]","v":"G_1"},"Belgique","G",1]
[{"$f":"+TABLEAU_TEAMS[[#This Row],[GROUP]]&\"_\"&TABLEAU_TEAMS[[#This Row],[GROUP_INITIAL_RANK]]","v":"G_2"},"Panama","G",2]
[{"$f":"+TABLEAU_TEAMS[[#This Row],[GROUP]]&\"_\"&TABLEAU_TEAMS[[#This Row],[GROUP_INITIAL_RANK]]","v":"G_3"},"Tunisie","G",3]
[{"$f":"+TABLEAU_TEAMS[[#This Row],[GROUP]]&\"_\"&TABLEAU_TEAMS[[#This Row],[GROUP_INITIAL_RANK]]","v":"G_4"},"Angleterre","G",4]
[{"$f":"+TABLEAU_TEAMS[[#This Row],[GROUP]]&\"_\"&TABLEAU_TEAMS[[#This Row],[GROUP_INITIAL_RANK]]","v":"H_1"},"Colombie","H",1]
[{"$f":"+TABLEAU_TEAMS[[#This Row],[GROUP]]&\"_\"&TABLEAU_TEAMS[[#This Row],[GROUP_INITIAL_RANK]]","v":"H_2"},"Japon","H",2]
[{"$f":"+TABLEAU_TEAMS[[#This Row],[GROUP]]&\"_\"&TABLEAU_TEAMS[[#This Row],[GROUP_INITIAL_RANK]]","v":"H_3"},"Pologne","H",3]
[{"$f":"+TABLEAU_TEAMS[[#This Row],[GROUP]]&\"_\"&TABLEAU_TEAMS[[#This Row],[GROUP_INITIAL_RANK]]","v":"H_4"},"Sénégal","H",4]

{"sheet":"DATA_1_MATCHS","index":4,"n_rows":49,"n_cols":5,"rows_kept":49,"cut":false,"hidden":true,"merged":[]}
["MATCH_NUMBER","MATCH_DATE","MATCH_TIME","TEAM_1","TEAM_2"]
[1,"2018-06-14","18:00:00","Russie","Arabie Saoudite"]
[2,"2018-06-15","17:00:00","Egypte","Uruguay"]
[3,"2018-06-15","18:00:00","Maroc","RI Iran"]
[4,"2018-06-15","21:00:00","Portugal","Espagne"]
[5,"2018-06-16","13:00:00","France","Australie"]
[6,"2018-06-16","19:00:00","Pérou","Danemark"]
[7,"2018-06-16","16:00:00","Argentine","Islande"]
[8,"2018-06-16","21:00:00","Croatie","Nigeria"]
[9,"2018-06-17","16:00:00","Costa Rica","Serbie"]
[10,"2018-06-17","21:00:00","Brésil","Suisse"]
[11,"2018-06-17","18:00:00","Allemagne","Mexique"]
[12,"2018-06-18","15:00:00","Suède","République de Corée"]
[13,"2018-06-18","18:00:00","Belgique","Panama"]
[14,"2018-06-18","21:00:00","Tunisie","Angleterre"]
[15,"2018-06-19","15:00:00","Colombie","Japon"]
[16,"2018-06-19","18:00:00","Pologne","Sénégal"]
[17,"2018-06-19","21:00:00","Russie","Egypte"]
[18,"2018-06-20","18:00:00","Uruguay","Arabie Saoudite"]
[19,"2018-06-20","15:00:00","Portugal","Maroc"]
[20,"2018-06-20","21:00:00","RI Iran","Espagne"]
[21,"2018-06-21","16:00:00","Danemark","Australie"]
[22,"2018-06-21","20:00:00","France","Pérou"]
[23,"2018-06-21","21:00:00","Argentine","Croatie"]
[24,"2018-06-22","18:00:00","Nigeria","Islande"]
[25,"2018-06-22","15:00:00","Brésil","Costa Rica"]
[26,"2018-06-22","20:00:00","Serbie","Suisse"]
[27,"2018-06-23","18:00:00","République de Corée","Mexique"]
[28,"2018-06-23","21:00:00","Allemagne","Suède"]
[29,"2018-06-23","15:00:00","Belgique","Tunisie"]
[30,"2018-06-24","15:00:00","Angleterre","Panama"]
[31,"2018-06-24","20:00:00","Japon","Sénégal"]
[32,"2018-06-24","21:00:00","Pologne","Colombie"]
[33,"2018-06-25","18:00:00","Uruguay","Russie"]
[34,"2018-06-25","17:00:00","Arabie Saoudite","Egypte"]
[35,"2018-06-25","21:00:00","RI Iran","Portugal"]
[36,"2018-06-25","20:00:00","Espagne","Maroc"]
[37,"2018-06-26","17:00:00","Danemark","France"]
[38,"2018-06-26","17:00:00","Australie","Pérou"]
[39,"2018-06-26","21:00:00","Nigeria","Argentine"]
[40,"2018-06-26","21:00:00","Islande","Croatie"]
[41,"2018-06-27","21:00:00","Serbie","Brésil"]
[42,"2018-06-27","21:00:00","Suisse","Costa Rica"]
[43,"2018-06-27","19:00:00","Mexique","Suède"]
[44,"2018-06-27","17:00:00","République de Corée","Allemagne"]
[45,"2018-06-28","21:00:00","Panama","Tunisie"]
[46,"2018-06-28","20:00:00","Angleterre","Belgique"]
[47,"2018-06-28","17:00:00","Japon","Pologne"]
[48,"2018-06-28","18:00:00","Sénégal","Colombie"]

{"sheet":"Kévin Sonilhac","index":5,"n_rows":138,"n_cols":46,"rows_kept":138,"cut":false,"hidden":false,"merged":[[3,9,3,12],[3,1,3,8],[2,1,2,8]]}
[]
[null,"Pronostics de :"]
[]
[null,{"$f":"MID(CELL(\"filename\",A1),FIND(\"]\",CELL(\"filename\",A1))+1,32)","v":"Kévin Sonilhac"}]
[]
[null,"SAISIE DES PRONOSTICS",null,null,null,null,null,null,null,null,null,null,null,null,null,null,null,null,null,"GROUPES",null,null,null,null,null,null,null,null,null,null,null,null,"SCORE PRONOSTIQUEUR",null,null,null,null,null,null,null,null,{"$f":"AN8+AN12","v":0}]
[null,"Date","Heure","Match","Groupe",1,"N",2,null,"Buts",null,null,"Buts"]
[null,{"$f":"VLOOKUP($D8,TABLEAU_MATCHS[#All],2,FALSE)","v":"2018-06-14"},{"$f":"VLOOKUP($D8,TABLEAU_MATCHS[#All],3,FALSE)","v":"18:00:00"},1,{"$f":"\"Groupe \"&VLOOKUP($I8,TABLEAU_TEAMS[[#All],[TEAM]:[GROUP_INITIAL_RANK]],2,FALSE)","v":"Groupe A"},1.3,4.3,10,{"$f":"VLOOKUP($D8,TABLEAU_MATCHS[#All],4,FALSE)","v":"Russie"},null,null,{"$f":"VLOOKUP($D8,TABLEAU_MATCHS[#All],5,FALSE)","v":"Arabie Saoudite"},null,{"$f":"IF(OR(ISBLANK(RESULTATS!J8),ISBLANK(J8)),\"\",IF(AND('Kévin Sonilhac'!J8=RESULTATS!J8,'Kévin Sonilhac'!M8=RESULTATS!M8),3,IF(OR(AND('Kévin Sonilhac'!J8>'Kévin Sonilhac'!M8,RESULTATS!J8>RESULTATS!M8),AND('Kévin Sonilhac'!J8<'Kévin Sonilhac'!M8,RESULTATS!J8<RESULTATS!M8),AND('Kévin Sonilhac'!J8='Kévin Sonilhac'!M8,RESULTATS!J8=RESULTATS!M8)),1,0)))","v":""},null,null,null,null,null,"Rg","Groupe A","MJ","G","N","P","BP","BC","+/-","Pts",null,null,null,"Phases de groupes",null,null,null,null,null,null,{"$f":"N56","v":0},null,"points"]
[null,{"$f":"VLOOKUP($D9,TABLEAU_MATCHS[#All],2,FALSE)","v":"2018-06-15"},{"$f":"VLOOKUP($D9,TABLEAU_MATCHS[#All],3,FALSE)","v":"17:00:00"},2,{"$f":"\"Groupe \"&VLOOKUP($I9,TABLEAU_TEAMS[[#All],[TEAM]:[GROUP_INITIAL_RANK]],2,FALSE)","v":"Groupe A"},2.2000000000000002,2.9,3.25,{"$f":"VLOOKUP($D9,TABLEAU_MATCHS[#All],4,FALSE)","v":"Egypte"},null,null,{"$f":"VLOOKUP($D9,TABLEAU_MATCHS[#All],5,FALSE)","v":"Uruguay"},null,{"$f":"IF(OR(ISBLANK(RESULTATS!J9),ISBLANK(J9)),\"\",IF(AND('Kévin Sonilhac'!J9=RESULTATS!J9,'Kévin Sonilhac'!M9=RESULTATS!M9),3,IF(OR(AND('Kévin Sonilhac'!J9>'Kévin Sonilhac'!M9,RESULTATS!J9>RESULTATS!M9),AND('Kévin Sonilhac'!J9<'Kévin Sonilhac'!M9,RESULTATS!J9<RESULTATS!M9),AND('Kévin Sonilhac'!J9='Kévin Sonilhac'!M9,RESULTATS!J9=RESULTATS!M9)),1,0)))","v":""},null,null,null,{"$f":"INDEX($R60:$R63,MATCH(SMALL(COUNTIF($R60:$R63,\">=\"&$R60:$R63),ROW(INDIRECT(\"1:\"&ROWS($R60:$R63)))),COUNTIF($R60:$R63,\">=\"&$R60:$R63),0))","v":"00000Uruguay"},{"$f":"INDEX($S60:$S63,MATCH(SMALL(COUNTIF($R60:$R63,\">=\"&$R60:$R63),ROW(INDIRECT(\"1:\"&ROWS($R60:$R63)))),COUNTIF($R60:$R63,\">=\"&$R60:$R63),0))","v":0},{"$f":"INDEX($T60:$T63,MATCH(SMALL(COUNTIF($R60:$R63,\">=\"&$R60:$R63),ROW(INDIRECT(\"1:\"&ROWS($R60:$R63)))),COUNTIF($R60:$R63,\">=\"&$R60:$R63),0))","v":1},{"$f":"INDEX($U60:$U63,MATCH(SMALL(COUNTIF($R60:$R63,\">=\"&$R60:$R63),ROW(INDIRECT(\"1:\"&ROWS($R60:$R63)))),COUNTIF($R60:$R63,\">=\"&$R60:$R63),0))","v":"Uruguay"},{"$f":"SUMPRODUCT((Teams1=U9)*(Teams1_Score<>\"\"))+SUMPRODUCT((Teams2=U9)*(Teams2_Score<>\"\"))","v":0},{"$f":"SUMPRODUCT((Teams1=U9)*(Teams1_Score>Teams2_Score))+SUMPRODUCT((Teams2=U9)*(Teams2_Score>Teams1_Score))","v":0},{"$f":"SUMPRODUCT((Teams1=U9)*(Teams1_Score=Teams2_Score)*(Teams1_Score<>\"\"))+SUMPRODUCT((Teams2=U9)*(Teams2_Score=Teams1_Score)*(Teams2_Score<>\"\"))","v":0},{"$f":"SUMPRODUCT((Teams1=U9)*(Teams1_Score<Teams2_Score))+SUMPRODUCT((Teams2=U9)*(Teams2_Score<Teams1_Score))","v":0},{"$f":"SUMPRODUCT((Teams1=U9)*(Teams1_Score))+SUMPRODUCT((Teams2=U9)*(Teams2_Score))","v":0},{"$f":"SUMPRODUCT((Teams1=U9)*(Teams2_Score))+SUMPRODUCT((Teams2=U9)*(Teams1_Score))","v":0},{"$f":"Z9-AA9","v":0},{"$f":"3*W9+X9","v":0},null,null,null,"Vainqueur ou nul trouvé (1 pt)",null,null,{"$f":"COUNTIF($N$8:$N$55,1)+COUNTIF($N$8:$N$55,3)","v":0},"matchs",null,null,{"$f":"AJ9","v":0},null,"points"]
[null,{"$f":"VLOOKUP($D10,TABLEAU_MATCHS[#All],2,FALSE)","v":"2018-06-15"},{"$f":"VLOOKUP($D10,TABLEAU_MATCHS[#All],3,FALSE)","v":"18:00:00"},3,{"$f":"\"Groupe \"&VLOOKUP($I10,TABLEAU_TEAMS[[#All],[TEAM]:[GROUP_INITIAL_RANK]],2,FALSE)","v":"Groupe B"},1.8,3.05,4.5,{"$f":"VLOOKUP($D10,TABLEAU_MATCHS[#All],4,FALSE)","v":"Maroc"},null,null,{"$f":"VLOOKUP($D10,TABLEAU_MATCHS[#All],5,FALSE)","v":"RI Iran"},null,{"$f":"IF(OR(ISBLANK(RESULTATS!J10),ISBLANK(J10)),\"\",IF(AND('Kévin Sonilhac'!J10=RESULTATS!J10,'Kévin Sonilhac'!M10=RESULTATS!M10),3,IF(OR(AND('Kévin Sonilhac'!J10>'Kévin Sonilhac'!M10,RESULTATS!J10>RESULTATS!M10),AND('Kévin Sonilhac'!J10<'Kévin Sonilhac'!M10,RESULTATS!J10<RESULTATS!M10),AND('Kévin Sonilhac'!J10='Kévin Sonilhac'!M10,RESULTATS!J10=RESULTATS!M10)),1,0)))","v":""},null,null,null,"00000Russie",0,1,"Russie",{"$f":"SUMPRODUCT((Teams1=U10)*(Teams1_Score<>\"\"))+SUMPRODUCT((Teams2=U10)*(Teams2_Score<>\"\"))","v":0},{"$f":"SUMPRODUCT((Teams1=U10)*(Teams1_Score>Teams2_Score))+SUMPRODUCT((Teams2=U10)*(Teams2_Score>Teams1_Score))","v":0},{"$f":"SUMPRODUCT((Teams1=U10)*(Teams1_Score=Teams2_Score)*(Teams1_Score<>\"\"))+SUMPRODUCT((Teams2=U10)*(Teams2_Score=Teams1_Score)*(Teams2_Score<>\"\"))","v":0},{"$f":"SUMPRODUCT((Teams1=U10)*(Teams1_Score<Teams2_Score))+SUMPRODUCT((Teams2=U10)*(Teams2_Score<Teams1_Score))","v":0},{"$f":"SUMPRODUCT((Teams1=U10)*(Teams1_Score))+SUMPRODUCT((Teams2=U10)*(Teams2_Score))","v":0},{"$f":"SUMPRODUCT((Teams1=U10)*(Teams2_Score))+SUMPRODUCT((Teams2=U10)*(Teams1_Score))","v":0},{"$f":"Z10-AA10","v":0},{"$f":"3*W10+X10","v":0},null,null,null,"Bonus score exact (2 pts)",null,null,{"$f":"+COUNTIF($N$8:$N$55,3)","v":0},"matchs",null,null,{"$f":"AJ10*2","v":0},null,"points"]
[null,{"$f":"VLOOKUP($D11,TABLEAU_MATCHS[#All],2,FALSE)","v":"2018-06-15"},{"$f":"VLOOKUP($D11,TABLEAU_MATCHS[#All],3,FALSE)","v":"21:00:00"},4,{"$f":"\"Groupe \"&VLOOKUP($I11,TABLEAU_TEAMS[[#All],[TEAM]:[GROUP_INITIAL_RANK]],2,FALSE)","v":"Groupe B"},1.42,3.9,7,{"$f":"VLOOKUP($D11,TABLEAU_MATCHS[#All],4,FALSE)","v":"Portugal"},null,null,{"$f":"VLOOKUP($D11,TABLEAU_MATCHS[#All],5,FALSE)","v":"Espagne"},null,{"$f":"IF(OR(ISBLANK(RESULTATS!J11),ISBLANK(J11)),\"\",IF(AND('Kévin Sonilhac'!J11=RESULTATS!J11,'Kévin Sonilhac'!M11=RESULTATS!M11),3,IF(OR(AND('Kévin Sonilhac'!J11>'Kévin Sonilhac'!M11,RESULTATS!J11>RESULTATS!M11),AND('Kévin Sonilhac'!J11<'Kévin Sonilhac'!M11,RESULTATS!J11<RESULTATS!M11),AND('Kévin Sonilhac'!J11='Kévin Sonilhac'!M11,RESULTATS!J11=RESULTATS!M11)),1,0)))","v":""},null,null,null,"00000Egypte",0,1,"Egypte",{"$f":"SUMPRODUCT((Teams1=U11)*(Teams1_Score<>\"\"))+SUMPRODUCT((Teams2=U11)*(Teams2_Score<>\"\"))","v":0},{"$f":"SUMPRODUCT((Teams1=U11)*(Teams1_Score>Teams2_Score))+SUMPRODUCT((Teams2=U11)*(Teams2_Score>Teams1_Score))","v":0},{"$f":"SUMPRODUCT((Teams1=U11)*(Teams1_Score=Teams2_Score)*(Teams1_Score<>\"\"))+SUMPRODUCT((Teams2=U11)*(Teams2_Score=Teams1_Score)*(Teams2_Score<>\"\"))","v":0},{"$f":"SUMPRODUCT((Teams1=U11)*(Teams1_Score<Teams2_Score))+SUMPRODUCT((Teams2=U11)*(Teams2_Score<Teams1_Score))","v":0},{"$f":"SUMPRODUCT((Teams1=U11)*(Teams1_Score))+SUMPRODUCT((Teams2=U11)*(Teams2_Score))","v":0},{"$f":"SUMPRODUCT((Teams1=U11)*(Teams2_Score))+SUMPRODUCT((Teams2=U11)*(Teams1_Score))","v":0},0,0]
[null,{"$f":"VLOOKUP($D12,TABLEAU_MATCHS[#All],2,FALSE)","v":"2018-06-16"},{"$f":"VLOOKUP($D12,TABLEAU_MATCHS[#All],3,FALSE)","v":"13:00:00"},5,{"$f":"\"Groupe \"&VLOOKUP($I12,TABLEAU_TEAMS[[#All],[TEAM]:[GROUP_INITIAL_RANK]],2,FALSE)","v":"Groupe C"},1.7,3.1,5,{"$f":"VLOOKUP($D12,TABLEAU_MATCHS[#All],4,FALSE)","v":"France"},null,null,{"$f":"VLOOKUP($D12,TABLEAU_MATCHS[#All],5,FALSE)","v":"Australie"},null,{"$f":"IF(OR(ISBLANK(RESULTATS!J12),ISBLANK(J12)),\"\",IF(AND('Kévin Sonilhac'!J12=RESULTATS!J12,'Kévin Sonilhac'!M12=RESULTATS!M12),3,IF(OR(AND('Kévin Sonilhac'!J12>'Kévin Sonilhac'!M12,RESULTATS!J12>RESULTATS!M12),AND('Kévin Sonilhac'!J12<'Kévin Sonilhac'!M12,RESULTATS!J12<RESULTATS!M12),AND('Kévin Sonilhac'!J12='Kévin Sonilhac'!M12,RESULTATS!J12=RESULTATS!M12)),1,0)))","v":""},null,null,null,"00000Arabie Saoudite",0,1,"Arabie Saoudite",{"$f":"SUMPRODUCT((Teams1=U12)*(Teams1_Score<>\"\"))+SUMPRODUCT((Teams2=U12)*(Teams2_Score<>\"\"))","v":0},{"$f":"SUMPRODUCT((Teams1=U12)*(Teams1_Score>Teams2_Score))+SUMPRODUCT((Teams2=U12)*(Teams2_Score>Teams1_Score))","v":0},{"$f":"SUMPRODUCT((Teams1=U12)*(Teams1_Score=Teams2_Score)*(Teams1_Score<>\"\"))+SUMPRODUCT((Teams2=U12)*(Teams2_Score=Teams1_Score)*(Teams2_Score<>\"\"))","v":0},{"$f":"SUMPRODUCT((Teams1=U12)*(Teams1_Score<Teams2_Score))+SUMPRODUCT((Teams2=U12)*(Teams2_Score<Teams1_Score))","v":0},{"$f":"SUMPRODUCT((Teams1=U12)*(Teams1_Score))+SUMPRODUCT((Teams2=U12)*(Teams2_Score))","v":0},{"$f":"SUMPRODUCT((Teams1=U12)*(Teams2_Score))+SUMPRODUCT((Teams2=U12)*(Teams1_Score))","v":0},0,0,null,null,null,"Phases finales",null,null,null,null,null,null,{"$f":"SUM(AN13:AN17)","v":0},null,"points"]
[null,{"$f":"VLOOKUP($D13,TABLEAU_MATCHS[#All],2,FALSE)","v":"2018-06-16"},{"$f":"VLOOKUP($D13,TABLEAU_MATCHS[#All],3,FALSE)","v":"19:00:00"},6,{"$f":"\"Groupe \"&VLOOKUP($I13,TABLEAU_TEAMS[[#All],[TEAM]:[GROUP_INITIAL_RANK]],2,FALSE)","v":"Groupe C"},2.5499999999999998,2.9,2.7,{"$f":"VLOOKUP($D13,TABLEAU_MATCHS[#All],4,FALSE)","v":"Pérou"},null,null,{"$f":"VLOOKUP($D13,TABLEAU_MATCHS[#All],5,FALSE)","v":"Danemark"},null,{"$f":"IF(OR(ISBLANK(RESULTATS!J13),ISBLANK(J13)),\"\",IF(AND('Kévin Sonilhac'!J13=RESULTATS!J13,'Kévin Sonilhac'!M13=RESULTATS!M13),3,IF(OR(AND('Kévin Sonilhac'!J13>'Kévin Sonilhac'!M13,RESULTATS!J13>RESULTATS!M13),AND('Kévin Sonilhac'!J13<'Kévin Sonilhac'!M13,RESULTATS!J13<RESULTATS!M13),AND('Kévin Sonilhac'!J13='Kévin Sonilhac'!M13,RESULTATS!J13=RESULTATS!M13)),1,0)))","v":""},null,null,null,null,null,null,null,null,null,null,null,null,null,null,null,null,null,null,"Huitièmes de finaliste trouvés (2 pts)",null,null,{"$f":"IF(CLASSEMENT!PHASES_FINALES=\"OUI\",$AK$53+$AQ$53)","v":false},"équipe(s) ",null,null,{"$f":"AJ13*2","v":0},null,"points"]
[null,{"$f":"VLOOKUP($D14,TABLEAU_MATCHS[#All],2,FALSE)","v":"2018-06-16"},{"$f":"VLOOKUP($D14,TABLEAU_MATCHS[#All],3,FALSE)","v":"16:00:00"},7,{"$f":"\"Groupe \"&VLOOKUP($I14,TABLEAU_TEAMS[[#All],[TEAM]:[GROUP_INITIAL_RANK]],2,FALSE)","v":"Groupe D"},1.4,4,7.25,{"$f":"VLOOKUP($D14,TABLEAU_MATCHS[#All],4,FALSE)","v":"Argentine"},null,null,{"$f":"VLOOKUP($D14,TABLEAU_MATCHS[#All],5,FALSE)","v":"Islande"},null,{"$f":"IF(OR(ISBLANK(RESULTATS!J14),ISBLANK(J14)),\"\",IF(AND('Kévin Sonilhac'!J14=RESULTATS!J14,'Kévin Sonilhac'!M14=RESULTATS!M14),3,IF(OR(AND('Kévin Sonilhac'!J14>'Kévin Sonilhac'!M14,RESULTATS!J14>RESULTATS!M14),AND('Kévin Sonilhac'!J14<'Kévin Sonilhac'!M14,RESULTATS!J14<RESULTATS!M14),AND('Kévin Sonilhac'!J14='Kévin Sonilhac'!M14,RESULTATS!J14=RESULTATS!M14)),1,0)))","v":""},null,null,null,null,null,"Rg","Groupe B","MJ","G","N","P","BP","BC","+/-","Pts",null,null,null,"Quarts de finalistes trouvés (4 pts)",null,null,{"$f":"IF(CLASSEMENT!PHASES_FINALES=\"OUI\",$AK$42+$AQ$42)","v":false},"équipe(s) ",null,null,{"$f":"AJ14*4","v":0},null,"points"]
[null,{"$f":"VLOOKUP($D15,TABLEAU_MATCHS[#All],2,FALSE)","v":"2018-06-16"},{"$f":"VLOOKUP($D15,TABLEAU_MATCHS[#All],3,FALSE)","v":"21:00:00"},8,{"$f":"\"Groupe \"&VLOOKUP($I15,TABLEAU_TEAMS[[#All],[TEAM]:[GROUP_INITIAL_RANK]],2,FALSE)","v":"Groupe D"},2.95,2.7,2.5499999999999998,{"$f":"VLOOKUP($D15,TABLEAU_MATCHS[#All],4,FALSE)","v":"Croatie"},null,null,{"$f":"VLOOKUP($D15,TABLEAU_MATCHS[#All],5,FALSE)","v":"Nigeria"},null,{"$f":"IF(OR(ISBLANK(RESULTATS!J15),ISBLANK(J15)),\"\",IF(AND('Kévin Sonilhac'!J15=RESULTATS!J15,'Kévin Sonilhac'!M15=RESULTATS!M15),3,IF(OR(AND('Kévin Sonilhac'!J15>'Kévin Sonilhac'!M15,RESULTATS!J15>RESULTATS!M15),AND('Kévin Sonilhac'!J15<'Kévin Sonilhac'!M15,RESULTATS!J15<RESULTATS!M15),AND('Kévin Sonilhac'!J15='Kévin Sonilhac'!M15,RESULTATS!J15=RESULTATS!M15)),1,0)))","v":""},null,null,null,{"$f":"INDEX($R66:$R69,MATCH(SMALL(COUNTIF($R66:$R69,\">=\"&$R66:$R69),ROW(INDIRECT(\"1:\"&ROWS($R66:$R69)))),COUNTIF($R66:$R69,\">=\"&$R66:$R69),0))","v":"00000RI Iran"},{"$f":"INDEX($S66:$S69,MATCH(SMALL(COUNTIF($R66:$R69,\">=\"&$R66:$R69),ROW(INDIRECT(\"1:\"&ROWS($R66:$R69)))),COUNTIF($R66:$R69,\">=\"&$R66:$R69),0))","v":0},{"$f":"INDEX($T66:$T69,MATCH(SMALL(COUNTIF($R66:$R69,\">=\"&$R66:$R69),ROW(INDIRECT(\"1:\"&ROWS($R66:$R69)))),COUNTIF($R66:$R69,\">=\"&$R66:$R69),0))","v":1},{"$f":"INDEX($U66:$U69,MATCH(SMALL(COUNTIF($R66:$R69,\">=\"&$R66:$R69),ROW(INDIRECT(\"1:\"&ROWS($R66:$R69)))),COUNTIF($R66:$R69,\">=\"&$R66:$R69),0))","v":"RI Iran"},{"$f":"SUMPRODUCT((Teams1=U15)*(Teams1_Score<>\"\"))+SUMPRODUCT((Teams2=U15)*(Teams2_Score<>\"\"))","v":0},{"$f":"SUMPRODUCT((Teams1=U15)*(Teams1_Score>Teams2_Score))+SUMPRODUCT((Teams2=U15)*(Teams2_Score>Teams1_Score))","v":0},{"$f":"SUMPRODUCT((Teams1=U15)*(Teams1_Score=Teams2_Score)*(Teams1_Score<>\"\"))+SUMPRODUCT((Teams2=U15)*(Teams2_Score=Teams1_Score)*(Teams2_Score<>\"\"))","v":0},{"$f":"SUMPRODUCT((Teams1=U15)*(Teams1_Score<Teams2_Score))+SUMPRODUCT((Teams2=U15)*(Teams2_Score<Teams1_Score))","v":0},{"$f":"SUMPRODUCT((Teams1=U15)*(Teams1_Score))+SUMPRODUCT((Teams2=U15)*(Teams2_Score))","v":0},{"$f":"SUMPRODUCT((Teams1=U15)*(Teams2_Score))+SUMPRODUCT((Teams2=U15)*(Teams1_Score))","v":0},{"$f":"Z15-AA15","v":0},{"$f":"3*W15+X15","v":0},null,null,null,"Demi finalistes trouvés (5 pts)",null,null,{"$f":"IF(CLASSEMENT!PHASES_FINALES=\"OUI\",$AK$35+$AQ$35)","v":false},"équipe(s) ",null,null,{"$f":"AJ15*5","v":0},null,"points"]
[null,{"$f":"VLOOKUP($D16,TABLEAU_MATCHS[#All],2,FALSE)","v":"2018-06-17"},{"$f":"VLOOKUP($D16,TABLEAU_MATCHS[#All],3,FALSE)","v":"16:00:00"},9,{"$f":"\"Groupe \"&VLOOKUP($I16,TABLEAU_TEAMS[[#All],[TEAM]:[GROUP_INITIAL_RANK]],2,FALSE)","v":"Groupe E"},2.35,2.9,2.95,{"$f":"VLOOKUP($D16,TABLEAU_MATCHS[#All],4,FALSE)","v":"Costa Rica"},null,null,{"$f":"VLOOKUP($D16,TABLEAU_MATCHS[#All],5,FALSE)","v":"Serbie"},null,{"$f":"IF(OR(ISBLANK(RESULTATS!J16),ISBLANK(J16)),\"\",IF(AND('Kévin Sonilhac'!J16=RESULTATS!J16,'Kévin Sonilhac'!M16=RESULTATS!M16),3,IF(OR(AND('Kévin Sonilhac'!J16>'Kévin Sonilhac'!M16,RESULTATS!J16>RESULTATS!M16),AND('Kévin Sonilhac'!J16<'Kévin Sonilhac'!M16,RESULTATS!J16<RESULTATS!M16),AND('Kévin Sonilhac'!J16='Kévin Sonilhac'!M16,RESULTATS!J16=RESULTATS!M16)),1,0)))","v":""},null,null,null,"00000Portugal",0,1,"Portugal",{"$f":"SUMPRODUCT((Teams1=U16)*(Teams1_Score<>\"\"))+SUMPRODUCT((Teams2=U16)*(Teams2_Score<>\"\"))","v":0},{"$f":"SUMPRODUCT((Teams1=U16)*(Teams1_Score>Teams2_Score))+SUMPRODUCT((Teams2=U16)*(Teams2_Score>Teams1_Score))","v":0},{"$f":"SUMPRODUCT((Teams1=U16)*(Teams1_Score=Teams2_Score)*(Teams1_Score<>\"\"))+SUMPRODUCT((Teams2=U16)*(Teams2_Score=Teams1_Score)*(Teams2_Score<>\"\"))","v":0},{"$f":"SUMPRODUCT((Teams1=U16)*(Teams1_Score<Teams2_Score))+SUMPRODUCT((Teams2=U16)*(Teams2_Score<Teams1_Score))","v":0},{"$f":"SUMPRODUCT((Teams1=U16)*(Teams1_Score))+SUMPRODUCT((Teams2=U16)*(Teams2_Score))","v":0},{"$f":"SUMPRODUCT((Teams1=U16)*(Teams2_Score))+SUMPRODUCT((Teams2=U16)*(Teams1_Score))","v":0},0,0,null,null,null,"Finalistes trouvés (6 pts)",null,null,{"$f":"IF(CLASSEMENT!PHASES_FINALES=\"OUI\",$AK$25+$AQ$25)","v":false},"équipe(s) ",null,null,{"$f":"AJ16*6","v":0},null,"points"]
[null,{"$f":"VLOOKUP($D17,TABLEAU_MATCHS[#All],2,FALSE)","v":"2018-06-17"},{"$f":"VLOOKUP($D17,TABLEAU_MATCHS[#All],3,FALSE)","v":"21:00:00"},10,{"$f":"\"Groupe \"&VLOOKUP($I17,TABLEAU_TEAMS[[#All],[TEAM]:[GROUP_INITIAL_RANK]],2,FALSE)","v":"Groupe E"},1.28,4.7,9.5,{"$f":"VLOOKUP($D17,TABLEAU_MATCHS[#All],4,FALSE)","v":"Brésil"},null,null,{"$f":"VLOOKUP($D17,TABLEAU_MATCHS[#All],5,FALSE)","v":"Suisse"},null,{"$f":"IF(OR(ISBLANK(RESULTATS!J17),ISBLANK(J17)),\"\",IF(AND('Kévin Sonilhac'!J17=RESULTATS!J17,'Kévin Sonilhac'!M17=RESULTATS!M17),3,IF(OR(AND('Kévin Sonilhac'!J17>'Kévin Sonilhac'!M17,RESULTATS!J17>RESULTATS!M17),AND('Kévin Sonilhac'!J17<'Kévin Sonilhac'!M17,RESULTATS!J17<RESULTATS!M17),AND('Kévin Sonilhac'!J17='Kévin Sonilhac'!M17,RESULTATS!J17=RESULTATS!M17)),1,0)))","v":""},null,null,null,"00000Maroc",0,1,"Maroc",{"$f":"SUMPRODUCT((Teams1=U17)*(Teams1_Score<>\"\"))+SUMPRODUCT((Teams2=U17)*(Teams2_Score<>\"\"))","v":0},{"$f":"SUMPRODUCT((Teams1=U17)*(Teams1_Score>Teams2_Score))+SUMPRODUCT((Teams2=U17)*(Teams2_Score>Teams1_Score))","v":0},{"$f":"SUMPRODUCT((Teams1=U17)*(Teams1_Score=Teams2_Score)*(Teams1_Score<>\"\"))+SUMPRODUCT((Teams2=U17)*(Teams2_Score=Teams1_Score)*(Teams2_Score<>\"\"))","v":0},{"$f":"SUMPRODUCT((Teams1=U17)*(Teams1_Score<Teams2_Score))+SUMPRODUCT((Teams2=U17)*(Teams2_Score<Teams1_Score))","v":0},{"$f":"SUMPRODUCT((Teams1=U17)*(Teams1_Score))+SUMPRODUCT((Teams2=U17)*(Teams2_Score))","v":0},{"$f":"SUMPRODUCT((Teams1=U17)*(Teams2_Score))+SUMPRODUCT((Teams2=U17)*(Teams1_Score))","v":0},0,0,null,null,null,"Champion du monde trouvé (7 pts)",null,null,{"$f":"IF(CLASSEMENT!PHASES_FINALES=\"OUI\",IF(AJ25<>\"\",IF($AT$25=RESULTATS!AS10,1,0),0))","v":false},"équipe",null,null,{"$f":"AJ17*7","v":0},null,"points"]
[null,{"$f":"VLOOKUP($D18,TABLEAU_MATCHS[#All],2,FALSE)","v":"2018-06-17"},{"$f":"VLOOKUP($D18,TABLEAU_MATCHS[#All],3,FALSE)","v":"18:00:00"},11,{"$f":"\"Groupe \"&VLOOKUP($I18,TABLEAU_TEAMS[[#All],[TEAM]:[GROUP_INITIAL_RANK]],2,FALSE)","v":"Groupe F"},1.34,4.3,7.5,{"$f":"VLOOKUP($D18,TABLEAU_MATCHS[#All],4,FALSE)","v":"Allemagne"},null,null,{"$f":"VLOOKUP($D18,TABLEAU_MATCHS[#All],5,FALSE)","v":"Mexique"},null,{"$f":"IF(OR(ISBLANK(RESULTATS!J18),ISBLANK(J18)),\"\",IF(AND('Kévin Sonilhac'!J18=RESULTATS!J18,'Kévin Sonilhac'!M18=RESULTATS!M18),3,IF(OR(AND('Kévin Sonilhac'!J18>'Kévin Sonilhac'!M18,RESULTATS!J18>RESULTATS!M18),AND('Kévin Sonilhac'!J18<'Kévin Sonilhac'!M18,RESULTATS!J18<RESULTATS!M18),AND('Kévin Sonilhac'!J18='Kévin Sonilhac'!M18,RESULTATS!J18=RESULTATS!M18)),1,0)))","v":""},null,null,null,"00000Espagne",0,1,"Espagne",{"$f":"SUMPRODUCT((Teams1=U18)*(Teams1_Score<>\"\"))+SUMPRODUCT((Teams2=U18)*(Teams2_Score<>\"\"))","v":0},{"$f":"SUMPRODUCT((Teams1=U18)*(Teams1_Score>Teams2_Score))+SUMPRODUCT((Teams2=U18)*(Teams2_Score>Teams1_Score))","v":0},{"$f":"SUMPRODUCT((Teams1=U18)*(Teams1_Score=Teams2_Score)*(Teams1_Score<>\"\"))+SUMPRODUCT((Teams2=U18)*(Teams2_Score=Teams1_Score)*(Teams2_Score<>\"\"))","v":0},{"$f":"SUMPRODUCT((Teams1=U18)*(Teams1_Score<Teams2_Score))+SUMPRODUCT((Teams2=U18)*(Teams2_Score<Teams1_Score))","v":0},{"$f":"SUMPRODUCT((Teams1=U18)*(Teams1_Score))+SUMPRODUCT((Teams2=U18)*(Teams2_Score))","v":0},{"$f":"SUMPRODUCT((Teams1=U18)*(Teams2_Score))+SUMPRODUCT((Teams2=U18)*(Teams1_Score))","v":0},0,0]
[null,{"$f":"VLOOKUP($D19,TABLEAU_MATCHS[#All],2,FALSE)","v":"2018-06-18"},{"$f":"VLOOKUP($D19,TABLEAU_MATCHS[#All],3,FALSE)","v":"15:00:00"},12,{"$f":"\"Groupe \"&VLOOKUP($I19,TABLEAU_TEAMS[[#All],[TEAM]:[GROUP_INITIAL_RANK]],2,FALSE)","v":"Groupe F"},3.3,2.95,2.15,{"$f":"VLOOKUP($D19,TABLEAU_MATCHS[#All],4,FALSE)","v":"Suède"},null,null,{"$f":"VLOOKUP($D19,TABLEAU_MATCHS[#All],5,FALSE)","v":"République de Corée"},null,{"$f":"IF(OR(ISBLANK(RESULTATS!J19),ISBLANK(J19)),\"\",IF(AND('Kévin Sonilhac'!J19=RESULTATS!J19,'Kévin Sonilhac'!M19=RESULTATS!M19),3,IF(OR(AND('Kévin Sonilhac'!J19>'Kévin Sonilhac'!M19,RESULTATS!J19>RESULTATS!M19),AND('Kévin Sonilhac'!J19<'Kévin Sonilhac'!M19,RESULTATS!J19<RESULTATS!M19),AND('Kévin Sonilhac'!J19='Kévin Sonilhac'!M19,RESULTATS!J19=RESULTATS!M19)),1,0)))","v":""}]
[null,{"$f":"VLOOKUP($D20,TABLEAU_MATCHS[#All],2,FALSE)","v":"2018-06-18"},{"$f":"VLOOKUP($D20,TABLEAU_MATCHS[#All],3,FALSE)","v":"18:00:00"},13,{"$f":"\"Groupe \"&VLOOKUP($I20,TABLEAU_TEAMS[[#All],[TEAM]:[GROUP_INITIAL_RANK]],2,FALSE)","v":"Groupe G"},1.95,2.95,4,{"$f":"VLOOKUP($D20,TABLEAU_MATCHS[#All],4,FALSE)","v":"Belgique"},null,null,{"$f":"VLOOKUP($D20,TABLEAU_MATCHS[#All],5,FALSE)","v":"Panama"},null,{"$f":"IF(OR(ISBLANK(RESULTATS!J20),ISBLANK(J20)),\"\",IF(AND('Kévin Sonilhac'!J20=RESULTATS!J20,'Kévin Sonilhac'!M20=RESULTATS!M20),3,IF(OR(AND('Kévin Sonilhac'!J20>'Kévin Sonilhac'!M20,RESULTATS!J20>RESULTATS!M20),AND('Kévin Sonilhac'!J20<'Kévin Sonilhac'!M20,RESULTATS!J20<RESULTATS!M20),AND('Kévin Sonilhac'!J20='Kévin Sonilhac'!M20,RESULTATS!J20=RESULTATS!M20)),1,0)))","v":""},null,null,null,null,null,"Rg","Groupe C","MJ","G","N","P","BP","BC","+/-","Pts"]
[null,{"$f":"VLOOKUP($D21,TABLEAU_MATCHS[#All],2,FALSE)","v":"2018-06-18"},{"$f":"VLOOKUP($D21,TABLEAU_MATCHS[#All],3,FALSE)","v":"21:00:00"},14,{"$f":"\"Groupe \"&VLOOKUP($I21,TABLEAU_TEAMS[[#All],[TEAM]:[GROUP_INITIAL_RANK]],2,FALSE)","v":"Groupe G"},2.5499999999999998,2.9,2.7,{"$f":"VLOOKUP($D21,TABLEAU_MATCHS[#All],4,FALSE)","v":"Tunisie"},null,null,{"$f":"VLOOKUP($D21,TABLEAU_MATCHS[#All],5,FALSE)","v":"Angleterre"},null,{"$f":"IF(OR(ISBLANK(RESULTATS!J21),ISBLANK(J21)),\"\",IF(AND('Kévin Sonilhac'!J21=RESULTATS!J21,'Kévin Sonilhac'!M21=RESULTATS!M21),3,IF(OR(AND('Kévin Sonilhac'!J21>'Kévin Sonilhac'!M21,RESULTATS!J21>RESULTATS!M21),AND('Kévin Sonilhac'!J21<'Kévin Sonilhac'!M21,RESULTATS!J21<RESULTATS!M21),AND('Kévin Sonilhac'!J21='Kévin Sonilhac'!M21,RESULTATS!J21=RESULTATS!M21)),1,0)))","v":""},null,null,null,{"$f":"INDEX($R72:$R75,MATCH(SMALL(COUNTIF($R72:$R75,\">=\"&$R72:$R75),ROW(INDIRECT(\"1:\"&ROWS($R72:$R75)))),COUNTIF($R72:$R75,\">=\"&$R72:$R75),0))","v":"00000Pérou"},{"$f":"INDEX($S72:$S75,MATCH(SMALL(COUNTIF($R72:$R75,\">=\"&$R72:$R75),ROW(INDIRECT(\"1:\"&ROWS($R72:$R75)))),COUNTIF($R72:$R75,\">=\"&$R72:$R75),0))","v":0},{"$f":"INDEX($T72:$T75,MATCH(SMALL(COUNTIF($R72:$R75,\">=\"&$R72:$R75),ROW(INDIRECT(\"1:\"&ROWS($R72:$R75)))),COUNTIF($R72:$R75,\">=\"&$R72:$R75),0))","v":1},{"$f":"INDEX($U72:$U75,MATCH(SMALL(COUNTIF($R72:$R75,\">=\"&$R72:$R75),ROW(INDIRECT(\"1:\"&ROWS($R72:$R75)))),COUNTIF($R72:$R75,\">=\"&$R72:$R75),0))","v":"Pérou"},{"$f":"SUMPRODUCT((Teams1=U21)*(Teams1_Score<>\"\"))+SUMPRODUCT((Teams2=U21)*(Teams2_Score<>\"\"))","v":0},{"$f":"SUMPRODUCT((Teams1=U21)*(Teams1_Score>Teams2_Score))+SUMPRODUCT((Teams2=U21)*(Teams2_Score>Teams1_Score))","v":0},{"$f":"SUMPRODUCT((Teams1=U21)*(Teams1_Score=Teams2_Score)*(Teams1_Score<>\"\"))+SUMPRODUCT((Teams2=U21)*(Teams2_Score=Teams1_Score)*(Teams2_Score<>\"\"))","v":0},{"$f":"SUMPRODUCT((Teams1=U21)*(Teams1_Score<Teams2_Score))+SUMPRODUCT((Teams2=U21)*(Teams2_Score<Teams1_Score))","v":0},{"$f":"SUMPRODUCT((Teams1=U21)*(Teams1_Score))+SUMPRODUCT((Teams2=U21)*(Teams2_Score))","v":0},{"$f":"SUMPRODUCT((Teams1=U21)*(Teams2_Score))+SUMPRODUCT((Teams2=U21)*(Teams1_Score))","v":0},{"$f":"Z21-AA21","v":0},{"$f":"3*W21+X21","v":0},null,null,null,"PHASES FINALES"]
[null,{"$f":"VLOOKUP($D22,TABLEAU_MATCHS[#All],2,FALSE)","v":"2018-06-19"},{"$f":"VLOOKUP($D22,TABLEAU_MATCHS[#All],3,FALSE)","v":"15:00:00"},15,{"$f":"\"Groupe \"&VLOOKUP($I22,TABLEAU_TEAMS[[#All],[TEAM]:[GROUP_INITIAL_RANK]],2,FALSE)","v":"Groupe H"},1.38,3.9,8,{"$f":"VLOOKUP($D22,TABLEAU_MATCHS[#All],4,FALSE)","v":"Colombie"},null,null,{"$f":"VLOOKUP($D22,TABLEAU_MATCHS[#All],5,FALSE)","v":"Japon"},null,{"$f":"IF(OR(ISBLANK(RESULTATS!J22),ISBLANK(J22)),\"\",IF(AND('Kévin Sonilhac'!J22=RESULTATS!J22,'Kévin Sonilhac'!M22=RESULTATS!M22),3,IF(OR(AND('Kévin Sonilhac'!J22>'Kévin Sonilhac'!M22,RESULTATS!J22>RESULTATS!M22),AND('Kévin Sonilhac'!J22<'Kévin Sonilhac'!M22,RESULTATS!J22<RESULTATS!M22),AND('Kévin Sonilhac'!J22='Kévin Sonilhac'!M22,RESULTATS!J22=RESULTATS!M22)),1,0)))","v":""},null,null,null,"00000France",0,1,"France",{"$f":"SUMPRODUCT((Teams1=U22)*(Teams1_Score<>\"\"))+SUMPRODUCT((Teams2=U22)*(Teams2_Score<>\"\"))","v":0},{"$f":"SUMPRODUCT((Teams1=U22)*(Teams1_Score>Teams2_Score))+SUMPRODUCT((Teams2=U22)*(Teams2_Score>Teams1_Score))","v":0},{"$f":"SUMPRODUCT((Teams1=U22)*(Teams1_Score=Teams2_Score)*(Teams1_Score<>\"\"))+SUMPRODUCT((Teams2=U22)*(Teams2_Score=Teams1_Score)*(Teams2_Score<>\"\"))","v":0},{"$f":"SUMPRODUCT((Teams1=U22)*(Teams1_Score<Teams2_Score))+SUMPRODUCT((Teams2=U22)*(Teams2_Score<Teams1_Score))","v":0},{"$f":"SUMPRODUCT((Teams1=U22)*(Teams1_Score))+SUMPRODUCT((Teams2=U22)*(Teams2_Score))","v":0},{"$f":"SUMPRODUCT((Teams1=U22)*(Teams2_Score))+SUMPRODUCT((Teams2=U22)*(Teams1_Score))","v":0},0,0]
[null,{"$f":"VLOOKUP($D23,TABLEAU_MATCHS[#All],2,FALSE)","v":"2018-06-19"},{"$f":"VLOOKUP($D23,TABLEAU_MATCHS[#All],3,FALSE)","v":"18:00:00"},16,{"$f":"\"Groupe \"&VLOOKUP($I23,TABLEAU_TEAMS[[#All],[TEAM]:[GROUP_INITIAL_RANK]],2,FALSE)","v":"Groupe H"},2.0499999999999998,2.9,3.5,{"$f":"VLOOKUP($D23,TABLEAU_MATCHS[#All],4,FALSE)","v":"Pologne"},null,null,{"$f":"VLOOKUP($D23,TABLEAU_MATCHS[#All],5,FALSE)","v":"Sénégal"},null,{"$f":"IF(OR(ISBLANK(RESULTATS!J23),ISBLANK(J23)),\"\",IF(AND('Kévin Sonilhac'!J23=RESULTATS!J23,'Kévin Sonilhac'!M23=RESULTATS!M23),3,IF(OR(AND('Kévin Sonilhac'!J23>'Kévin Sonilhac'!M23,RESULTATS!J23>RESULTATS!M23),AND('Kévin Sonilhac'!J23<'Kévin Sonilhac'!M23,RESULTATS!J23<RESULTATS!M23),AND('Kévin Sonilhac'!J23='Kévin Sonilhac'!M23,RESULTATS!J23=RESULTATS!M23)),1,0)))","v":""},null,null,null,"00000Danemark",0,1,"Danemark",{"$f":"SUMPRODUCT((Teams1=U23)*(Teams1_Score<>\"\"))+SUMPRODUCT((Teams2=U23)*(Teams2_Score<>\"\"))","v":0},{"$f":"SUMPRODUCT((Teams1=U23)*(Teams1_Score>Teams2_Score))+SUMPRODUCT((Teams2=U23)*(Teams2_Score>Teams1_Score))","v":0},{"$f":"SUMPRODUCT((Teams1=U23)*(Teams1_Score=Teams2_Score)*(Teams1_Score<>\"\"))+SUMPRODUCT((Teams2=U23)*(Teams2_Score=Teams1_Score)*(Teams2_Score<>\"\"))","v":0},{"$f":"SUMPRODUCT((Teams1=U23)*(Teams1_Score<Teams2_Score))+SUMPRODUCT((Teams2=U23)*(Teams2_Score<Teams1_Score))","v":0},{"$f":"SUMPRODUCT((Teams1=U23)*(Teams1_Score))+SUMPRODUCT((Teams2=U23)*(Teams2_Score))","v":0},{"$f":"SUMPRODUCT((Teams1=U23)*(Teams2_Score))+SUMPRODUCT((Teams2=U23)*(Teams1_Score))","v":0},0,0,null,null,"Date","Finale",null,null,"Buts",null,"Pen",null,null,null,"Buts",null,"Pen"]
[null,{"$f":"VLOOKUP($D24,TABLEAU_MATCHS[#All],2,FALSE)","v":"2018-06-19"},{"$f":"VLOOKUP($D24,TABLEAU_MATCHS[#All],3,FALSE)","v":"21:00:00"},17,{"$f":"\"Groupe \"&VLOOKUP($I24,TABLEAU_TEAMS[[#All],[TEAM]:[GROUP_INITIAL_RANK]],2,FALSE)","v":"Groupe A"},1.26,4.8,9,{"$f":"VLOOKUP($D24,TABLEAU_MATCHS[#All],4,FALSE)","v":"Russie"},null,null,{"$f":"VLOOKUP($D24,TABLEAU_MATCHS[#All],5,FALSE)","v":"Egypte"},null,{"$f":"IF(OR(ISBLANK(RESULTATS!J24),ISBLANK(J24)),\"\",IF(AND('Kévin Sonilhac'!J24=RESULTATS!J24,'Kévin Sonilhac'!M24=RESULTATS!M24),3,IF(OR(AND('Kévin Sonilhac'!J24>'Kévin Sonilhac'!M24,RESULTATS!J24>RESULTATS!M24),AND('Kévin Sonilhac'!J24<'Kévin Sonilhac'!M24,RESULTATS!J24<RESULTATS!M24),AND('Kévin Sonilhac'!J24='Kévin Sonilhac'!M24,RESULTATS!J24=RESULTATS!M24)),1,0)))","v":""},null,null,null,"00000Australie",0,1,"Australie",{"$f":"SUMPRODUCT((Teams1=U24)*(Teams1_Score<>\"\"))+SUMPRODUCT((Teams2=U24)*(Teams2_Score<>\"\"))","v":0},{"$f":"SUMPRODUCT((Teams1=U24)*(Teams1_Score>Teams2_Score))+SUMPRODUCT((Teams2=U24)*(Teams2_Score>Teams1_Score))","v":0},{"$f":"SUMPRODUCT((Teams1=U24)*(Teams1_Score=Teams2_Score)*(Teams1_Score<>\"\"))+SUMPRODUCT((Teams2=U24)*(Teams2_Score=Teams1_Score)*(Teams2_Score<>\"\"))","v":0},{"$f":"SUMPRODUCT((Teams1=U24)*(Teams1_Score<Teams2_Score))+SUMPRODUCT((Teams2=U24)*(Teams2_Score<Teams1_Score))","v":0},{"$f":"SUMPRODUCT((Teams1=U24)*(Teams1_Score))+SUMPRODUCT((Teams2=U24)*(Teams2_Score))","v":0},{"$f":"SUMPRODUCT((Teams1=U24)*(Teams2_Score))+SUMPRODUCT((Teams2=U24)*(Teams1_Score))","v":0},0,0]
[null,{"$f":"VLOOKUP($D25,TABLEAU_MATCHS[#All],2,FALSE)","v":"2018-06-20"},{"$f":"VLOOKUP($D25,TABLEAU_MATCHS[#All],3,FALSE)","v":"18:00:00"},18,{"$f":"\"Groupe \"&VLOOKUP($I25,TABLEAU_TEAMS[[#All],[TEAM]:[GROUP_INITIAL_RANK]],2,FALSE)","v":"Groupe A"},3.5,3,2,{"$f":"VLOOKUP($D25,TABLEAU_MATCHS[#All],4,FALSE)","v":"Uruguay"},null,null,{"$f":"VLOOKUP($D25,TABLEAU_MATCHS[#All],5,FALSE)","v":"Arabie Saoudite"},null,{"$f":"IF(OR(ISBLANK(RESULTATS!J25),ISBLANK(J25)),\"\",IF(AND('Kévin Sonilhac'!J25=RESULTATS!J25,'Kévin Sonilhac'!M25=RESULTATS!M25),3,IF(OR(AND('Kévin Sonilhac'!J25>'Kévin Sonilhac'!M25,RESULTATS!J25>RESULTATS!M25),AND('Kévin Sonilhac'!J25<'Kévin Sonilhac'!M25,RESULTATS!J25<RESULTATS!M25),AND('Kévin Sonilhac'!J25='Kévin Sonilhac'!M25,RESULTATS!J25=RESULTATS!M25)),1,0)))","v":""},null,null,null,null,null,null,null,null,null,null,null,null,null,null,null,null,null,"2018-07-15",null,{"$f":"+IF(AJ33<>\"\",IF(AI33>AO33,AH33,AN33),\"Vainqueur 1\")","v":"Vainqueur 1"},{"$f":"AJ25*10+AL25","v":0},null,{"$f":"IF(LEFT(AH25,5)<>\"Vainq\",COUNTIF(RESULTATS!$AG$10:$AM$10,AH25),0)","v":0},null,null,{"$f":"+IF(AJ34<>\"\",IF(AI34>AO34,AH34,AN34),\"Vainqueur 2\")","v":"Vainqueur 2"},{"$f":"AP25*10+AR25","v":0},null,{"$f":"IF(LEFT(AN25,5)<>\"Vainq\",COUNTIF(RESULTATS!$AG$10:$AM$10,AN25),0)","v":0},null,null,{"$f":"IF(AJ25<>\"\",IF(AI25>AO25,AH25,AN25),\"\")","v":""}]
[null,{"$f":"VLOOKUP($D26,TABLEAU_MATCHS[#All],2,FALSE)","v":"2018-06-20"},{"$f":"VLOOKUP($D26,TABLEAU_MATCHS[#All],3,FALSE)","v":"15:00:00"},19,{"$f":"\"Groupe \"&VLOOKUP($I26,TABLEAU_TEAMS[[#All],[TEAM]:[GROUP_INITIAL_RANK]],2,FALSE)","v":"Groupe B"},1.66,3.35,4.8,{"$f":"VLOOKUP($D26,TABLEAU_MATCHS[#All],4,FALSE)","v":"Portugal"},null,null,{"$f":"VLOOKUP($D26,TABLEAU_MATCHS[#All],5,FALSE)","v":"Maroc"},null,{"$f":"IF(OR(ISBLANK(RESULTATS!J26),ISBLANK(J26)),\"\",IF(AND('Kévin Sonilhac'!J26=RESULTATS!J26,'Kévin Sonilhac'!M26=RESULTATS!M26),3,IF(OR(AND('Kévin Sonilhac'!J26>'Kévin Sonilhac'!M26,RESULTATS!J26>RESULTATS!M26),AND('Kévin Sonilhac'!J26<'Kévin Sonilhac'!M26,RESULTATS!J26<RESULTATS!M26),AND('Kévin Sonilhac'!J26='Kévin Sonilhac'!M26,RESULTATS!J26=RESULTATS!M26)),1,0)))","v":""},null,null,null,null,null,"Rg","Groupe D","MJ","G","N","P","BP","BC","+/-","Pts"]
[null,{"$f":"VLOOKUP($D27,TABLEAU_MATCHS[#All],2,FALSE)","v":"2018-06-20"},{"$f":"VLOOKUP($D27,TABLEAU_MATCHS[#All],3,FALSE)","v":"21:00:00"},20,{"$f":"\"Groupe \"&VLOOKUP($I27,TABLEAU_TEAMS[[#All],[TEAM]:[GROUP_INITIAL_RANK]],2,FALSE)","v":"Groupe B"},8.5,4.7,1.28,{"$f":"VLOOKUP($D27,TABLEAU_MATCHS[#All],4,FALSE)","v":"RI Iran"},null,null,{"$f":"VLOOKUP($D27,TABLEAU_MATCHS[#All],5,FALSE)","v":"Espagne"},null,{"$f":"IF(OR(ISBLANK(RESULTATS!J27),ISBLANK(J27)),\"\",IF(AND('Kévin Sonilhac'!J27=RESULTATS!J27,'Kévin Sonilhac'!M27=RESULTATS!M27),3,IF(OR(AND('Kévin Sonilhac'!J27>'Kévin Sonilhac'!M27,RESULTATS!J27>RESULTATS!M27),AND('Kévin Sonilhac'!J27<'Kévin Sonilhac'!M27,RESULTATS!J27<RESULTATS!M27),AND('Kévin Sonilhac'!J27='Kévin Sonilhac'!M27,RESULTATS!J27=RESULTATS!M27)),1,0)))","v":""},null,null,null,{"$f":"INDEX($R78:$R81,MATCH(SMALL(COUNTIF($R78:$R81,\">=\"&$R78:$R81),ROW(INDIRECT(\"1:\"&ROWS($R78:$R81)))),COUNTIF($R78:$R81,\">=\"&$R78:$R81),0))","v":"00000Nigeria"},{"$f":"INDEX($S78:$S81,MATCH(SMALL(COUNTIF($R78:$R81,\">=\"&$R78:$R81),ROW(INDIRECT(\"1:\"&ROWS($R78:$R81)))),COUNTIF($R78:$R81,\">=\"&$R78:$R81),0))","v":0},{"$f":"INDEX($T78:$T81,MATCH(SMALL(COUNTIF($R78:$R81,\">=\"&$R78:$R81),ROW(INDIRECT(\"1:\"&ROWS($R78:$R81)))),COUNTIF($R78:$R81,\">=\"&$R78:$R81),0))","v":1},{"$f":"INDEX($U78:$U81,MATCH(SMALL(COUNTIF($R78:$R81,\">=\"&$R78:$R81),ROW(INDIRECT(\"1:\"&ROWS($R78:$R81)))),COUNTIF($R78:$R81,\">=\"&$R78:$R81),0))","v":"Nigeria"},{"$f":"SUMPRODUCT((Teams1=U27)*(Teams1_Score<>\"\"))+SUMPRODUCT((Teams2=U27)*(Teams2_Score<>\"\"))","v":0},{"$f":"SUMPRODUCT((Teams1=U27)*(Teams1_Score>Teams2_Score))+SUMPRODUCT((Teams2=U27)*(Teams2_Score>Teams1_Score))","v":0},{"$f":"SUMPRODUCT((Teams1=U27)*(Teams1_Score=Teams2_Score)*(Teams1_Score<>\"\"))+SUMPRODUCT((Teams2=U27)*(Teams2_Score=Teams1_Score)*(Teams2_Score<>\"\"))","v":0},{"$f":"SUMPRODUCT((Teams1=U27)*(Teams1_Score<Teams2_Score))+SUMPRODUCT((Teams2=U27)*(Teams2_Score<Teams1_Score))","v":0},{"$f":"SUMPRODUCT((Teams1=U27)*(Teams1_Score))+SUMPRODUCT((Teams2=U27)*(Teams2_Score))","v":0},{"$f":"SUMPRODUCT((Teams1=U27)*(Teams2_Score))+SUMPRODUCT((Teams2=U27)*(Teams1_Score))","v":0},{"$f":"Z27-AA27","v":0},{"$f":"3*W27+X27","v":0},null,null,"Date","Petite Finale",null,null,"Buts",null,"Pen",null,null,null,"Buts",null,"Pen"]
[null,{"$f":"VLOOKUP($D28,TABLEAU_MATCHS[#All],2,FALSE)","v":"2018-06-21"},{"$f":"VLOOKUP($D28,TABLEAU_MATCHS[#All],3,FALSE)","v":"16:00:00"},21,{"$f":"\"Groupe \"&VLOOKUP($I28,TABLEAU_TEAMS[[#All],[TEAM]:[GROUP_INITIAL_RANK]],2,FALSE)","v":"Groupe C"},1.85,3,4,{"$f":"VLOOKUP($D28,TABLEAU_MATCHS[#All],4,FALSE)","v":"Danemark"},null,null,{"$f":"VLOOKUP($D28,TABLEAU_MATCHS[#All],5,FALSE)","v":"Australie"},null,{"$f":"IF(OR(ISBLANK(RESULTATS!J28),ISBLANK(J28)),\"\",IF(AND('Kévin Sonilhac'!J28=RESULTATS!J28,'Kévin Sonilhac'!M28=RESULTATS!M28),3,IF(OR(AND('Kévin Sonilhac'!J28>'Kévin Sonilhac'!M28,RESULTATS!J28>RESULTATS!M28),AND('Kévin Sonilhac'!J28<'Kévin Sonilhac'!M28,RESULTATS!J28<RESULTATS!M28),AND('Kévin Sonilhac'!J28='Kévin Sonilhac'!M28,RESULTATS!J28=RESULTATS!M28)),1,0)))","v":""},null,null,null,"00000Islande",0,1,"Islande",{"$f":"SUMPRODUCT((Teams1=U28)*(Teams1_Score<>\"\"))+SUMPRODUCT((Teams2=U28)*(Teams2_Score<>\"\"))","v":0},{"$f":"SUMPRODUCT((Teams1=U28)*(Teams1_Score>Teams2_Score))+SUMPRODUCT((Teams2=U28)*(Teams2_Score>Teams1_Score))","v":0},{"$f":"SUMPRODUCT((Teams1=U28)*(Teams1_Score=Teams2_Score)*(Teams1_Score<>\"\"))+SUMPRODUCT((Teams2=U28)*(Teams2_Score=Teams1_Score)*(Teams2_Score<>\"\"))","v":0},{"$f":"SUMPRODUCT((Teams1=U28)*(Teams1_Score<Teams2_Score))+SUMPRODUCT((Teams2=U28)*(Teams2_Score<Teams1_Score))","v":0},{"$f":"SUMPRODUCT((Teams1=U28)*(Teams1_Score))+SUMPRODUCT((Teams2=U28)*(Teams2_Score))","v":0},{"$f":"SUMPRODUCT((Teams1=U28)*(Teams2_Score))+SUMPRODUCT((Teams2=U28)*(Teams1_Score))","v":0},0,0]
[null,{"$f":"VLOOKUP($D29,TABLEAU_MATCHS[#All],2,FALSE)","v":"2018-06-21"},{"$f":"VLOOKUP($D29,TABLEAU_MATCHS[#All],3,FALSE)","v":"20:00:00"},22,{"$f":"\"Groupe \"&VLOOKUP($I29,TABLEAU_TEAMS[[#All],[TEAM]:[GROUP_INITIAL_RANK]],2,FALSE)","v":"Groupe C"},2.2999999999999998,3,2.9,{"$f":"VLOOKUP($D29,TABLEAU_MATCHS[#All],4,FALSE)","v":"France"},null,null,{"$f":"VLOOKUP($D29,TABLEAU_MATCHS[#All],5,FALSE)","v":"Pérou"},null,{"$f":"IF(OR(ISBLANK(RESULTATS!J29),ISBLANK(J29)),\"\",IF(AND('Kévin Sonilhac'!J29=RESULTATS!J29,'Kévin Sonilhac'!M29=RESULTATS!M29),3,IF(OR(AND('Kévin Sonilhac'!J29>'Kévin Sonilhac'!M29,RESULTATS!J29>RESULTATS!M29),AND('Kévin Sonilhac'!J29<'Kévin Sonilhac'!M29,RESULTATS!J29<RESULTATS!M29),AND('Kévin Sonilhac'!J29='Kévin Sonilhac'!M29,RESULTATS!J29=RESULTATS!M29)),1,0)))","v":""},null,null,null,"00000Croatie",0,1,"Croatie",{"$f":"SUMPRODUCT((Teams1=U29)*(Teams1_Score<>\"\"))+SUMPRODUCT((Teams2=U29)*(Teams2_Score<>\"\"))","v":0},{"$f":"SUMPRODUCT((Teams1=U29)*(Teams1_Score>Teams2_Score))+SUMPRODUCT((Teams2=U29)*(Teams2_Score>Teams1_Score))","v":0},{"$f":"SUMPRODUCT((Teams1=U29)*(Teams1_Score=Teams2_Score)*(Teams1_Score<>\"\"))+SUMPRODUCT((Teams2=U29)*(Teams2_Score=Teams1_Score)*(Teams2_Score<>\"\"))","v":0},{"$f":"SUMPRODUCT((Teams1=U29)*(Teams1_Score<Teams2_Score))+SUMPRODUCT((Teams2=U29)*(Teams2_Score<Teams1_Score))","v":0},{"$f":"SUMPRODUCT((Teams1=U29)*(Teams1_Score))+SUMPRODUCT((Teams2=U29)*(Teams2_Score))","v":0},{"$f":"SUMPRODUCT((Teams1=U29)*(Teams2_Score))+SUMPRODUCT((Teams2=U29)*(Teams1_Score))","v":0},0,0,null,null,"2018-07-14",null,{"$f":"+IF(AJ33<>\"\",IF(AI33>AO33,AN33,AH33),\"Perdant 1\")","v":"Perdant 1"},{"$f":"AJ29*10+AL29","v":0},null,null,null,null,{"$f":"+IF(AJ34<>\"\",IF(AI34>AO34,AN34,AH34),\"Perdant 2\")","v":"Perdant 2"},{"$f":"AP29*10+AR29","v":0}]
[null,{"$f":"VLOOKUP($D30,TABLEAU_MATCHS[#All],2,FALSE)","v":"2018-06-21"},{"$f":"VLOOKUP($D30,TABLEAU_MATCHS[#All],3,FALSE)","v":"21:00:00"},23,{"$f":"\"Groupe \"&VLOOKUP($I30,TABLEAU_TEAMS[[#All],[TEAM]:[GROUP_INITIAL_RANK]],2,FALSE)","v":"Groupe D"},2.4,3,2.8,{"$f":"VLOOKUP($D30,TABLEAU_MATCHS[#All],4,FALSE)","v":"Argentine"},null,null,{"$f":"VLOOKUP($D30,TABLEAU_MATCHS[#All],5,FALSE)","v":"Croatie"},null,{"$f":"IF(OR(ISBLANK(RESULTATS!J30),ISBLANK(J30)),\"\",IF(AND('Kévin Sonilhac'!J30=RESULTATS!J30,'Kévin Sonilhac'!M30=RESULTATS!M30),3,IF(OR(AND('Kévin Sonilhac'!J30>'Kévin Sonilhac'!M30,RESULTATS!J30>RESULTATS!M30),AND('Kévin Sonilhac'!J30<'Kévin Sonilhac'!M30,RESULTATS!J30<RESULTATS!M30),AND('Kévin Sonilhac'!J30='Kévin Sonilhac'!M30,RESULTATS!J30=RESULTATS!M30)),1,0)))","v":""},null,null,null,"00000Argentine",0,1,"Argentine",{"$f":"SUMPRODUCT((Teams1=U30)*(Teams1_Score<>\"\"))+SUMPRODUCT((Teams2=U30)*(Teams2_Score<>\"\"))","v":0},{"$f":"SUMPRODUCT((Teams1=U30)*(Teams1_Score>Teams2_Score))+SUMPRODUCT((Teams2=U30)*(Teams2_Score>Teams1_Score))","v":0},{"$f":"SUMPRODUCT((Teams1=U30)*(Teams1_Score=Teams2_Score)*(Teams1_Score<>\"\"))+SUMPRODUCT((Teams2=U30)*(Teams2_Score=Teams1_Score)*(Teams2_Score<>\"\"))","v":0},{"$f":"SUMPRODUCT((Teams1=U30)*(Teams1_Score<Teams2_Score))+SUMPRODUCT((Teams2=U30)*(Teams2_Score<Teams1_Score))","v":0},{"$f":"SUMPRODUCT((Teams1=U30)*(Teams1_Score))+SUMPRODUCT((Teams2=U30)*(Teams2_Score))","v":0},{"$f":"SUMPRODUCT((Teams1=U30)*(Teams2_Score))+SUMPRODUCT((Teams2=U30)*(Teams1_Score))","v":0},0,0]
[null,{"$f":"VLOOKUP($D31,TABLEAU_MATCHS[#All],2,FALSE)","v":"2018-06-22"},{"$f":"VLOOKUP($D31,TABLEAU_MATCHS[#All],3,FALSE)","v":"18:00:00"},24,{"$f":"\"Groupe \"&VLOOKUP($I31,TABLEAU_TEAMS[[#All],[TEAM]:[GROUP_INITIAL_RANK]],2,FALSE)","v":"Groupe D"},1.26,4.5999999999999996,9.5,{"$f":"VLOOKUP($D31,TABLEAU_MATCHS[#All],4,FALSE)","v":"Nigeria"},null,null,{"$f":"VLOOKUP($D31,TABLEAU_MATCHS[#All],5,FALSE)","v":"Islande"},null,{"$f":"IF(OR(ISBLANK(RESULTATS!J31),ISBLANK(J31)),\"\",IF(AND('Kévin Sonilhac'!J31=RESULTATS!J31,'Kévin Sonilhac'!M31=RESULTATS!M31),3,IF(OR(AND('Kévin Sonilhac'!J31>'Kévin Sonilhac'!M31,RESULTATS!J31>RESULTATS!M31),AND('Kévin Sonilhac'!J31<'Kévin Sonilhac'!M31,RESULTATS!J31<RESULTATS!M31),AND('Kévin Sonilhac'!J31='Kévin Sonilhac'!M31,RESULTATS!J31=RESULTATS!M31)),1,0)))","v":""},null,null,null,null,null,null,null,null,null,null,null,null,null,null,null,null,null,"Date","Demi Finale",null,null,"Buts",null,"Pen",null,null,null,"Buts",null,"Pen"]
[null,{"$f":"VLOOKUP($D32,TABLEAU_MATCHS[#All],2,FALSE)","v":"2018-06-22"},{"$f":"VLOOKUP($D32,TABLEAU_MATCHS[#All],3,FALSE)","v":"15:00:00"},25,{"$f":"\"Groupe \"&VLOOKUP($I32,TABLEAU_TEAMS[[#All],[TEAM]:[GROUP_INITIAL_RANK]],2,FALSE)","v":"Groupe E"},3.5,2.95,2.1,{"$f":"VLOOKUP($D32,TABLEAU_MATCHS[#All],4,FALSE)","v":"Brésil"},null,null,{"$f":"VLOOKUP($D32,TABLEAU_MATCHS[#All],5,FALSE)","v":"Costa Rica"},null,{"$f":"IF(OR(ISBLANK(RESULTATS!J32),ISBLANK(J32)),\"\",IF(AND('Kévin Sonilhac'!J32=RESULTATS!J32,'Kévin Sonilhac'!M32=RESULTATS!M32),3,IF(OR(AND('Kévin Sonilhac'!J32>'Kévin Sonilhac'!M32,RESULTATS!J32>RESULTATS!M32),AND('Kévin Sonilhac'!J32<'Kévin Sonilhac'!M32,RESULTATS!J32<RESULTATS!M32),AND('Kévin Sonilhac'!J32='Kévin Sonilhac'!M32,RESULTATS!J32=RESULTATS!M32)),1,0)))","v":""},null,null,null,null,null,"Rg","Groupe E","MJ","G","N","P","BP","BC","+/-","Pts"]
[null,{"$f":"VLOOKUP($D33,TABLEAU_MATCHS[#All],2,FALSE)","v":"2018-06-22"},{"$f":"VLOOKUP($D33,TABLEAU_MATCHS[#All],3,FALSE)","v":"20:00:00"},26,{"$f":"\"Groupe \"&VLOOKUP($I33,TABLEAU_TEAMS[[#All],[TEAM]:[GROUP_INITIAL_RANK]],2,FALSE)","v":"Groupe E"},4.8,3.25,1.62,{"$f":"VLOOKUP($D33,TABLEAU_MATCHS[#All],4,FALSE)","v":"Serbie"},null,null,{"$f":"VLOOKUP($D33,TABLEAU_MATCHS[#All],5,FALSE)","v":"Suisse"},null,{"$f":"IF(OR(ISBLANK(RESULTATS!J33),ISBLANK(J33)),\"\",IF(AND('Kévin Sonilhac'!J33=RESULTATS!J33,'Kévin Sonilhac'!M33=RESULTATS!M33),3,IF(OR(AND('Kévin Sonilhac'!J33>'Kévin Sonilhac'!M33,RESULTATS!J33>RESULTATS!M33),AND('Kévin Sonilhac'!J33<'Kévin Sonilhac'!M33,RESULTATS!J33<RESULTATS!M33),AND('Kévin Sonilhac'!J33='Kévin Sonilhac'!M33,RESULTATS!J33=RESULTATS!M33)),1,0)))","v":""},null,null,null,{"$f":"INDEX($R84:$R87,MATCH(SMALL(COUNTIF($R84:$R87,\">=\"&$R84:$R87),ROW(INDIRECT(\"1:\"&ROWS($R84:$R87)))),COUNTIF($R84:$R87,\">=\"&$R84:$R87),0))","v":"00000Suisse"},{"$f":"INDEX($S84:$S87,MATCH(SMALL(COUNTIF($R84:$R87,\">=\"&$R84:$R87),ROW(INDIRECT(\"1:\"&ROWS($R84:$R87)))),COUNTIF($R84:$R87,\">=\"&$R84:$R87),0))","v":0},{"$f":"INDEX($T84:$T87,MATCH(SMALL(COUNTIF($R84:$R87,\">=\"&$R84:$R87),ROW(INDIRECT(\"1:\"&ROWS($R84:$R87)))),COUNTIF($R84:$R87,\">=\"&$R84:$R87),0))","v":1},{"$f":"INDEX($U84:$U87,MATCH(SMALL(COUNTIF($R84:$R87,\">=\"&$R84:$R87),ROW(INDIRECT(\"1:\"&ROWS($R84:$R87)))),COUNTIF($R84:$R87,\">=\"&$R84:$R87),0))","v":"Suisse"},{"$f":"SUMPRODUCT((Teams1=U33)*(Teams1_Score<>\"\"))+SUMPRODUCT((Teams2=U33)*(Teams2_Score<>\"\"))","v":0},{"$f":"SUMPRODUCT((Teams1=U33)*(Teams1_Score>Teams2_Score))+SUMPRODUCT((Teams2=U33)*(Teams2_Score>Teams1_Score))","v":0},{"$f":"SUMPRODUCT((Teams1=U33)*(Teams1_Score=Teams2_Score)*(Teams1_Score<>\"\"))+SUMPRODUCT((Teams2=U33)*(Teams2_Score=Teams1_Score)*(Teams2_Score<>\"\"))","v":0},{"$f":"SUMPRODUCT((Teams1=U33)*(Teams1_Score<Teams2_Score))+SUMPRODUCT((Teams2=U33)*(Teams2_Score<Teams1_Score))","v":0},{"$f":"SUMPRODUCT((Teams1=U33)*(Teams1_Score))+SUMPRODUCT((Teams2=U33)*(Teams2_Score))","v":0},{"$f":"SUMPRODUCT((Teams1=U33)*(Teams2_Score))+SUMPRODUCT((Teams2=U33)*(Teams1_Score))","v":0},{"$f":"Z33-AA33","v":0},{"$f":"3*W33+X33","v":0},null,null,"2018-07-10",1,{"$f":"+IF(AJ38<>\"\",IF(AI38>AO38,AH38,AN38),\"Vainqueur A\")","v":"Vainqueur A"},{"$f":"AJ33*10+AL33","v":0},null,{"$f":"IF(LEFT(AH33,5)<>\"Vainq\",COUNTIF(RESULTATS!$AG$18:$AM$19,AH33),0)","v":0},null,null,{"$f":"+IF(AJ40<>\"\",IF(AI40>AO40,AH40,AN40),\"Vainqueur C\")","v":"Vainqueur C"},{"$f":"AP33*10+AR33","v":0},null,{"$f":"IF(LEFT(AN33,5)<>\"Vainq\",COUNTIF(RESULTATS!$AG$18:$AM$19,AN33),0)","v":0}]
[null,{"$f":"VLOOKUP($D34,TABLEAU_MATCHS[#All],2,FALSE)","v":"2018-06-23"},{"$f":"VLOOKUP($D34,TABLEAU_MATCHS[#All],3,FALSE)","v":"18:00:00"},27,{"$f":"\"Groupe \"&VLOOKUP($I34,TABLEAU_TEAMS[[#All],[TEAM]:[GROUP_INITIAL_RANK]],2,FALSE)","v":"Groupe F"},1.1200000000000001,6.5,15,{"$f":"VLOOKUP($D34,TABLEAU_MATCHS[#All],4,FALSE)","v":"République de Corée"},null,null,{"$f":"VLOOKUP($D34,TABLEAU_MATCHS[#All],5,FALSE)","v":"Mexique"},null,{"$f":"IF(OR(ISBLANK(RESULTATS!J34),ISBLANK(J34)),\"\",IF(AND('Kévin Sonilhac'!J34=RESULTATS!J34,'Kévin Sonilhac'!M34=RESULTATS!M34),3,IF(OR(AND('Kévin Sonilhac'!J34>'Kévin Sonilhac'!M34,RESULTATS!J34>RESULTATS!M34),AND('Kévin Sonilhac'!J34<'Kévin Sonilhac'!M34,RESULTATS!J34<RESULTATS!M34),AND('Kévin Sonilhac'!J34='Kévin Sonilhac'!M34,RESULTATS!J34=RESULTATS!M34)),1,0)))","v":""},null,null,null,"00000Serbie",0,1,"Serbie",{"$f":"SUMPRODUCT((Teams1=U34)*(Teams1_Score<>\"\"))+SUMPRODUCT((Teams2=U34)*(Teams2_Score<>\"\"))","v":0},{"$f":"SUMPRODUCT((Teams1=U34)*(Teams1_Score>Teams2_Score))+SUMPRODUCT((Teams2=U34)*(Teams2_Score>Teams1_Score))","v":0},{"$f":"SUMPRODUCT((Teams1=U34)*(Teams1_Score=Teams2_Score)*(Teams1_Score<>\"\"))+SUMPRODUCT((Teams2=U34)*(Teams2_Score=Teams1_Score)*(Teams2_Score<>\"\"))","v":0},{"$f":"SUMPRODUCT((Teams1=U34)*(Teams1_Score<Teams2_Score))+SUMPRODUCT((Teams2=U34)*(Teams2_Score<Teams1_Score))","v":0},{"$f":"SUMPRODUCT((Teams1=U34)*(Teams1_Score))+SUMPRODUCT((Teams2=U34)*(Teams2_Score))","v":0},{"$f":"SUMPRODUCT((Teams1=U34)*(Teams2_Score))+SUMPRODUCT((Teams2=U34)*(Teams1_Score))","v":0},0,0,null,null,"2018-07-11",2,{"$f":"+IF(AJ39<>\"\",IF(AI39>AO39,AH39,AN39),\"Vainqueur B\")","v":"Vainqueur B"},0,null,{"$f":"IF(LEFT(AH34,5)<>\"Vainq\",COUNTIF(RESULTATS!$AG$18:$AM$19,AH34),0)","v":0},null,null,{"$f":"+IF(AJ41<>\"\",IF(AI41>AO41,AH41,AN41),\"Vainqueur D\")","v":"Vainqueur D"},0,null,{"$f":"IF(LEFT(AN34,5)<>\"Vainq\",COUNTIF(RESULTATS!$AG$18:$AM$19,AN34),0)","v":0}]
[null,{"$f":"VLOOKUP($D35,TABLEAU_MATCHS[#All],2,FALSE)","v":"2018-06-23"},{"$f":"VLOOKUP($D35,TABLEAU_MATCHS[#All],3,FALSE)","v":"21:00:00"},28,{"$f":"\"Groupe \"&VLOOKUP($I35,TABLEAU_TEAMS[[#All],[TEAM]:[GROUP_INITIAL_RANK]],2,FALSE)","v":"Groupe F"},2.8,2.95,2.4,{"$f":"VLOOKUP($D35,TABLEAU_MATCHS[#All],4,FALSE)","v":"Allemagne"},null,null,{"$f":"VLOOKUP($D35,TABLEAU_MATCHS[#All],5,FALSE)","v":"Suède"},null,{"$f":"IF(OR(ISBLANK(RESULTATS!J35),ISBLANK(J35)),\"\",IF(AND('Kévin Sonilhac'!J35=RESULTATS!J35,'Kévin Sonilhac'!M35=RESULTATS!M35),3,IF(OR(AND('Kévin Sonilhac'!J35>'Kévin Sonilhac'!M35,RESULTATS!J35>RESULTATS!M35),AND('Kévin Sonilhac'!J35<'Kévin Sonilhac'!M35,RESULTATS!J35<RESULTATS!M35),AND('Kévin Sonilhac'!J35='Kévin Sonilhac'!M35,RESULTATS!J35=RESULTATS!M35)),1,0)))","v":""},null,null,null,"00000Costa Rica",0,1,"Costa Rica",{"$f":"SUMPRODUCT((Teams1=U35)*(Teams1_Score<>\"\"))+SUMPRODUCT((Teams2=U35)*(Teams2_Score<>\"\"))","v":0},{"$f":"SUMPRODUCT((Teams1=U35)*(Teams1_Score>Teams2_Score))+SUMPRODUCT((Teams2=U35)*(Teams2_Score>Teams1_Score))","v":0},{"$f":"SUMPRODUCT((Teams1=U35)*(Teams1_Score=Teams2_Score)*(Teams1_Score<>\"\"))+SUMPRODUCT((Teams2=U35)*(Teams2_Score=Teams1_Score)*(Teams2_Score<>\"\"))","v":0},{"$f":"SUMPRODUCT((Teams1=U35)*(Teams1_Score<Teams2_Score))+SUMPRODUCT((Teams2=U35)*(Teams2_Score<Teams1_Score))","v":0},{"$f":"SUMPRODUCT((Teams1=U35)*(Teams1_Score))+SUMPRODUCT((Teams2=U35)*(Teams2_Score))","v":0},{"$f":"SUMPRODUCT((Teams1=U35)*(Teams2_Score))+SUMPRODUCT((Teams2=U35)*(Teams1_Score))","v":0},0,0,null,null,null,null,null,null,null,{"$f":"SUM(AK33:AK34)","v":0},null,null,null,null,null,{"$f":"SUM(AQ33:AQ34)","v":0}]
[null,{"$f":"VLOOKUP($D36,TABLEAU_MATCHS[#All],2,FALSE)","v":"2018-06-23"},{"$f":"VLOOKUP($D36,TABLEAU_MATCHS[#All],3,FALSE)","v":"15:00:00"},29,{"$f":"\"Groupe \"&VLOOKUP($I36,TABLEAU_TEAMS[[#All],[TEAM]:[GROUP_INITIAL_RANK]],2,FALSE)","v":"Groupe G"},1.36,4,7.5,{"$f":"VLOOKUP($D36,TABLEAU_MATCHS[#All],4,FALSE)","v":"Belgique"},null,null,{"$f":"VLOOKUP($D36,TABLEAU_MATCHS[#All],5,FALSE)","v":"Tunisie"},null,{"$f":"IF(OR(ISBLANK(RESULTATS!J36),ISBLANK(J36)),\"\",IF(AND('Kévin Sonilhac'!J36=RESULTATS!J36,'Kévin Sonilhac'!M36=RESULTATS!M36),3,IF(OR(AND('Kévin Sonilhac'!J36>'Kévin Sonilhac'!M36,RESULTATS!J36>RESULTATS!M36),AND('Kévin Sonilhac'!J36<'Kévin Sonilhac'!M36,RESULTATS!J36<RESULTATS!M36),AND('Kévin Sonilhac'!J36='Kévin Sonilhac'!M36,RESULTATS!J36=RESULTATS!M36)),1,0)))","v":""},null,null,null,"00000Brésil",0,1,"Brésil",{"$f":"SUMPRODUCT((Teams1=U36)*(Teams1_Score<>\"\"))+SUMPRODUCT((Teams2=U36)*(Teams2_Score<>\"\"))","v":0},{"$f":"SUMPRODUCT((Teams1=U36)*(Teams1_Score>Teams2_Score))+SUMPRODUCT((Teams2=U36)*(Teams2_Score>Teams1_Score))","v":0},{"$f":"SUMPRODUCT((Teams1=U36)*(Teams1_Score=Teams2_Score)*(Teams1_Score<>\"\"))+SUMPRODUCT((Teams2=U36)*(Teams2_Score=Teams1_Score)*(Teams2_Score<>\"\"))","v":0},{"$f":"SUMPRODUCT((Teams1=U36)*(Teams1_Score<Teams2_Score))+SUMPRODUCT((Teams2=U36)*(Teams2_Score<Teams1_Score))","v":0},{"$f":"SUMPRODUCT((Teams1=U36)*(Teams1_Score))+SUMPRODUCT((Teams2=U36)*(Teams2_Score))","v":0},{"$f":"SUMPRODUCT((Teams1=U36)*(Teams2_Score))+SUMPRODUCT((Teams2=U36)*(Teams1_Score))","v":0},0,0,null,null,"Date","Quart de Finale",null,null,"Buts",null,"Pen",null,null,null,"Buts",null,"Pen"]
[null,{"$f":"VLOOKUP($D37,TABLEAU_MATCHS[#All],2,FALSE)","v":"2018-06-24"},{"$f":"VLOOKUP($D37,TABLEAU_MATCHS[#All],3,FALSE)","v":"15:00:00"},30,{"$f":"\"Groupe \"&VLOOKUP($I37,TABLEAU_TEAMS[[#All],[TEAM]:[GROUP_INITIAL_RANK]],2,FALSE)","v":"Groupe G"},4.7,3.4,1.62,{"$f":"VLOOKUP($D37,TABLEAU_MATCHS[#All],4,FALSE)","v":"Angleterre"},null,null,{"$f":"VLOOKUP($D37,TABLEAU_MATCHS[#All],5,FALSE)","v":"Panama"},null,{"$f":"IF(OR(ISBLANK(RESULTATS!J37),ISBLANK(J37)),\"\",IF(AND('Kévin Sonilhac'!J37=RESULTATS!J37,'Kévin Sonilhac'!M37=RESULTATS!M37),3,IF(OR(AND('Kévin Sonilhac'!J37>'Kévin Sonilhac'!M37,RESULTATS!J37>RESULTATS!M37),AND('Kévin Sonilhac'!J37<'Kévin Sonilhac'!M37,RESULTATS!J37<RESULTATS!M37),AND('Kévin Sonilhac'!J37='Kévin Sonilhac'!M37,RESULTATS!J37=RESULTATS!M37)),1,0)))","v":""}]
[null,{"$f":"VLOOKUP($D38,TABLEAU_MATCHS[#All],2,FALSE)","v":"2018-06-24"},{"$f":"VLOOKUP($D38,TABLEAU_MATCHS[#All],3,FALSE)","v":"20:00:00"},31,{"$f":"\"Groupe \"&VLOOKUP($I38,TABLEAU_TEAMS[[#All],[TEAM]:[GROUP_INITIAL_RANK]],2,FALSE)","v":"Groupe H"},2.1,2.95,3.35,{"$f":"VLOOKUP($D38,TABLEAU_MATCHS[#All],4,FALSE)","v":"Japon"},null,null,{"$f":"VLOOKUP($D38,TABLEAU_MATCHS[#All],5,FALSE)","v":"Sénégal"},null,{"$f":"IF(OR(ISBLANK(RESULTATS!J38),ISBLANK(J38)),\"\",IF(AND('Kévin Sonilhac'!J38=RESULTATS!J38,'Kévin Sonilhac'!M38=RESULTATS!M38),3,IF(OR(AND('Kévin Sonilhac'!J38>'Kévin Sonilhac'!M38,RESULTATS!J38>RESULTATS!M38),AND('Kévin Sonilhac'!J38<'Kévin Sonilhac'!M38,RESULTATS!J38<RESULTATS!M38),AND('Kévin Sonilhac'!J38='Kévin Sonilhac'!M38,RESULTATS!J38=RESULTATS!M38)),1,0)))","v":""},null,null,null,null,null,"Rg","Groupe F","MJ","G","N","P","BP","BC","+/-","Pts",null,null,"2018-07-06","A",{"$f":"+IF(AJ45<>\"\",IF(AI45>AO45,AH45,AN45),\"Vainqueur 1\")","v":"Vainqueur 1"},{"$f":"AJ38*10+AL38","v":0},null,{"$f":"IF(LEFT(AH38,5)<>\"Vainq\",COUNTIF(RESULTATS!$AG$23:$AM$26,AH38),0)","v":0},null,null,{"$f":"+IF(AJ47<>\"\",IF(AI47>AO47,AH47,AN47),\"Vainqueur 3\")","v":"Vainqueur 3"},{"$f":"AP38*10+AR38","v":0},null,{"$f":"IF(LEFT(AN38,5)<>\"Vainq\",COUNTIF(RESULTATS!$AG$23:$AM$26,AN38),0)","v":0}]
[null,{"$f":"VLOOKUP($D39,TABLEAU_MATCHS[#All],2,FALSE)","v":"2018-06-24"},{"$f":"VLOOKUP($D39,TABLEAU_MATCHS[#All],3,FALSE)","v":"21:00:00"},32,{"$f":"\"Groupe \"&VLOOKUP($I39,TABLEAU_TEAMS[[#All],[TEAM]:[GROUP_INITIAL_RANK]],2,FALSE)","v":"Groupe H"},1.9,3,3.8,{"$f":"VLOOKUP($D39,TABLEAU_MATCHS[#All],4,FALSE)","v":"Pologne"},null,null,{"$f":"VLOOKUP($D39,TABLEAU_MATCHS[#All],5,FALSE)","v":"Colombie"},null,{"$f":"IF(OR(ISBLANK(RESULTATS!J39),ISBLANK(J39)),\"\",IF(AND('Kévin Sonilhac'!J39=RESULTATS!J39,'Kévin Sonilhac'!M39=RESULTATS!M39),3,IF(OR(AND('Kévin Sonilhac'!J39>'Kévin Sonilhac'!M39,RESULTATS!J39>RESULTATS!M39),AND('Kévin Sonilhac'!J39<'Kévin Sonilhac'!M39,RESULTATS!J39<RESULTATS!M39),AND('Kévin Sonilhac'!J39='Kévin Sonilhac'!M39,RESULTATS!J39=RESULTATS!M39)),1,0)))","v":""},null,null,null,{"$f":"INDEX($R90:$R93,MATCH(SMALL(COUNTIF($R90:$R93,\">=\"&$R90:$R93),ROW(INDIRECT(\"1:\"&ROWS($R90:$R93)))),COUNTIF($R90:$R93,\">=\"&$R90:$R93),0))","v":"00000Suède"},{"$f":"INDEX($S90:$S93,MATCH(SMALL(COUNTIF($R90:$R93,\">=\"&$R90:$R93),ROW(INDIRECT(\"1:\"&ROWS($R90:$R93)))),COUNTIF($R90:$R93,\">=\"&$R90:$R93),0))","v":0},{"$f":"INDEX($T90:$T93,MATCH(SMALL(COUNTIF($R90:$R93,\">=\"&$R90:$R93),ROW(INDIRECT(\"1:\"&ROWS($R90:$R93)))),COUNTIF($R90:$R93,\">=\"&$R90:$R93),0))","v":1},{"$f":"INDEX($U90:$U93,MATCH(SMALL(COUNTIF($R90:$R93,\">=\"&$R90:$R93),ROW(INDIRECT(\"1:\"&ROWS($R90:$R93)))),COUNTIF($R90:$R93,\">=\"&$R90:$R93),0))","v":"Suède"},{"$f":"SUMPRODUCT((Teams1=U39)*(Teams1_Score<>\"\"))+SUMPRODUCT((Teams2=U39)*(Teams2_Score<>\"\"))","v":0},{"$f":"SUMPRODUCT((Teams1=U39)*(Teams1_Score>Teams2_Score))+SUMPRODUCT((Teams2=U39)*(Teams2_Score>Teams1_Score))","v":0},{"$f":"SUMPRODUCT((Teams1=U39)*(Teams1_Score=Teams2_Score)*(Teams1_Score<>\"\"))+SUMPRODUCT((Teams2=U39)*(Teams2_Score=Teams1_Score)*(Teams2_Score<>\"\"))","v":0},{"$f":"SUMPRODUCT((Teams1=U39)*(Teams1_Score<Teams2_Score))+SUMPRODUCT((Teams2=U39)*(Teams2_Score<Teams1_Score))","v":0},{"$f":"SUMPRODUCT((Teams1=U39)*(Teams1_Score))+SUMPRODUCT((Teams2=U39)*(Teams2_Score))","v":0},{"$f":"SUMPRODUCT((Teams1=U39)*(Teams2_Score))+SUMPRODUCT((Teams2=U39)*(Teams1_Score))","v":0},{"$f":"Z39-AA39","v":0},{"$f":"3*W39+X39","v":0},null,null,"2018-07-07","B",{"$f":"+IF(AJ46<>\"\",IF(AI46>AO46,AH46,AN46),\"Vainqueur 2\")","v":"Vainqueur 2"},0,null,{"$f":"IF(LEFT(AH39,5)<>\"Vainq\",COUNTIF(RESULTATS!$AG$23:$AM$26,AH39),0)","v":0},null,null,{"$f":"+IF(AJ48<>\"\",IF(AI48>AO48,AH48,AN48),\"Vainqueur 4\")","v":"Vainqueur 4"},0,null,{"$f":"IF(LEFT(AN39,5)<>\"Vainq\",COUNTIF(RESULTATS!$AG$23:$AM$26,AN39),0)","v":0}]
[null,{"$f":"VLOOKUP($D40,TABLEAU_MATCHS[#All],2,FALSE)","v":"2018-06-25"},{"$f":"VLOOKUP($D40,TABLEAU_MATCHS[#All],3,FALSE)","v":"18:00:00"},33,{"$f":"\"Groupe \"&VLOOKUP($I40,TABLEAU_TEAMS[[#All],[TEAM]:[GROUP_INITIAL_RANK]],2,FALSE)","v":"Groupe A"},11,6.5,1.17,{"$f":"VLOOKUP($D40,TABLEAU_MATCHS[#All],4,FALSE)","v":"Uruguay"},null,null,{"$f":"VLOOKUP($D40,TABLEAU_MATCHS[#All],5,FALSE)","v":"Russie"},null,{"$f":"IF(OR(ISBLANK(RESULTATS!J40),ISBLANK(J40)),\"\",IF(AND('Kévin Sonilhac'!J40=RESULTATS!J40,'Kévin Sonilhac'!M40=RESULTATS!M40),3,IF(OR(AND('Kévin Sonilhac'!J40>'Kévin Sonilhac'!M40,RESULTATS!J40>RESULTATS!M40),AND('Kévin Sonilhac'!J40<'Kévin Sonilhac'!M40,RESULTATS!J40<RESULTATS!M40),AND('Kévin Sonilhac'!J40='Kévin Sonilhac'!M40,RESULTATS!J40=RESULTATS!M40)),1,0)))","v":""},null,null,null,"00000République de Corée",0,1,"République de Corée",{"$f":"SUMPRODUCT((Teams1=U40)*(Teams1_Score<>\"\"))+SUMPRODUCT((Teams2=U40)*(Teams2_Score<>\"\"))","v":0},{"$f":"SUMPRODUCT((Teams1=U40)*(Teams1_Score>Teams2_Score))+SUMPRODUCT((Teams2=U40)*(Teams2_Score>Teams1_Score))","v":0},{"$f":"SUMPRODUCT((Teams1=U40)*(Teams1_Score=Teams2_Score)*(Teams1_Score<>\"\"))+SUMPRODUCT((Teams2=U40)*(Teams2_Score=Teams1_Score)*(Teams2_Score<>\"\"))","v":0},{"$f":"SUMPRODUCT((Teams1=U40)*(Teams1_Score<Teams2_Score))+SUMPRODUCT((Teams2=U40)*(Teams2_Score<Teams1_Score))","v":0},{"$f":"SUMPRODUCT((Teams1=U40)*(Teams1_Score))+SUMPRODUCT((Teams2=U40)*(Teams2_Score))","v":0},{"$f":"SUMPRODUCT((Teams1=U40)*(Teams2_Score))+SUMPRODUCT((Teams2=U40)*(Teams1_Score))","v":0},0,0,null,null,"2018-07-06","C",{"$f":"+IF(AJ49<>\"\",IF(AI49>AO49,AH49,AN49),\"Vainqueur 5\")","v":"Vainqueur 5"},0,null,{"$f":"IF(LEFT(AH40,5)<>\"Vainq\",COUNTIF(RESULTATS!$AG$23:$AM$26,AH40),0)","v":0},null,null,{"$f":"+IF(AJ51<>\"\",IF(AI51>AO51,AH51,AN51),\"Vainqueur 7\")","v":"Vainqueur 7"},0,null,{"$f":"IF(LEFT(AN40,5)<>\"Vainq\",COUNTIF(RESULTATS!$AG$23:$AM$26,AN40),0)","v":0}]
[null,{"$f":"VLOOKUP($D41,TABLEAU_MATCHS[#All],2,FALSE)","v":"2018-06-25"},{"$f":"VLOOKUP($D41,TABLEAU_MATCHS[#All],3,FALSE)","v":"17:00:00"},34,{"$f":"\"Groupe \"&VLOOKUP($I41,TABLEAU_TEAMS[[#All],[TEAM]:[GROUP_INITIAL_RANK]],2,FALSE)","v":"Groupe A"},2.4,2.95,2.75,{"$f":"VLOOKUP($D41,TABLEAU_MATCHS[#All],4,FALSE)","v":"Arabie Saoudite"},null,null,{"$f":"VLOOKUP($D41,TABLEAU_MATCHS[#All],5,FALSE)","v":"Egypte"},null,{"$f":"IF(OR(ISBLANK(RESULTATS!J41),ISBLANK(J41)),\"\",IF(AND('Kévin Sonilhac'!J41=RESULTATS!J41,'Kévin Sonilhac'!M41=RESULTATS!M41),3,IF(OR(AND('Kévin Sonilhac'!J41>'Kévin Sonilhac'!M41,RESULTATS!J41>RESULTATS!M41),AND('Kévin Sonilhac'!J41<'Kévin Sonilhac'!M41,RESULTATS!J41<RESULTATS!M41),AND('Kévin Sonilhac'!J41='Kévin Sonilhac'!M41,RESULTATS!J41=RESULTATS!M41)),1,0)))","v":""},null,null,null,"00000Mexique",0,1,"Mexique",{"$f":"SUMPRODUCT((Teams1=U41)*(Teams1_Score<>\"\"))+SUMPRODUCT((Teams2=U41)*(Teams2_Score<>\"\"))","v":0},{"$f":"SUMPRODUCT((Teams1=U41)*(Teams1_Score>Teams2_Score))+SUMPRODUCT((Teams2=U41)*(Teams2_Score>Teams1_Score))","v":0},{"$f":"SUMPRODUCT((Teams1=U41)*(Teams1_Score=Teams2_Score)*(Teams1_Score<>\"\"))+SUMPRODUCT((Teams2=U41)*(Teams2_Score=Teams1_Score)*(Teams2_Score<>\"\"))","v":0},{"$f":"SUMPRODUCT((Teams1=U41)*(Teams1_Score<Teams2_Score))+SUMPRODUCT((Teams2=U41)*(Teams2_Score<Teams1_Score))","v":0},{"$f":"SUMPRODUCT((Teams1=U41)*(Teams1_Score))+SUMPRODUCT((Teams2=U41)*(Teams2_Score))","v":0},{"$f":"SUMPRODUCT((Teams1=U41)*(Teams2_Score))+SUMPRODUCT((Teams2=U41)*(Teams1_Score))","v":0},0,0,null,null,"2018-07-07","D",{"$f":"+IF(AJ50<>\"\",IF(AI50>AO50,AH50,AN50),\"Vainqueur 6\")","v":"Vainqueur 6"},0,null,{"$f":"IF(LEFT(AH41,5)<>\"Vainq\",COUNTIF(RESULTATS!$AG$23:$AM$26,AH41),0)","v":0},null,null,{"$f":"+IF(AJ52<>\"\",IF(AI52>AO52,AH52,AN52),\"Vainqueur 8\")","v":"Vainqueur 8"},0,null,{"$f":"IF(LEFT(AN41,5)<>\"Vainq\",COUNTIF(RESULTATS!$AG$23:$AM$26,AN41),0)","v":0}]
[null,{"$f":"VLOOKUP($D42,TABLEAU_MATCHS[#All],2,FALSE)","v":"2018-06-25"},{"$f":"VLOOKUP($D42,TABLEAU_MATCHS[#All],3,FALSE)","v":"21:00:00"},35,{"$f":"\"Groupe \"&VLOOKUP($I42,TABLEAU_TEAMS[[#All],[TEAM]:[GROUP_INITIAL_RANK]],2,FALSE)","v":"Groupe B"},13,6.5,1.1399999999999999,{"$f":"VLOOKUP($D42,TABLEAU_MATCHS[#All],4,FALSE)","v":"RI Iran"},null,null,{"$f":"VLOOKUP($D42,TABLEAU_MATCHS[#All],5,FALSE)","v":"Portugal"},null,{"$f":"IF(OR(ISBLANK(RESULTATS!J42),ISBLANK(J42)),\"\",IF(AND('Kévin Sonilhac'!J42=RESULTATS!J42,'Kévin Sonilhac'!M42=RESULTATS!M42),3,IF(OR(AND('Kévin Sonilhac'!J42>'Kévin Sonilhac'!M42,RESULTATS!J42>RESULTATS!M42),AND('Kévin Sonilhac'!J42<'Kévin Sonilhac'!M42,RESULTATS!J42<RESULTATS!M42),AND('Kévin Sonilhac'!J42='Kévin Sonilhac'!M42,RESULTATS!J42=RESULTATS!M42)),1,0)))","v":""},null,null,null,"00000Allemagne",0,1,"Allemagne",{"$f":"SUMPRODUCT((Teams1=U42)*(Teams1_Score<>\"\"))+SUMPRODUCT((Teams2=U42)*(Teams2_Score<>\"\"))","v":0},{"$f":"SUMPRODUCT((Teams1=U42)*(Teams1_Score>Teams2_Score))+SUMPRODUCT((Teams2=U42)*(Teams2_Score>Teams1_Score))","v":0},{"$f":"SUMPRODUCT((Teams1=U42)*(Teams1_Score=Teams2_Score)*(Teams1_Score<>\"\"))+SUMPRODUCT((Teams2=U42)*(Teams2_Score=Teams1_Score)*(Teams2_Score<>\"\"))","v":0},{"$f":"SUMPRODUCT((Teams1=U42)*(Teams1_Score<Teams2_Score))+SUMPRODUCT((Teams2=U42)*(Teams2_Score<Teams1_Score))","v":0},{"$f":"SUMPRODUCT((Teams1=U42)*(Teams1_Score))+SUMPRODUCT((Teams2=U42)*(Teams2_Score))","v":0},{"$f":"SUMPRODUCT((Teams1=U42)*(Teams2_Score))+SUMPRODUCT((Teams2=U42)*(Teams1_Score))","v":0},0,0,null,null,null,null,null,null,null,{"$f":"SUM(AK38:AK41)","v":0},null,null,null,null,null,{"$f":"SUM(AQ38:AQ41)","v":0}]
[null,{"$f":"VLOOKUP($D43,TABLEAU_MATCHS[#All],2,FALSE)","v":"2018-06-25"},{"$f":"VLOOKUP($D43,TABLEAU_MATCHS[#All],3,FALSE)","v":"20:00:00"},36,{"$f":"\"Groupe \"&VLOOKUP($I43,TABLEAU_TEAMS[[#All],[TEAM]:[GROUP_INITIAL_RANK]],2,FALSE)","v":"Groupe B"},2.25,3.1,2.95,{"$f":"VLOOKUP($D43,TABLEAU_MATCHS[#All],4,FALSE)","v":"Espagne"},null,null,{"$f":"VLOOKUP($D43,TABLEAU_MATCHS[#All],5,FALSE)","v":"Maroc"},null,{"$f":"IF(OR(ISBLANK(RESULTATS!J43),ISBLANK(J43)),\"\",IF(AND('Kévin Sonilhac'!J43=RESULTATS!J43,'Kévin Sonilhac'!M43=RESULTATS!M43),3,IF(OR(AND('Kévin Sonilhac'!J43>'Kévin Sonilhac'!M43,RESULTATS!J43>RESULTATS!M43),AND('Kévin Sonilhac'!J43<'Kévin Sonilhac'!M43,RESULTATS!J43<RESULTATS!M43),AND('Kévin Sonilhac'!J43='Kévin Sonilhac'!M43,RESULTATS!J43=RESULTATS!M43)),1,0)))","v":""},null,null,null,null,null,null,null,null,null,null,null,null,null,null,null,null,null,"Date","Huitième de Finale",null,null,"Buts",null,"Pen",null,null,null,"Buts",null,"Pen"]
[null,{"$f":"VLOOKUP($D44,TABLEAU_MATCHS[#All],2,FALSE)","v":"2018-06-26"},{"$f":"VLOOKUP($D44,TABLEAU_MATCHS[#All],3,FALSE)","v":"17:00:00"},37,{"$f":"\"Groupe \"&VLOOKUP($I44,TABLEAU_TEAMS[[#All],[TEAM]:[GROUP_INITIAL_RANK]],2,FALSE)","v":"Groupe C"},4.3,3.25,1.76,{"$f":"VLOOKUP($D44,TABLEAU_MATCHS[#All],4,FALSE)","v":"Danemark"},null,null,{"$f":"VLOOKUP($D44,TABLEAU_MATCHS[#All],5,FALSE)","v":"France"},null,{"$f":"IF(OR(ISBLANK(RESULTATS!J44),ISBLANK(J44)),\"\",IF(AND('Kévin Sonilhac'!J44=RESULTATS!J44,'Kévin Sonilhac'!M44=RESULTATS!M44),3,IF(OR(AND('Kévin Sonilhac'!J44>'Kévin Sonilhac'!M44,RESULTATS!J44>RESULTATS!M44),AND('Kévin Sonilhac'!J44<'Kévin Sonilhac'!M44,RESULTATS!J44<RESULTATS!M44),AND('Kévin Sonilhac'!J44='Kévin Sonilhac'!M44,RESULTATS!J44=RESULTATS!M44)),1,0)))","v":""},null,null,null,null,null,"Rg","Groupe G","MJ","G","N","P","BP","BC","+/-","Pts"]
[null,{"$f":"VLOOKUP($D45,TABLEAU_MATCHS[#All],2,FALSE)","v":"2018-06-26"},{"$f":"VLOOKUP($D45,TABLEAU_MATCHS[#All],3,FALSE)","v":"17:00:00"},38,{"$f":"\"Groupe \"&VLOOKUP($I45,TABLEAU_TEAMS[[#All],[TEAM]:[GROUP_INITIAL_RANK]],2,FALSE)","v":"Groupe C"},3.05,3,2.25,{"$f":"VLOOKUP($D45,TABLEAU_MATCHS[#All],4,FALSE)","v":"Australie"},null,null,{"$f":"VLOOKUP($D45,TABLEAU_MATCHS[#All],5,FALSE)","v":"Pérou"},null,{"$f":"IF(OR(ISBLANK(RESULTATS!J45),ISBLANK(J45)),\"\",IF(AND('Kévin Sonilhac'!J45=RESULTATS!J45,'Kévin Sonilhac'!M45=RESULTATS!M45),3,IF(OR(AND('Kévin Sonilhac'!J45>'Kévin Sonilhac'!M45,RESULTATS!J45>RESULTATS!M45),AND('Kévin Sonilhac'!J45<'Kévin Sonilhac'!M45,RESULTATS!J45<RESULTATS!M45),AND('Kévin Sonilhac'!J45='Kévin Sonilhac'!M45,RESULTATS!J45=RESULTATS!M45)),1,0)))","v":""},null,null,null,{"$f":"INDEX($R96:$R99,MATCH(SMALL(COUNTIF($R96:$R99,\">=\"&$R96:$R99),ROW(INDIRECT(\"1:\"&ROWS($R96:$R99)))),COUNTIF($R96:$R99,\">=\"&$R96:$R99),0))","v":"00000Tunisie"},{"$f":"INDEX($S96:$S99,MATCH(SMALL(COUNTIF($R96:$R99,\">=\"&$R96:$R99),ROW(INDIRECT(\"1:\"&ROWS($R96:$R99)))),COUNTIF($R96:$R99,\">=\"&$R96:$R99),0))","v":0},{"$f":"INDEX($T96:$T99,MATCH(SMALL(COUNTIF($R96:$R99,\">=\"&$R96:$R99),ROW(INDIRECT(\"1:\"&ROWS($R96:$R99)))),COUNTIF($R96:$R99,\">=\"&$R96:$R99),0))","v":1},{"$f":"INDEX($U96:$U99,MATCH(SMALL(COUNTIF($R96:$R99,\">=\"&$R96:$R99),ROW(INDIRECT(\"1:\"&ROWS($R96:$R99)))),COUNTIF($R96:$R99,\">=\"&$R96:$R99),0))","v":"Tunisie"},{"$f":"SUMPRODUCT((Teams1=U45)*(Teams1_Score<>\"\"))+SUMPRODUCT((Teams2=U45)*(Teams2_Score<>\"\"))","v":0},{"$f":"SUMPRODUCT((Teams1=U45)*(Teams1_Score>Teams2_Score))+SUMPRODUCT((Teams2=U45)*(Teams2_Score>Teams1_Score))","v":0},{"$f":"SUMPRODUCT((Teams1=U45)*(Teams1_Score=Teams2_Score)*(Teams1_Score<>\"\"))+SUMPRODUCT((Teams2=U45)*(Teams2_Score=Teams1_Score)*(Teams2_Score<>\"\"))","v":0},{"$f":"SUMPRODUCT((Teams1=U45)*(Teams1_Score<Teams2_Score))+SUMPRODUCT((Teams2=U45)*(Teams2_Score<Teams1_Score))","v":0},{"$f":"SUMPRODUCT((Teams1=U45)*(Teams1_Score))+SUMPRODUCT((Teams2=U45)*(Teams2_Score))","v":0},{"$f":"SUMPRODUCT((Teams1=U45)*(Teams2_Score))+SUMPRODUCT((Teams2=U45)*(Teams1_Score))","v":0},{"$f":"Z45-AA45","v":0},{"$f":"3*W45+X45","v":0},null,null,"2018-06-30",1,{"$f":"IF(SUM(V9:V12)=0,\"1er Groupe A\",IF(COUNTIF(T9:T12,1)=1,VLOOKUP(1,T9:U12,2,FALSE),IF(COUNTIF(T9:T12,1)>=2,\"Tirage au Sort A1\")))","v":"1er Groupe A"},{"$f":"AJ45*10+AL45","v":0},null,{"$f":"IF(AND(LEFT(AH45,3)<>\"1er\",LEFT(AH45,3)<>\"2nd\"),COUNTIF(RESULTATS!$AG$30:$AM$37,AH45),0)","v":0},null,null,{"$f":"IF(SUM(V15:V18)=0,\"2nd Groupe B\",IF(OR(COUNTIF(T15:T18,1)>1,COUNTIF(T15:T18,2)>1),\"Tirage au sort B2\",VLOOKUP(2,T15:U18,2,FALSE)))","v":"2nd Groupe B"},{"$f":"AP45*10+AR45","v":0},null,{"$f":"IF(AND(LEFT(AN45,3)<>\"1er\",LEFT(AN45,3)<>\"2nd\"),COUNTIF(RESULTATS!$AG$30:$AM$37,AN45),0)","v":0}]
[null,{"$f":"VLOOKUP($D46,TABLEAU_MATCHS[#All],2,FALSE)","v":"2018-06-26"},{"$f":"VLOOKUP($D46,TABLEAU_MATCHS[#All],3,FALSE)","v":"21:00:00"},39,{"$f":"\"Groupe \"&VLOOKUP($I46,TABLEAU_TEAMS[[#All],[TEAM]:[GROUP_INITIAL_RANK]],2,FALSE)","v":"Groupe D"},2.4,2.9,2.85,{"$f":"VLOOKUP($D46,TABLEAU_MATCHS[#All],4,FALSE)","v":"Nigeria"},null,null,{"$f":"VLOOKUP($D46,TABLEAU_MATCHS[#All],5,FALSE)","v":"Argentine"},null,{"$f":"IF(OR(ISBLANK(RESULTATS!J46),ISBLANK(J46)),\"\",IF(AND('Kévin Sonilhac'!J46=RESULTATS!J46,'Kévin Sonilhac'!M46=RESULTATS!M46),3,IF(OR(AND('Kévin Sonilhac'!J46>'Kévin Sonilhac'!M46,RESULTATS!J46>RESULTATS!M46),AND('Kévin Sonilhac'!J46<'Kévin Sonilhac'!M46,RESULTATS!J46<RESULTATS!M46),AND('Kévin Sonilhac'!J46='Kévin Sonilhac'!M46,RESULTATS!J46=RESULTATS!M46)),1,0)))","v":""},null,null,null,"00000Panama",0,1,"Panama",{"$f":"SUMPRODUCT((Teams1=U46)*(Teams1_Score<>\"\"))+SUMPRODUCT((Teams2=U46)*(Teams2_Score<>\"\"))","v":0},{"$f":"SUMPRODUCT((Teams1=U46)*(Teams1_Score>Teams2_Score))+SUMPRODUCT((Teams2=U46)*(Teams2_Score>Teams1_Score))","v":0},{"$f":"SUMPRODUCT((Teams1=U46)*(Teams1_Score=Teams2_Score)*(Teams1_Score<>\"\"))+SUMPRODUCT((Teams2=U46)*(Teams2_Score=Teams1_Score)*(Teams2_Score<>\"\"))","v":0},{"$f":"SUMPRODUCT((Teams1=U46)*(Teams1_Score<Teams2_Score))+SUMPRODUCT((Teams2=U46)*(Teams2_Score<Teams1_Score))","v":0},{"$f":"SUMPRODUCT((Teams1=U46)*(Teams1_Score))+SUMPRODUCT((Teams2=U46)*(Teams2_Score))","v":0},{"$f":"SUMPRODUCT((Teams1=U46)*(Teams2_Score))+SUMPRODUCT((Teams2=U46)*(Teams1_Score))","v":0},0,0,null,null,"2018-07-01",2,{"$f":"IF(SUM(V15:V18)=0,\"1er Groupe B\",IF(COUNTIF(T15:T18,1)=1,VLOOKUP(1,T15:U18,2,FALSE),IF(COUNTIF(T15:T18,1)>=2,\"Tirage au Sort B1\")))","v":"1er Groupe B"},{"$f":"AJ46*10+AL46","v":0},null,{"$f":"IF(AND(LEFT(AH46,3)<>\"1er\",LEFT(AH46,3)<>\"2nd\"),COUNTIF(RESULTATS!$AG$30:$AM$37,AH46),0)","v":0},null,null,{"$f":"IF(SUM(V9:V12)=0,\"2nd Groupe A\",IF(OR(COUNTIF(T9:T12,1)>1,COUNTIF(T9:T12,2)>1),\"Tirage au sort A2\",VLOOKUP(2,T9:U12,2,FALSE)))","v":"2nd Groupe A"},0,null,{"$f":"IF(AND(LEFT(AN46,3)<>\"1er\",LEFT(AN46,3)<>\"2nd\"),COUNTIF(RESULTATS!$AG$30:$AM$37,AN46),0)","v":0}]
[null,{"$f":"VLOOKUP($D47,TABLEAU_MATCHS[#All],2,FALSE)","v":"2018-06-26"},{"$f":"VLOOKUP($D47,TABLEAU_MATCHS[#All],3,FALSE)","v":"21:00:00"},40,{"$f":"\"Groupe \"&VLOOKUP($I47,TABLEAU_TEAMS[[#All],[TEAM]:[GROUP_INITIAL_RANK]],2,FALSE)","v":"Groupe D"},6.5,3.7,1.44,{"$f":"VLOOKUP($D47,TABLEAU_MATCHS[#All],4,FALSE)","v":"Islande"},null,null,{"$f":"VLOOKUP($D47,TABLEAU_MATCHS[#All],5,FALSE)","v":"Croatie"},null,{"$f":"IF(OR(ISBLANK(RESULTATS!J47),ISBLANK(J47)),\"\",IF(AND('Kévin Sonilhac'!J47=RESULTATS!J47,'Kévin Sonilhac'!M47=RESULTATS!M47),3,IF(OR(AND('Kévin Sonilhac'!J47>'Kévin Sonilhac'!M47,RESULTATS!J47>RESULTATS!M47),AND('Kévin Sonilhac'!J47<'Kévin Sonilhac'!M47,RESULTATS!J47<RESULTATS!M47),AND('Kévin Sonilhac'!J47='Kévin Sonilhac'!M47,RESULTATS!J47=RESULTATS!M47)),1,0)))","v":""},null,null,null,"00000Belgique",0,1,"Belgique",{"$f":"SUMPRODUCT((Teams1=U47)*(Teams1_Score<>\"\"))+SUMPRODUCT((Teams2=U47)*(Teams2_Score<>\"\"))","v":0},{"$f":"SUMPRODUCT((Teams1=U47)*(Teams1_Score>Teams2_Score))+SUMPRODUCT((Teams2=U47)*(Teams2_Score>Teams1_Score))","v":0},{"$f":"SUMPRODUCT((Teams1=U47)*(Teams1_Score=Teams2_Score)*(Teams1_Score<>\"\"))+SUMPRODUCT((Teams2=U47)*(Teams2_Score=Teams1_Score)*(Teams2_Score<>\"\"))","v":0},{"$f":"SUMPRODUCT((Teams1=U47)*(Teams1_Score<Teams2_Score))+SUMPRODUCT((Teams2=U47)*(Teams2_Score<Teams1_Score))","v":0},{"$f":"SUMPRODUCT((Teams1=U47)*(Teams1_Score))+SUMPRODUCT((Teams2=U47)*(Teams2_Score))","v":0},{"$f":"SUMPRODUCT((Teams1=U47)*(Teams2_Score))+SUMPRODUCT((Teams2=U47)*(Teams1_Score))","v":0},0,0,null,null,"2017-06-30",3,{"$f":"IF(SUM(V21:V24)=0,\"1er Groupe C\",IF(COUNTIF(T21:T24,1)=1,VLOOKUP(1,T21:U24,2,FALSE),IF(COUNTIF(T21:T24,1)>=2,\"Tirage au Sort C1\")))","v":"1er Groupe C"},0,null,{"$f":"IF(AND(LEFT(AH47,3)<>\"1er\",LEFT(AH47,3)<>\"2nd\"),COUNTIF(RESULTATS!$AG$30:$AM$37,AH47),0)","v":0},null,null,{"$f":"IF(SUM(V27:V30)=0,\"2nd Groupe D\",IF(OR(COUNTIF(T27:T30,1)>1,COUNTIF(T27:T30,2)>1),\"Tirage au sort D2\",VLOOKUP(2,T27:U30,2,FALSE)))","v":"2nd Groupe D"},0,null,{"$f":"IF(AND(LEFT(AN47,3)<>\"1er\",LEFT(AN47,3)<>\"2nd\"),COUNTIF(RESULTATS!$AG$30:$AM$37,AN47),0)","v":0}]
[null,{"$f":"VLOOKUP($D48,TABLEAU_MATCHS[#All],2,FALSE)","v":"2018-06-27"},{"$f":"VLOOKUP($D48,TABLEAU_MATCHS[#All],3,FALSE)","v":"21:00:00"},41,{"$f":"\"Groupe \"&VLOOKUP($I48,TABLEAU_TEAMS[[#All],[TEAM]:[GROUP_INITIAL_RANK]],2,FALSE)","v":"Groupe E"},6.5,3.5,1.48,{"$f":"VLOOKUP($D48,TABLEAU_MATCHS[#All],4,FALSE)","v":"Serbie"},null,null,{"$f":"VLOOKUP($D48,TABLEAU_MATCHS[#All],5,FALSE)","v":"Brésil"},null,{"$f":"IF(OR(ISBLANK(RESULTATS!J48),ISBLANK(J48)),\"\",IF(AND('Kévin Sonilhac'!J48=RESULTATS!J48,'Kévin Sonilhac'!M48=RESULTATS!M48),3,IF(OR(AND('Kévin Sonilhac'!J48>'Kévin Sonilhac'!M48,RESULTATS!J48>RESULTATS!M48),AND('Kévin Sonilhac'!J48<'Kévin Sonilhac'!M48,RESULTATS!J48<RESULTATS!M48),AND('Kévin Sonilhac'!J48='Kévin Sonilhac'!M48,RESULTATS!J48=RESULTATS!M48)),1,0)))","v":""},null,null,null,"00000Angleterre",0,1,"Angleterre",{"$f":"SUMPRODUCT((Teams1=U48)*(Teams1_Score<>\"\"))+SUMPRODUCT((Teams2=U48)*(Teams2_Score<>\"\"))","v":0},{"$f":"SUMPRODUCT((Teams1=U48)*(Teams1_Score>Teams2_Score))+SUMPRODUCT((Teams2=U48)*(Teams2_Score>Teams1_Score))","v":0},{"$f":"SUMPRODUCT((Teams1=U48)*(Teams1_Score=Teams2_Score)*(Teams1_Score<>\"\"))+SUMPRODUCT((Teams2=U48)*(Teams2_Score=Teams1_Score)*(Teams2_Score<>\"\"))","v":0},{"$f":"SUMPRODUCT((Teams1=U48)*(Teams1_Score<Teams2_Score))+SUMPRODUCT((Teams2=U48)*(Teams2_Score<Teams1_Score))","v":0},{"$f":"SUMPRODUCT((Teams1=U48)*(Teams1_Score))+SUMPRODUCT((Teams2=U48)*(Teams2_Score))","v":0},{"$f":"SUMPRODUCT((Teams1=U48)*(Teams2_Score))+SUMPRODUCT((Teams2=U48)*(Teams1_Score))","v":0},0,0,null,null,"2018-07-01",4,{"$f":"IF(SUM(V27:V30)=0,\"1er Groupe D\",IF(COUNTIF(T27:T30,1)=1,VLOOKUP(1,T27:U30,2,FALSE),IF(COUNTIF(T27:T30,1)>=2,\"Tirage au Sort D1\")))","v":"1er Groupe D"},0,null,{"$f":"IF(AND(LEFT(AH48,3)<>\"1er\",LEFT(AH48,3)<>\"2nd\"),COUNTIF(RESULTATS!$AG$30:$AM$37,AH48),0)","v":0},null,null,{"$f":"IF(SUM(V21:V24)=0,\"2nd Groupe C\",IF(OR(COUNTIF(T21:T24,1)>1,COUNTIF(T21:T24,2)>1),\"Tirage au sort C2\",VLOOKUP(2,T21:U24,2,FALSE)))","v":"2nd Groupe C"},0,null,{"$f":"IF(AND(LEFT(AN48,3)<>\"1er\",LEFT(AN48,3)<>\"2nd\"),COUNTIF(RESULTATS!$AG$30:$AM$37,AN48),0)","v":0}]
[null,{"$f":"VLOOKUP($D49,TABLEAU_MATCHS[#All],2,FALSE)","v":"2018-06-27"},{"$f":"VLOOKUP($D49,TABLEAU_MATCHS[#All],3,FALSE)","v":"21:00:00"},42,{"$f":"\"Groupe \"&VLOOKUP($I49,TABLEAU_TEAMS[[#All],[TEAM]:[GROUP_INITIAL_RANK]],2,FALSE)","v":"Groupe E"},4,3.05,1.9,{"$f":"VLOOKUP($D49,TABLEAU_MATCHS[#All],4,FALSE)","v":"Suisse"},null,null,{"$f":"VLOOKUP($D49,TABLEAU_MATCHS[#All],5,FALSE)","v":"Costa Rica"},null,{"$f":"IF(OR(ISBLANK(RESULTATS!J49),ISBLANK(J49)),\"\",IF(AND('Kévin Sonilhac'!J49=RESULTATS!J49,'Kévin Sonilhac'!M49=RESULTATS!M49),3,IF(OR(AND('Kévin Sonilhac'!J49>'Kévin Sonilhac'!M49,RESULTATS!J49>RESULTATS!M49),AND('Kévin Sonilhac'!J49<'Kévin Sonilhac'!M49,RESULTATS!J49<RESULTATS!M49),AND('Kévin Sonilhac'!J49='Kévin Sonilhac'!M49,RESULTATS!J49=RESULTATS!M49)),1,0)))","v":""},null,null,null,null,null,null,null,null,null,null,null,null,null,null,null,null,null,"2018-07-02",5,{"$f":"IF(SUM(V33:V36)=0,\"1er Groupe E\",IF(COUNTIF(T33:T36,1)=1,VLOOKUP(1,T33:U36,2,FALSE),IF(COUNTIF(T33:T36,1)>=2,\"Tirage au Sort E1\")))","v":"1er Groupe E"},0,null,{"$f":"IF(AND(LEFT(AH49,3)<>\"1er\",LEFT(AH49,3)<>\"2nd\"),COUNTIF(RESULTATS!$AG$30:$AM$37,AH49),0)","v":0},null,null,{"$f":"IF(SUM(V39:V42)=0,\"2nd Groupe F\",IF(OR(COUNTIF(T39:T42,1)>1,COUNTIF(T39:T42,2)>1),\"Tirage au sort F2\",VLOOKUP(2,T39:U42,2,FALSE)))","v":"2nd Groupe F"},0,null,{"$f":"IF(AND(LEFT(AN49,3)<>\"1er\",LEFT(AN49,3)<>\"2nd\"),COUNTIF(RESULTATS!$AG$30:$AM$37,AN49),0)","v":0}]
[null,{"$f":"VLOOKUP($D50,TABLEAU_MATCHS[#All],2,FALSE)","v":"2018-06-27"},{"$f":"VLOOKUP($D50,TABLEAU_MATCHS[#All],3,FALSE)","v":"19:00:00"},43,{"$f":"\"Groupe \"&VLOOKUP($I50,TABLEAU_TEAMS[[#All],[TEAM]:[GROUP_INITIAL_RANK]],2,FALSE)","v":"Groupe F"},8.5,4.3,1.3,{"$f":"VLOOKUP($D50,TABLEAU_MATCHS[#All],4,FALSE)","v":"Mexique"},null,null,{"$f":"VLOOKUP($D50,TABLEAU_MATCHS[#All],5,FALSE)","v":"Suède"},null,{"$f":"IF(OR(ISBLANK(RESULTATS!J50),ISBLANK(J50)),\"\",IF(AND('Kévin Sonilhac'!J50=RESULTATS!J50,'Kévin Sonilhac'!M50=RESULTATS!M50),3,IF(OR(AND('Kévin Sonilhac'!J50>'Kévin Sonilhac'!M50,RESULTATS!J50>RESULTATS!M50),AND('Kévin Sonilhac'!J50<'Kévin Sonilhac'!M50,RESULTATS!J50<RESULTATS!M50),AND('Kévin Sonilhac'!J50='Kévin Sonilhac'!M50,RESULTATS!J50=RESULTATS!M50)),1,0)))","v":""},null,null,null,null,null,"Rg","Groupe H","MJ","G","N","P","BP","BC","+/-","Pts",null,null,"2018-07-03",6,{"$f":"IF(SUM(V39:V42)=0,\"1er Groupe F\",IF(COUNTIF(T39:T42,1)=1,VLOOKUP(1,T39:U42,2,FALSE),IF(COUNTIF(T39:T42,1)>=2,\"Tirage au Sort F1\")))","v":"1er Groupe F"},0,null,{"$f":"IF(AND(LEFT(AH50,3)<>\"1er\",LEFT(AH50,3)<>\"2nd\"),COUNTIF(RESULTATS!$AG$30:$AM$37,AH50),0)","v":0},null,null,{"$f":"IF(SUM(V33:V36)=0,\"2nd Groupe E\",IF(OR(COUNTIF(T33:T36,1)>1,COUNTIF(T33:T36,2)>1),\"Tirage au sort E2\",VLOOKUP(2,T33:U36,2,FALSE)))","v":"2nd Groupe E"},0,null,{"$f":"IF(AND(LEFT(AN50,3)<>\"1er\",LEFT(AN50,3)<>\"2nd\"),COUNTIF(RESULTATS!$AG$30:$AM$37,AN50),0)","v":0}]
[null,{"$f":"VLOOKUP($D51,TABLEAU_MATCHS[#All],2,FALSE)","v":"2018-06-27"},{"$f":"VLOOKUP($D51,TABLEAU_MATCHS[#All],3,FALSE)","v":"17:00:00"},44,{"$f":"\"Groupe \"&VLOOKUP($I51,TABLEAU_TEAMS[[#All],[TEAM]:[GROUP_INITIAL_RANK]],2,FALSE)","v":"Groupe F"},1.48,3.6,6.25,{"$f":"VLOOKUP($D51,TABLEAU_MATCHS[#All],4,FALSE)","v":"République de Corée"},null,null,{"$f":"VLOOKUP($D51,TABLEAU_MATCHS[#All],5,FALSE)","v":"Allemagne"},null,{"$f":"IF(OR(ISBLANK(RESULTATS!J51),ISBLANK(J51)),\"\",IF(AND('Kévin Sonilhac'!J51=RESULTATS!J51,'Kévin Sonilhac'!M51=RESULTATS!M51),3,IF(OR(AND('Kévin Sonilhac'!J51>'Kévin Sonilhac'!M51,RESULTATS!J51>RESULTATS!M51),AND('Kévin Sonilhac'!J51<'Kévin Sonilhac'!M51,RESULTATS!J51<RESULTATS!M51),AND('Kévin Sonilhac'!J51='Kévin Sonilhac'!M51,RESULTATS!J51=RESULTATS!M51)),1,0)))","v":""},null,null,null,{"$f":"INDEX($R102:$R105,MATCH(SMALL(COUNTIF($R102:$R105,\">=\"&$R102:$R105),ROW(INDIRECT(\"1:\"&ROWS($R102:$R105)))),COUNTIF($R102:$R105,\">=\"&$R102:$R105),0))","v":"00000Sénégal"},{"$f":"INDEX($S102:$S105,MATCH(SMALL(COUNTIF($R102:$R105,\">=\"&$R102:$R105),ROW(INDIRECT(\"1:\"&ROWS($R102:$R105)))),COUNTIF($R102:$R105,\">=\"&$R102:$R105),0))","v":0},{"$f":"INDEX($T102:$T105,MATCH(SMALL(COUNTIF($R102:$R105,\">=\"&$R102:$R105),ROW(INDIRECT(\"1:\"&ROWS($R102:$R105)))),COUNTIF($R102:$R105,\">=\"&$R102:$R105),0))","v":1},{"$f":"INDEX($U102:$U105,MATCH(SMALL(COUNTIF($R102:$R105,\">=\"&$R102:$R105),ROW(INDIRECT(\"1:\"&ROWS($R102:$R105)))),COUNTIF($R102:$R105,\">=\"&$R102:$R105),0))","v":"Sénégal"},{"$f":"SUMPRODUCT((Teams1=U51)*(Teams1_Score<>\"\"))+SUMPRODUCT((Teams2=U51)*(Teams2_Score<>\"\"))","v":0},{"$f":"SUMPRODUCT((Teams1=U51)*(Teams1_Score>Teams2_Score))+SUMPRODUCT((Teams2=U51)*(Teams2_Score>Teams1_Score))","v":0},{"$f":"SUMPRODUCT((Teams1=U51)*(Teams1_Score=Teams2_Score)*(Teams1_Score<>\"\"))+SUMPRODUCT((Teams2=U51)*(Teams2_Score=Teams1_Score)*(Teams2_Score<>\"\"))","v":0},{"$f":"SUMPRODUCT((Teams1=U51)*(Teams1_Score<Teams2_Score))+SUMPRODUCT((Teams2=U51)*(Teams2_Score<Teams1_Score))","v":0},{"$f":"SUMPRODUCT((Teams1=U51)*(Teams1_Score))+SUMPRODUCT((Teams2=U51)*(Teams2_Score))","v":0},{"$f":"SUMPRODUCT((Teams1=U51)*(Teams2_Score))+SUMPRODUCT((Teams2=U51)*(Teams1_Score))","v":0},{"$f":"Z51-AA51","v":0},{"$f":"3*W51+X51","v":0},null,null,"2018-07-02",7,{"$f":"IF(SUM(V45:V48)=0,\"1er Groupe G\",IF(COUNTIF(T45:T48,1)=1,VLOOKUP(1,T45:U48,2,FALSE),IF(COUNTIF(T45:T48,1)>=2,\"Tirage au Sort G1\")))","v":"1er Groupe G"},0,null,{"$f":"IF(AND(LEFT(AH51,3)<>\"1er\",LEFT(AH51,3)<>\"2nd\"),COUNTIF(RESULTATS!$AG$30:$AM$37,AH51),0)","v":0},null,null,{"$f":"IF(SUM(V51:V54)=0,\"2nd Groupe H\",IF(OR(COUNTIF(T51:T54,1)>1,COUNTIF(T51:T54,2)>1),\"Tirage au sort H2\",VLOOKUP(2,T51:U54,2,FALSE)))","v":"2nd Groupe H"},0,null,{"$f":"IF(AND(LEFT(AN51,3)<>\"1er\",LEFT(AN51,3)<>\"2nd\"),COUNTIF(RESULTATS!$AG$30:$AM$37,AN51),0)","v":0}]
[null,{"$f":"VLOOKUP($D52,TABLEAU_MATCHS[#All],2,FALSE)","v":"2018-06-28"},{"$f":"VLOOKUP($D52,TABLEAU_MATCHS[#All],3,FALSE)","v":"21:00:00"},45,{"$f":"\"Groupe \"&VLOOKUP($I52,TABLEAU_TEAMS[[#All],[TEAM]:[GROUP_INITIAL_RANK]],2,FALSE)","v":"Groupe G"},8,4.2,1.32,{"$f":"VLOOKUP($D52,TABLEAU_MATCHS[#All],4,FALSE)","v":"Panama"},null,null,{"$f":"VLOOKUP($D52,TABLEAU_MATCHS[#All],5,FALSE)","v":"Tunisie"},null,{"$f":"IF(OR(ISBLANK(RESULTATS!J52),ISBLANK(J52)),\"\",IF(AND('Kévin Sonilhac'!J52=RESULTATS!J52,'Kévin Sonilhac'!M52=RESULTATS!M52),3,IF(OR(AND('Kévin Sonilhac'!J52>'Kévin Sonilhac'!M52,RESULTATS!J52>RESULTATS!M52),AND('Kévin Sonilhac'!J52<'Kévin Sonilhac'!M52,RESULTATS!J52<RESULTATS!M52),AND('Kévin Sonilhac'!J52='Kévin Sonilhac'!M52,RESULTATS!J52=RESULTATS!M52)),1,0)))","v":""},null,null,null,"00000Pologne",0,1,"Pologne",{"$f":"SUMPRODUCT((Teams1=U52)*(Teams1_Score<>\"\"))+SUMPRODUCT((Teams2=U52)*(Teams2_Score<>\"\"))","v":0},{"$f":"SUMPRODUCT((Teams1=U52)*(Teams1_Score>Teams2_Score))+SUMPRODUCT((Teams2=U52)*(Teams2_Score>Teams1_Score))","v":0},{"$f":"SUMPRODUCT((Teams1=U52)*(Teams1_Score=Teams2_Score)*(Teams1_Score<>\"\"))+SUMPRODUCT((Teams2=U52)*(Teams2_Score=Teams1_Score)*(Teams2_Score<>\"\"))","v":0},{"$f":"SUMPRODUCT((Teams1=U52)*(Teams1_Score<Teams2_Score))+SUMPRODUCT((Teams2=U52)*(Teams2_Score<Teams1_Score))","v":0},{"$f":"SUMPRODUCT((Teams1=U52)*(Teams1_Score))+SUMPRODUCT((Teams2=U52)*(Teams2_Score))","v":0},{"$f":"SUMPRODUCT((Teams1=U52)*(Teams2_Score))+SUMPRODUCT((Teams2=U52)*(Teams1_Score))","v":0},0,0,null,null,"2018-07-03",8,{"$f":"IF(SUM(V51:V54)=0,\"1er Groupe H\",IF(COUNTIF(T51:T54,1)=1,VLOOKUP(1,T51:U54,2,FALSE),IF(COUNTIF(T51:T54,1)>=2,\"Tirage au Sort H1\")))","v":"1er Groupe H"},0,null,{"$f":"IF(AND(LEFT(AH52,3)<>\"1er\",LEFT(AH52,3)<>\"2nd\"),COUNTIF(RESULTATS!$AG$30:$AM$37,AH52),0)","v":0},null,null,{"$f":"IF(SUM(V45:V48)=0,\"2nd Groupe G\",IF(OR(COUNTIF(T45:T48,1)>1,COUNTIF(T45:T48,2)>1),\"Tirage au sort G2\",VLOOKUP(2,T45:U48,2,FALSE)))","v":"2nd Groupe G"},0,null,{"$f":"IF(AND(LEFT(AN52,3)<>\"1er\",LEFT(AN52,3)<>\"2nd\"),COUNTIF(RESULTATS!$AG$30:$AM$37,AN52),0)","v":0}]
[null,{"$f":"VLOOKUP($D53,TABLEAU_MATCHS[#All],2,FALSE)","v":"2018-06-28"},{"$f":"VLOOKUP($D53,TABLEAU_MATCHS[#All],3,FALSE)","v":"20:00:00"},46,{"$f":"\"Groupe \"&VLOOKUP($I53,TABLEAU_TEAMS[[#All],[TEAM]:[GROUP_INITIAL_RANK]],2,FALSE)","v":"Groupe G"},1.74,3.2,4.0999999999999996,{"$f":"VLOOKUP($D53,TABLEAU_MATCHS[#All],4,FALSE)","v":"Angleterre"},null,null,{"$f":"VLOOKUP($D53,TABLEAU_MATCHS[#All],5,FALSE)","v":"Belgique"},null,{"$f":"IF(OR(ISBLANK(RESULTATS!J53),ISBLANK(J53)),\"\",IF(AND('Kévin Sonilhac'!J53=RESULTATS!J53,'Kévin Sonilhac'!M53=RESULTATS!M53),3,IF(OR(AND('Kévin Sonilhac'!J53>'Kévin Sonilhac'!M53,RESULTATS!J53>RESULTATS!M53),AND('Kévin Sonilhac'!J53<'Kévin Sonilhac'!M53,RESULTATS!J53<RESULTATS!M53),AND('Kévin Sonilhac'!J53='Kévin Sonilhac'!M53,RESULTATS!J53=RESULTATS!M53)),1,0)))","v":""},null,null,null,"00000Japon",0,1,"Japon",{"$f":"SUMPRODUCT((Teams1=U53)*(Teams1_Score<>\"\"))+SUMPRODUCT((Teams2=U53)*(Teams2_Score<>\"\"))","v":0},{"$f":"SUMPRODUCT((Teams1=U53)*(Teams1_Score>Teams2_Score))+SUMPRODUCT((Teams2=U53)*(Teams2_Score>Teams1_Score))","v":0},{"$f":"SUMPRODUCT((Teams1=U53)*(Teams1_Score=Teams2_Score)*(Teams1_Score<>\"\"))+SUMPRODUCT((Teams2=U53)*(Teams2_Score=Teams1_Score)*(Teams2_Score<>\"\"))","v":0},{"$f":"SUMPRODUCT((Teams1=U53)*(Teams1_Score<Teams2_Score))+SUMPRODUCT((Teams2=U53)*(Teams2_Score<Teams1_Score))","v":0},{"$f":"SUMPRODUCT((Teams1=U53)*(Teams1_Score))+SUMPRODUCT((Teams2=U53)*(Teams2_Score))","v":0},{"$f":"SUMPRODUCT((Teams1=U53)*(Teams2_Score))+SUMPRODUCT((Teams2=U53)*(Teams1_Score))","v":0},0,0,null,null,null,null,null,null,null,{"$f":"SUM(AK45:AK52)","v":0},null,null,null,0,null,{"$f":"SUM(AQ45:AQ52)","v":0}]
[null,{"$f":"VLOOKUP($D54,TABLEAU_MATCHS[#All],2,FALSE)","v":"2018-06-28"},{"$f":"VLOOKUP($D54,TABLEAU_MATCHS[#All],3,FALSE)","v":"17:00:00"},47,{"$f":"\"Groupe \"&VLOOKUP($I54,TABLEAU_TEAMS[[#All],[TEAM]:[GROUP_INITIAL_RANK]],2,FALSE)","v":"Groupe H"},4.9000000000000004,3.25,1.62,{"$f":"VLOOKUP($D54,TABLEAU_MATCHS[#All],4,FALSE)","v":"Japon"},null,null,{"$f":"VLOOKUP($D54,TABLEAU_MATCHS[#All],5,FALSE)","v":"Pologne"},null,{"$f":"IF(OR(ISBLANK(RESULTATS!J54),ISBLANK(J54)),\"\",IF(AND('Kévin Sonilhac'!J54=RESULTATS!J54,'Kévin Sonilhac'!M54=RESULTATS!M54),3,IF(OR(AND('Kévin Sonilhac'!J54>'Kévin Sonilhac'!M54,RESULTATS!J54>RESULTATS!M54),AND('Kévin Sonilhac'!J54<'Kévin Sonilhac'!M54,RESULTATS!J54<RESULTATS!M54),AND('Kévin Sonilhac'!J54='Kévin Sonilhac'!M54,RESULTATS!J54=RESULTATS!M54)),1,0)))","v":""},null,null,null,"00000Colombie",0,1,"Colombie",{"$f":"SUMPRODUCT((Teams1=U54)*(Teams1_Score<>\"\"))+SUMPRODUCT((Teams2=U54)*(Teams2_Score<>\"\"))","v":0},{"$f":"SUMPRODUCT((Teams1=U54)*(Teams1_Score>Teams2_Score))+SUMPRODUCT((Teams2=U54)*(Teams2_Score>Teams1_Score))","v":0},{"$f":"SUMPRODUCT((Teams1=U54)*(Teams1_Score=Teams2_Score)*(Teams1_Score<>\"\"))+SUMPRODUCT((Teams2=U54)*(Teams2_Score=Teams1_Score)*(Teams2_Score<>\"\"))","v":0},{"$f":"SUMPRODUCT((Teams1=U54)*(Teams1_Score<Teams2_Score))+SUMPRODUCT((Teams2=U54)*(Teams2_Score<Teams1_Score))","v":0},{"$f":"SUMPRODUCT((Teams1=U54)*(Teams1_Score))+SUMPRODUCT((Teams2=U54)*(Teams2_Score))","v":0},{"$f":"SUMPRODUCT((Teams1=U54)*(Teams2_Score))+SUMPRODUCT((Teams2=U54)*(Teams1_Score))","v":0},0,0]
[null,{"$f":"VLOOKUP($D55,TABLEAU_MATCHS[#All],2,FALSE)","v":"2018-06-28"},{"$f":"VLOOKUP($D55,TABLEAU_MATCHS[#All],3,FALSE)","v":"18:00:00"},48,{"$f":"\"Groupe \"&VLOOKUP($I55,TABLEAU_TEAMS[[#All],[TEAM]:[GROUP_INITIAL_RANK]],2,FALSE)","v":"Groupe H"},6,3.4,1.52,{"$f":"VLOOKUP($D55,TABLEAU_MATCHS[#All],4,FALSE)","v":"Sénégal"},null,null,{"$f":"VLOOKUP($D55,TABLEAU_MATCHS[#All],5,FALSE)","v":"Colombie"},null,{"$f":"IF(OR(ISBLANK(RESULTATS!J55),ISBLANK(J55)),\"\",IF(AND('Kévin Sonilhac'!J55=RESULTATS!J55,'Kévin Sonilhac'!M55=RESULTATS!M55),3,IF(OR(AND('Kévin Sonilhac'!J55>'Kévin Sonilhac'!M55,RESULTATS!J55>RESULTATS!M55),AND('Kévin Sonilhac'!J55<'Kévin Sonilhac'!M55,RESULTATS!J55<RESULTATS!M55),AND('Kévin Sonilhac'!J55='Kévin Sonilhac'!M55,RESULTATS!J55=RESULTATS!M55)),1,0)))","v":""}]
[null,null,null,null,null,null,null,null,null,null,null,null,null,{"$f":"SUM(N8:N55)","v":0}]
[]
[]
[null,"Tirage au sort A1",null,null,null,null,null,null,null,null,null,null,null,null,null,null,null,null,null,"Rg","Groupe A","MJ","G","N","P","BP","BC","+/-","Pts"]
[null,{"$f":"IF(ROWS($1:1)<=COUNTIF($T$9:$T$12,1),INDEX($U$9:$U$12,SMALL(IF($T$9:$T$12=1,ROW(INDIRECT(\"1:\"&ROWS($T$9:$T$12)))),ROWS($1:1))),\"\")","v":"Uruguay"},null,null,null,null,null,null,null,null,null,null,null,null,null,null,"A_1",{"$f":"TEXT(S60,\"00000\")&U60","v":"00000Russie"},{"$f":"AC60*1000+AB60*100+Z60*10","v":0},{"$f":"RANK(S60,$S60:$S64,0)","v":1},{"$f":"VLOOKUP(Q60,TABLEAU_TEAMS[#All],2,FALSE)","v":"Russie"},{"$f":"SUMPRODUCT((Teams1=U60)*(Teams1_Score<>\"\"))+SUMPRODUCT((Teams2=U60)*(Teams2_Score<>\"\"))","v":0},{"$f":"SUMPRODUCT((Teams1=U60)*(Teams1_Score>Teams2_Score))+SUMPRODUCT((Teams2=U60)*(Teams2_Score>Teams1_Score))","v":0},{"$f":"SUMPRODUCT((Teams1=U60)*(Teams1_Score=Teams2_Score)*(Teams1_Score<>\"\"))+SUMPRODUCT((Teams2=U60)*(Teams2_Score=Teams1_Score)*(Teams2_Score<>\"\"))","v":0},{"$f":"SUMPRODUCT((Teams1=U60)*(Teams1_Score<Teams2_Score))+SUMPRODUCT((Teams2=U60)*(Teams2_Score<Teams1_Score))","v":0},{"$f":"SUMPRODUCT((Teams1=U60)*(Teams1_Score))+SUMPRODUCT((Teams2=U60)*(Teams2_Score))","v":0},{"$f":"SUMPRODUCT((Teams1=U60)*(Teams2_Score))+SUMPRODUCT((Teams2=U60)*(Teams1_Score))","v":0},{"$f":"Z60-AA60","v":0},{"$f":"3*W60+X60","v":0}]
[null,{"$f":"IF(ROWS($1:2)<=COUNTIF($T$9:$T$12,1),INDEX($U$9:$U$12,SMALL(IF($T$9:$T$12=1,ROW(INDIRECT(\"1:\"&ROWS($T$9:$T$12)))),ROWS($1:2))),\"\")","v":"Russie"},null,null,null,null,null,null,null,null,null,null,null,null,null,null,"A_2",{"$f":"TEXT(S61,\"00000\")&U61","v":"00000Arabie Saoudite"},{"$f":"AC61*1000+AB61*100+Z61*10","v":0},{"$f":"RANK(S61,$S60:$S64,0)","v":1},{"$f":"VLOOKUP(Q61,TABLEAU_TEAMS[#All],2,FALSE)","v":"Arabie Saoudite"},{"$f":"SUMPRODUCT((Teams1=U61)*(Teams1_Score<>\"\"))+SUMPRODUCT((Teams2=U61)*(Teams2_Score<>\"\"))","v":0},{"$f":"SUMPRODUCT((Teams1=U61)*(Teams1_Score>Teams2_Score))+SUMPRODUCT((Teams2=U61)*(Teams2_Score>Teams1_Score))","v":0},{"$f":"SUMPRODUCT((Teams1=U61)*(Teams1_Score=Teams2_Score)*(Teams1_Score<>\"\"))+SUMPRODUCT((Teams2=U61)*(Teams2_Score=Teams1_Score)*(Teams2_Score<>\"\"))","v":0},{"$f":"SUMPRODUCT((Teams1=U61)*(Teams1_Score<Teams2_Score))+SUMPRODUCT((Teams2=U61)*(Teams2_Score<Teams1_Score))","v":0},{"$f":"SUMPRODUCT((Teams1=U61)*(Teams1_Score))+SUMPRODUCT((Teams2=U61)*(Teams2_Score))","v":0},{"$f":"SUMPRODUCT((Teams1=U61)*(Teams2_Score))+SUMPRODUCT((Teams2=U61)*(Teams1_Score))","v":0},{"$f":"Z61-AA61","v":0},{"$f":"3*W61+X61","v":0}]
[null,{"$f":"IF(ROWS($1:3)<=COUNTIF($T$9:$T$12,1),INDEX($U$9:$U$12,SMALL(IF($T$9:$T$12=1,ROW(INDIRECT(\"1:\"&ROWS($T$9:$T$12)))),ROWS($1:3))),\"\")","v":"Egypte"},null,null,null,null,null,null,null,null,null,null,null,null,null,null,"A_3",{"$f":"TEXT(S62,\"00000\")&U62","v":"00000Egypte"},{"$f":"AC62*1000+AB62*100+Z62*10","v":0},{"$f":"RANK(S62,$S60:$S64,0)","v":1},{"$f":"VLOOKUP(Q62,TABLEAU_TEAMS[#All],2,FALSE)","v":"Egypte"},{"$f":"SUMPRODUCT((Teams1=U62)*(Teams1_Score<>\"\"))+SUMPRODUCT((Teams2=U62)*(Teams2_Score<>\"\"))","v":0},{"$f":"SUMPRODUCT((Teams1=U62)*(Teams1_Score>Teams2_Score))+SUMPRODUCT((Teams2=U62)*(Teams2_Score>Teams1_Score))","v":0},{"$f":"SUMPRODUCT((Teams1=U62)*(Teams1_Score=Teams2_Score)*(Teams1_Score<>\"\"))+SUMPRODUCT((Teams2=U62)*(Teams2_Score=Teams1_Score)*(Teams2_Score<>\"\"))","v":0},{"$f":"SUMPRODUCT((Teams1=U62)*(Teams1_Score<Teams2_Score))+SUMPRODUCT((Teams2=U62)*(Teams2_Score<Teams1_Score))","v":0},{"$f":"SUMPRODUCT((Teams1=U62)*(Teams1_Score))+SUMPRODUCT((Teams2=U62)*(Teams2_Score))","v":0},{"$f":"SUMPRODUCT((Teams1=U62)*(Teams2_Score))+SUMPRODUCT((Teams2=U62)*(Teams1_Score))","v":0},0,0]
[null,{"$f":"IF(ROWS($1:4)<=COUNTIF($T$9:$T$12,1),INDEX($U$9:$U$12,SMALL(IF($T$9:$T$12=1,ROW(INDIRECT(\"1:\"&ROWS($T$9:$T$12)))),ROWS($1:4))),\"\")","v":"Arabie Saoudite"},null,null,null,null,null,null,null,null,null,null,null,null,null,null,"A_4",{"$f":"TEXT(S63,\"00000\")&U63","v":"00000Uruguay"},{"$f":"AC63*1000+AB63*100+Z63*10","v":0},{"$f":"RANK(S63,$S60:$S64,0)","v":1},{"$f":"VLOOKUP(Q63,TABLEAU_TEAMS[#All],2,FALSE)","v":"Uruguay"},{"$f":"SUMPRODUCT((Teams1=U63)*(Teams1_Score<>\"\"))+SUMPRODUCT((Teams2=U63)*(Teams2_Score<>\"\"))","v":0},{"$f":"SUMPRODUCT((Teams1=U63)*(Teams1_Score>Teams2_Score))+SUMPRODUCT((Teams2=U63)*(Teams2_Score>Teams1_Score))","v":0},{"$f":"SUMPRODUCT((Teams1=U63)*(Teams1_Score=Teams2_Score)*(Teams1_Score<>\"\"))+SUMPRODUCT((Teams2=U63)*(Teams2_Score=Teams1_Score)*(Teams2_Score<>\"\"))","v":0},{"$f":"SUMPRODUCT((Teams1=U63)*(Teams1_Score<Teams2_Score))+SUMPRODUCT((Teams2=U63)*(Teams2_Score<Teams1_Score))","v":0},{"$f":"SUMPRODUCT((Teams1=U63)*(Teams1_Score))+SUMPRODUCT((Teams2=U63)*(Teams2_Score))","v":0},{"$f":"SUMPRODUCT((Teams1=U63)*(Teams2_Score))+SUMPRODUCT((Teams2=U63)*(Teams1_Score))","v":0},0,0]
[null,"Tirage au sort A2"]
[null,{"$f":"IF(COUNTIF($T$9:$T$12,1)>1,IF(ROWS($1:1)<=COUNTIF($T$9:$T$12,1),INDEX($U$9:$U$12,SMALL(IF($T$9:$T$12=1,ROW(INDIRECT(\"1:\"&ROWS($T$9:$T$12)))),ROWS($1:1))),\"\"),IF(COUNTIF($T$9:$T$12,2)>1,IF(ROWS($1:1)<=COUNTIF($T$9:$T$12,2),INDEX($U$9:$U$12,SMALL(IF($T$9:$T$12=2,ROW(INDIRECT(\"1:\"&ROWS($T$9:$T$12)))),ROWS($1:1))),\"\")))","v":"Uruguay"},null,null,null,null,null,null,null,null,null,null,null,null,null,null,null,null,null,"Rg","Groupe B","MJ","G","N","P","BP","BC","Pts","Pts"]
[null,{"$f":"IF(COUNTIF($T$9:$T$12,1)>1,IF(ROWS($1:2)<=COUNTIF($T$9:$T$12,1),INDEX($U$9:$U$12,SMALL(IF($T$9:$T$12=1,ROW(INDIRECT(\"1:\"&ROWS($T$9:$T$12)))),ROWS($1:2))),\"\"),IF(COUNTIF($T$9:$T$12,2)>1,IF(ROWS($1:2)<=COUNTIF($T$9:$T$12,2),INDEX($U$9:$U$12,SMALL(IF($T$9:$T$12=2,ROW(INDIRECT(\"1:\"&ROWS($T$9:$T$12)))),ROWS($1:2))),\"\")))","v":"Russie"},null,null,null,null,null,null,null,null,null,null,null,null,null,null,"B_1",{"$f":"TEXT(S66,\"00000\")&U66","v":"00000Maroc"},{"$f":"AC66*1000+AB66*100+Z66*10","v":0},{"$f":"RANK(S66,$S66:$S70,0)","v":1},{"$f":"VLOOKUP(Q66,TABLEAU_TEAMS[#All],2,FALSE)","v":"Maroc"},{"$f":"SUMPRODUCT((Teams1=U66)*(Teams1_Score<>\"\"))+SUMPRODUCT((Teams2=U66)*(Teams2_Score<>\"\"))","v":0},{"$f":"SUMPRODUCT((Teams1=U66)*(Teams1_Score>Teams2_Score))+SUMPRODUCT((Teams2=U66)*(Teams2_Score>Teams1_Score))","v":0},{"$f":"SUMPRODUCT((Teams1=U66)*(Teams1_Score=Teams2_Score)*(Teams1_Score<>\"\"))+SUMPRODUCT((Teams2=U66)*(Teams2_Score=Teams1_Score)*(Teams2_Score<>\"\"))","v":0},{"$f":"SUMPRODUCT((Teams1=U66)*(Teams1_Score<Teams2_Score))+SUMPRODUCT((Teams2=U66)*(Teams2_Score<Teams1_Score))","v":0},{"$f":"SUMPRODUCT((Teams1=U66)*(Teams1_Score))+SUMPRODUCT((Teams2=U66)*(Teams2_Score))","v":0},{"$f":"SUMPRODUCT((Teams1=U66)*(Teams2_Score))+SUMPRODUCT((Teams2=U66)*(Teams1_Score))","v":0},{"$f":"Z66-AA66","v":0},{"$f":"3*W66+X66","v":0}]
[null,{"$f":"IF(COUNTIF($T$9:$T$12,1)>1,IF(ROWS($1:3)<=COUNTIF($T$9:$T$12,1),INDEX($U$9:$U$12,SMALL(IF($T$9:$T$12=1,ROW(INDIRECT(\"1:\"&ROWS($T$9:$T$12)))),ROWS($1:3))),\"\"),IF(COUNTIF($T$9:$T$12,2)>1,IF(ROWS($1:3)<=COUNTIF($T$9:$T$12,2),INDEX($U$9:$U$12,SMALL(IF($T$9:$T$12=2,ROW(INDIRECT(\"1:\"&ROWS($T$9:$T$12)))),ROWS($1:3))),\"\")))","v":"Egypte"},null,null,null,null,null,null,null,null,null,null,null,null,null,null,"B_2",{"$f":"TEXT(S67,\"00000\")&U67","v":"00000RI Iran"},{"$f":"AC67*1000+AB67*100+Z67*10","v":0},{"$f":"RANK(S67,$S66:$S70,0)","v":1},{"$f":"VLOOKUP(Q67,TABLEAU_TEAMS[#All],2,FALSE)","v":"RI Iran"},{"$f":"SUMPRODUCT((Teams1=U67)*(Teams1_Score<>\"\"))+SUMPRODUCT((Teams2=U67)*(Teams2_Score<>\"\"))","v":0},{"$f":"SUMPRODUCT((Teams1=U67)*(Teams1_Score>Teams2_Score))+SUMPRODUCT((Teams2=U67)*(Teams2_Score>Teams1_Score))","v":0},{"$f":"SUMPRODUCT((Teams1=U67)*(Teams1_Score=Teams2_Score)*(Teams1_Score<>\"\"))+SUMPRODUCT((Teams2=U67)*(Teams2_Score=Teams1_Score)*(Teams2_Score<>\"\"))","v":0},{"$f":"SUMPRODUCT((Teams1=U67)*(Teams1_Score<Teams2_Score))+SUMPRODUCT((Teams2=U67)*(Teams2_Score<Teams1_Score))","v":0},{"$f":"SUMPRODUCT((Teams1=U67)*(Teams1_Score))+SUMPRODUCT((Teams2=U67)*(Teams2_Score))","v":0},{"$f":"SUMPRODUCT((Teams1=U67)*(Teams2_Score))+SUMPRODUCT((Teams2=U67)*(Teams1_Score))","v":0},0,0]
[null,{"$f":"IF(COUNTIF($T$9:$T$12,1)>1,IF(ROWS($1:4)<=COUNTIF($T$9:$T$12,1),INDEX($U$9:$U$12,SMALL(IF($T$9:$T$12=1,ROW(INDIRECT(\"1:\"&ROWS($T$9:$T$12)))),ROWS($1:4))),\"\"),IF(COUNTIF($T$9:$T$12,2)>1,IF(ROWS($1:4)<=COUNTIF($T$9:$T$12,2),INDEX($U$9:$U$12,SMALL(IF($T$9:$T$12=2,ROW(INDIRECT(\"1:\"&ROWS($T$9:$T$12)))),ROWS($1:4))),\"\")))","v":"Arabie Saoudite"},null,null,null,null,null,null,null,null,null,null,null,null,null,null,"B_3",{"$f":"TEXT(S68,\"00000\")&U68","v":"00000Portugal"},{"$f":"AC68*1000+AB68*100+Z68*10","v":0},{"$f":"RANK(S68,$S66:$S70,0)","v":1},{"$f":"VLOOKUP(Q68,TABLEAU_TEAMS[#All],2,FALSE)","v":"Portugal"},{"$f":"SUMPRODUCT((Teams1=U68)*(Teams1_Score<>\"\"))+SUMPRODUCT((Teams2=U68)*(Teams2_Score<>\"\"))","v":0},{"$f":"SUMPRODUCT((Teams1=U68)*(Teams1_Score>Teams2_Score))+SUMPRODUCT((Teams2=U68)*(Teams2_Score>Teams1_Score))","v":0},{"$f":"SUMPRODUCT((Teams1=U68)*(Teams1_Score=Teams2_Score)*(Teams1_Score<>\"\"))+SUMPRODUCT((Teams2=U68)*(Teams2_Score=Teams1_Score)*(Teams2_Score<>\"\"))","v":0},{"$f":"SUMPRODUCT((Teams1=U68)*(Teams1_Score<Teams2_Score))+SUMPRODUCT((Teams2=U68)*(Teams2_Score<Teams1_Score))","v":0},{"$f":"SUMPRODUCT((Teams1=U68)*(Teams1_Score))+SUMPRODUCT((Teams2=U68)*(Teams2_Score))","v":0},{"$f":"SUMPRODUCT((Teams1=U68)*(Teams2_Score))+SUMPRODUCT((Teams2=U68)*(Teams1_Score))","v":0},0,0]
[null,"Tirage au sort B1",null,null,null,null,null,null,null,null,null,null,null,null,null,null,"B_4",{"$f":"TEXT(S69,\"00000\")&U69","v":"00000Espagne"},{"$f":"AC69*1000+AB69*100+Z69*10","v":0},{"$f":"RANK(S69,$S66:$S70,0)","v":1},{"$f":"VLOOKUP(Q69,TABLEAU_TEAMS[#All],2,FALSE)","v":"Espagne"},{"$f":"SUMPRODUCT((Teams1=U69)*(Teams1_Score<>\"\"))+SUMPRODUCT((Teams2=U69)*(Teams2_Score<>\"\"))","v":0},{"$f":"SUMPRODUCT((Teams1=U69)*(Teams1_Score>Teams2_Score))+SUMPRODUCT((Teams2=U69)*(Teams2_Score>Teams1_Score))","v":0},{"$f":"SUMPRODUCT((Teams1=U69)*(Teams1_Score=Teams2_Score)*(Teams1_Score<>\"\"))+SUMPRODUCT((Teams2=U69)*(Teams2_Score=Teams1_Score)*(Teams2_Score<>\"\"))","v":0},{"$f":"SUMPRODUCT((Teams1=U69)*(Teams1_Score<Teams2_Score))+SUMPRODUCT((Teams2=U69)*(Teams2_Score<Teams1_Score))","v":0},{"$f":"SUMPRODUCT((Teams1=U69)*(Teams1_Score))+SUMPRODUCT((Teams2=U69)*(Teams2_Score))","v":0},{"$f":"SUMPRODUCT((Teams1=U69)*(Teams2_Score))+SUMPRODUCT((Teams2=U69)*(Teams1_Score))","v":0},0,0]
[null,{"$f":"IF(ROWS($1:1)<=COUNTIF($T$15:$T$18,1),INDEX($U$15:$U$18,SMALL(IF($T$15:$T$18=1,ROW(INDIRECT(\"1:\"&ROWS($T$15:$T$18)))),ROWS($1:1))),\"\")","v":"RI Iran"}]
[null,{"$f":"IF(ROWS($1:2)<=COUNTIF($T$15:$T$18,1),INDEX($U$15:$U$18,SMALL(IF($T$15:$T$18=1,ROW(INDIRECT(\"1:\"&ROWS($T$15:$T$18)))),ROWS($1:2))),\"\")","v":"Portugal"},null,null,null,null,null,null,null,null,null,null,null,null,null,null,null,null,null,"Rg","Groupe C","MJ","G","N","P","BP","BC","Pts","Pts"]
[null,{"$f":"IF(ROWS($1:3)<=COUNTIF($T$15:$T$18,1),INDEX($U$15:$U$18,SMALL(IF($T$15:$T$18=1,ROW(INDIRECT(\"1:\"&ROWS($T$15:$T$18)))),ROWS($1:3))),\"\")","v":"Maroc"},null,null,null,null,null,null,null,null,null,null,null,null,null,null,"C_1",{"$f":"TEXT(S72,\"00000\")&U72","v":"00000France"},{"$f":"AC72*1000+AB72*100+Z72*10","v":0},{"$f":"RANK(S72,$S72:$S76,0)","v":1},{"$f":"VLOOKUP(Q72,TABLEAU_TEAMS[#All],2,FALSE)","v":"France"},{"$f":"SUMPRODUCT((Teams1=U72)*(Teams1_Score<>\"\"))+SUMPRODUCT((Teams2=U72)*(Teams2_Score<>\"\"))","v":0},{"$f":"SUMPRODUCT((Teams1=U72)*(Teams1_Score>Teams2_Score))+SUMPRODUCT((Teams2=U72)*(Teams2_Score>Teams1_Score))","v":0},{"$f":"SUMPRODUCT((Teams1=U72)*(Teams1_Score=Teams2_Score)*(Teams1_Score<>\"\"))+SUMPRODUCT((Teams2=U72)*(Teams2_Score=Teams1_Score)*(Teams2_Score<>\"\"))","v":0},{"$f":"SUMPRODUCT((Teams1=U72)*(Teams1_Score<Teams2_Score))+SUMPRODUCT((Teams2=U72)*(Teams2_Score<Teams1_Score))","v":0},{"$f":"SUMPRODUCT((Teams1=U72)*(Teams1_Score))+SUMPRODUCT((Teams2=U72)*(Teams2_Score))","v":0},{"$f":"SUMPRODUCT((Teams1=U72)*(Teams2_Score))+SUMPRODUCT((Teams2=U72)*(Teams1_Score))","v":0},{"$f":"Z72-AA72","v":0},{"$f":"3*W72+X72","v":0}]
[null,{"$f":"IF(ROWS($1:4)<=COUNTIF($T$15:$T$18,1),INDEX($U$15:$U$18,SMALL(IF($T$15:$T$18=1,ROW(INDIRECT(\"1:\"&ROWS($T$15:$T$18)))),ROWS($1:4))),\"\")","v":"Espagne"},null,null,null,null,null,null,null,null,null,null,null,null,null,null,"C_2",{"$f":"TEXT(S73,\"00000\")&U73","v":"00000Australie"},{"$f":"AC73*1000+AB73*100+Z73*10","v":0},{"$f":"RANK(S73,$S72:$S76,0)","v":1},{"$f":"VLOOKUP(Q73,TABLEAU_TEAMS[#All],2,FALSE)","v":"Australie"},{"$f":"SUMPRODUCT((Teams1=U73)*(Teams1_Score<>\"\"))+SUMPRODUCT((Teams2=U73)*(Teams2_Score<>\"\"))","v":0},{"$f":"SUMPRODUCT((Teams1=U73)*(Teams1_Score>Teams2_Score))+SUMPRODUCT((Teams2=U73)*(Teams2_Score>Teams1_Score))","v":0},{"$f":"SUMPRODUCT((Teams1=U73)*(Teams1_Score=Teams2_Score)*(Teams1_Score<>\"\"))+SUMPRODUCT((Teams2=U73)*(Teams2_Score=Teams1_Score)*(Teams2_Score<>\"\"))","v":0},{"$f":"SUMPRODUCT((Teams1=U73)*(Teams1_Score<Teams2_Score))+SUMPRODUCT((Teams2=U73)*(Teams2_Score<Teams1_Score))","v":0},{"$f":"SUMPRODUCT((Teams1=U73)*(Teams1_Score))+SUMPRODUCT((Teams2=U73)*(Teams2_Score))","v":0},{"$f":"SUMPRODUCT((Teams1=U73)*(Teams2_Score))+SUMPRODUCT((Teams2=U73)*(Teams1_Score))","v":0},0,0]
[null,"Tirage au sort B2",null,null,null,null,null,null,null,null,null,null,null,null,null,null,"C_3",{"$f":"TEXT(S74,\"00000\")&U74","v":"00000Pérou"},{"$f":"AC74*1000+AB74*100+Z74*10","v":0},{"$f":"RANK(S74,$S72:$S76,0)","v":1},{"$f":"VLOOKUP(Q74,TABLEAU_TEAMS[#All],2,FALSE)","v":"Pérou"},{"$f":"SUMPRODUCT((Teams1=U74)*(Teams1_Score<>\"\"))+SUMPRODUCT((Teams2=U74)*(Teams2_Score<>\"\"))","v":0},{"$f":"SUMPRODUCT((Teams1=U74)*(Teams1_Score>Teams2_Score))+SUMPRODUCT((Teams2=U74)*(Teams2_Score>Teams1_Score))","v":0},{"$f":"SUMPRODUCT((Teams1=U74)*(Teams1_Score=Teams2_Score)*(Teams1_Score<>\"\"))+SUMPRODUCT((Teams2=U74)*(Teams2_Score=Teams1_Score)*(Teams2_Score<>\"\"))","v":0},{"$f":"SUMPRODUCT((Teams1=U74)*(Teams1_Score<Teams2_Score))+SUMPRODUCT((Teams2=U74)*(Teams2_Score<Teams1_Score))","v":0},{"$f":"SUMPRODUCT((Teams1=U74)*(Teams1_Score))+SUMPRODUCT((Teams2=U74)*(Teams2_Score))","v":0},{"$f":"SUMPRODUCT((Teams1=U74)*(Teams2_Score))+SUMPRODUCT((Teams2=U74)*(Teams1_Score))","v":0},0,0]
[null,{"$f":"IF(COUNTIF($T$15:$T$18,1)>1,IF(ROWS($1:1)<=COUNTIF($T$15:$T$18,1),INDEX($U$15:$U$18,SMALL(IF($T$15:$T$18=1,ROW(INDIRECT(\"1:\"&ROWS($T$15:$T$18)))),ROWS($1:1))),\"\"),IF(COUNTIF($T$15:$T$18,2)>1,IF(ROWS($1:1)<=COUNTIF($T$15:$T$18,2),INDEX($U$15:$U$18,SMALL(IF($T$15:$T$18=2,ROW(INDIRECT(\"1:\"&ROWS($T$15:$T$18)))),ROWS($1:1))),\"\")))","v":"RI Iran"},null,null,null,null,null,null,null,null,null,null,null,null,null,null,"C_4",{"$f":"TEXT(S75,\"00000\")&U75","v":"00000Danemark"},{"$f":"AC75*1000+AB75*100+Z75*10","v":0},{"$f":"RANK(S75,$S72:$S76,0)","v":1},{"$f":"VLOOKUP(Q75,TABLEAU_TEAMS[#All],2,FALSE)","v":"Danemark"},{"$f":"SUMPRODUCT((Teams1=U75)*(Teams1_Score<>\"\"))+SUMPRODUCT((Teams2=U75)*(Teams2_Score<>\"\"))","v":0},{"$f":"SUMPRODUCT((Teams1=U75)*(Teams1_Score>Teams2_Score))+SUMPRODUCT((Teams2=U75)*(Teams2_Score>Teams1_Score))","v":0},{"$f":"SUMPRODUCT((Teams1=U75)*(Teams1_Score=Teams2_Score)*(Teams1_Score<>\"\"))+SUMPRODUCT((Teams2=U75)*(Teams2_Score=Teams1_Score)*(Teams2_Score<>\"\"))","v":0},{"$f":"SUMPRODUCT((Teams1=U75)*(Teams1_Score<Teams2_Score))+SUMPRODUCT((Teams2=U75)*(Teams2_Score<Teams1_Score))","v":0},{"$f":"SUMPRODUCT((Teams1=U75)*(Teams1_Score))+SUMPRODUCT((Teams2=U75)*(Teams2_Score))","v":0},{"$f":"SUMPRODUCT((Teams1=U75)*(Teams2_Score))+SUMPRODUCT((Teams2=U75)*(Teams1_Score))","v":0},0,0]
[null,{"$f":"IF(COUNTIF($T$15:$T$18,1)>1,IF(ROWS($1:2)<=COUNTIF($T$15:$T$18,1),INDEX($U$15:$U$18,SMALL(IF($T$15:$T$18=1,ROW(INDIRECT(\"1:\"&ROWS($T$15:$T$18)))),ROWS($1:2))),\"\"),IF(COUNTIF($T$15:$T$18,2)>1,IF(ROWS($1:2)<=COUNTIF($T$15:$T$18,2),INDEX($U$15:$U$18,SMALL(IF($T$15:$T$18=2,ROW(INDIRECT(\"1:\"&ROWS($T$15:$T$18)))),ROWS($1:2))),\"\")))","v":"Portugal"}]
[null,{"$f":"IF(COUNTIF($T$15:$T$18,1)>1,IF(ROWS($1:3)<=COUNTIF($T$15:$T$18,1),INDEX($U$15:$U$18,SMALL(IF($T$15:$T$18=1,ROW(INDIRECT(\"1:\"&ROWS($T$15:$T$18)))),ROWS($1:3))),\"\"),IF(COUNTIF($T$15:$T$18,2)>1,IF(ROWS($1:3)<=COUNTIF($T$15:$T$18,2),INDEX($U$15:$U$18,SMALL(IF($T$15:$T$18=2,ROW(INDIRECT(\"1:\"&ROWS($T$15:$T$18)))),ROWS($1:3))),\"\")))","v":"Maroc"},null,null,null,null,null,null,null,null,null,null,null,null,null,null,null,null,null,"Rg","Groupe D","MJ","G","N","P","BP","BC","Pts","Pts"]
[null,{"$f":"IF(COUNTIF($T$15:$T$18,1)>1,IF(ROWS($1:4)<=COUNTIF($T$15:$T$18,1),INDEX($U$15:$U$18,SMALL(IF($T$15:$T$18=1,ROW(INDIRECT(\"1:\"&ROWS($T$15:$T$18)))),ROWS($1:4))),\"\"),IF(COUNTIF($T$15:$T$18,2)>1,IF(ROWS($1:4)<=COUNTIF($T$15:$T$18,2),INDEX($U$15:$U$18,SMALL(IF($T$15:$T$18=2,ROW(INDIRECT(\"1:\"&ROWS($T$15:$T$18)))),ROWS($1:4))),\"\")))","v":"Espagne"},null,null,null,null,null,null,null,null,null,null,null,null,null,null,"D_1",{"$f":"TEXT(S78,\"00000\")&U78","v":"00000Argentine"},{"$f":"AC78*1000+AB78*100+Z78*10","v":0},{"$f":"RANK(S78,$S78:$S82,0)","v":1},{"$f":"VLOOKUP(Q78,TABLEAU_TEAMS[#All],2,FALSE)","v":"Argentine"},{"$f":"SUMPRODUCT((Teams1=U78)*(Teams1_Score<>\"\"))+SUMPRODUCT((Teams2=U78)*(Teams2_Score<>\"\"))","v":0},{"$f":"SUMPRODUCT((Teams1=U78)*(Teams1_Score>Teams2_Score))+SUMPRODUCT((Teams2=U78)*(Teams2_Score>Teams1_Score))","v":0},{"$f":"SUMPRODUCT((Teams1=U78)*(Teams1_Score=Teams2_Score)*(Teams1_Score<>\"\"))+SUMPRODUCT((Teams2=U78)*(Teams2_Score=Teams1_Score)*(Teams2_Score<>\"\"))","v":0},{"$f":"SUMPRODUCT((Teams1=U78)*(Teams1_Score<Teams2_Score))+SUMPRODUCT((Teams2=U78)*(Teams2_Score<Teams1_Score))","v":0},{"$f":"SUMPRODUCT((Teams1=U78)*(Teams1_Score))+SUMPRODUCT((Teams2=U78)*(Teams2_Score))","v":0},{"$f":"SUMPRODUCT((Teams1=U78)*(Teams2_Score))+SUMPRODUCT((Teams2=U78)*(Teams1_Score))","v":0},{"$f":"Z78-AA78","v":0},{"$f":"3*W78+X78","v":0}]
[null,"Tirage au sort C1",null,null,null,null,null,null,null,null,null,null,null,null,null,null,"D_2",{"$f":"TEXT(S79,\"00000\")&U79","v":"00000Islande"},{"$f":"AC79*1000+AB79*100+Z79*10","v":0},{"$f":"RANK(S79,$S78:$S82,0)","v":1},{"$f":"VLOOKUP(Q79,TABLEAU_TEAMS[#All],2,FALSE)","v":"Islande"},{"$f":"SUMPRODUCT((Teams1=U79)*(Teams1_Score<>\"\"))+SUMPRODUCT((Teams2=U79)*(Teams2_Score<>\"\"))","v":0},{"$f":"SUMPRODUCT((Teams1=U79)*(Teams1_Score>Teams2_Score))+SUMPRODUCT((Teams2=U79)*(Teams2_Score>Teams1_Score))","v":0},{"$f":"SUMPRODUCT((Teams1=U79)*(Teams1_Score=Teams2_Score)*(Teams1_Score<>\"\"))+SUMPRODUCT((Teams2=U79)*(Teams2_Score=Teams1_Score)*(Teams2_Score<>\"\"))","v":0},{"$f":"SUMPRODUCT((Teams1=U79)*(Teams1_Score<Teams2_Score))+SUMPRODUCT((Teams2=U79)*(Teams2_Score<Teams1_Score))","v":0},{"$f":"SUMPRODUCT((Teams1=U79)*(Teams1_Score))+SUMPRODUCT((Teams2=U79)*(Teams2_Score))","v":0},{"$f":"SUMPRODUCT((Teams1=U79)*(Teams2_Score))+SUMPRODUCT((Teams2=U79)*(Teams1_Score))","v":0},0,0]
[null,{"$f":"IF(ROWS($1:1)<=COUNTIF($T$21:$T$24,1),INDEX($U$21:$U$24,SMALL(IF($T$21:$T$24=1,ROW(INDIRECT(\"1:\"&ROWS($T$21:$T$24)))),ROWS($1:1))),\"\")","v":"Pérou"},null,null,null,null,null,null,null,null,null,null,null,null,null,null,"D_3",{"$f":"TEXT(S80,\"00000\")&U80","v":"00000Croatie"},{"$f":"AC80*1000+AB80*100+Z80*10","v":0},{"$f":"RANK(S80,$S78:$S82,0)","v":1},{"$f":"VLOOKUP(Q80,TABLEAU_TEAMS[#All],2,FALSE)","v":"Croatie"},{"$f":"SUMPRODUCT((Teams1=U80)*(Teams1_Score<>\"\"))+SUMPRODUCT((Teams2=U80)*(Teams2_Score<>\"\"))","v":0},{"$f":"SUMPRODUCT((Teams1=U80)*(Teams1_Score>Teams2_Score))+SUMPRODUCT((Teams2=U80)*(Teams2_Score>Teams1_Score))","v":0},{"$f":"SUMPRODUCT((Teams1=U80)*(Teams1_Score=Teams2_Score)*(Teams1_Score<>\"\"))+SUMPRODUCT((Teams2=U80)*(Teams2_Score=Teams1_Score)*(Teams2_Score<>\"\"))","v":0},{"$f":"SUMPRODUCT((Teams1=U80)*(Teams1_Score<Teams2_Score))+SUMPRODUCT((Teams2=U80)*(Teams2_Score<Teams1_Score))","v":0},{"$f":"SUMPRODUCT((Teams1=U80)*(Teams1_Score))+SUMPRODUCT((Teams2=U80)*(Teams2_Score))","v":0},{"$f":"SUMPRODUCT((Teams1=U80)*(Teams2_Score))+SUMPRODUCT((Teams2=U80)*(Teams1_Score))","v":0},0,0]
[null,{"$f":"IF(ROWS($1:2)<=COUNTIF($T$21:$T$24,1),INDEX($U$21:$U$24,SMALL(IF($T$21:$T$24=1,ROW(INDIRECT(\"1:\"&ROWS($T$21:$T$24)))),ROWS($1:2))),\"\")","v":"France"},null,null,null,null,null,null,null,null,null,null,null,null,null,null,"D_4",{"$f":"TEXT(S81,\"00000\")&U81","v":"00000Nigeria"},{"$f":"AC81*1000+AB81*100+Z81*10","v":0},{"$f":"RANK(S81,$S78:$S82,0)","v":1},{"$f":"VLOOKUP(Q81,TABLEAU_TEAMS[#All],2,FALSE)","v":"Nigeria"},{"$f":"SUMPRODUCT((Teams1=U81)*(Teams1_Score<>\"\"))+SUMPRODUCT((Teams2=U81)*(Teams2_Score<>\"\"))","v":0},{"$f":"SUMPRODUCT((Teams1=U81)*(Teams1_Score>Teams2_Score))+SUMPRODUCT((Teams2=U81)*(Teams2_Score>Teams1_Score))","v":0},{"$f":"SUMPRODUCT((Teams1=U81)*(Teams1_Score=Teams2_Score)*(Teams1_Score<>\"\"))+SUMPRODUCT((Teams2=U81)*(Teams2_Score=Teams1_Score)*(Teams2_Score<>\"\"))","v":0},{"$f":"SUMPRODUCT((Teams1=U81)*(Teams1_Score<Teams2_Score))+SUMPRODUCT((Teams2=U81)*(Teams2_Score<Teams1_Score))","v":0},{"$f":"SUMPRODUCT((Teams1=U81)*(Teams1_Score))+SUMPRODUCT((Teams2=U81)*(Teams2_Score))","v":0},{"$f":"SUMPRODUCT((Teams1=U81)*(Teams2_Score))+SUMPRODUCT((Teams2=U81)*(Teams1_Score))","v":0},0,0]
[null,{"$f":"IF(ROWS($1:3)<=COUNTIF($T$21:$T$24,1),INDEX($U$21:$U$24,SMALL(IF($T$21:$T$24=1,ROW(INDIRECT(\"1:\"&ROWS($T$21:$T$24)))),ROWS($1:3))),\"\")","v":"Danemark"}]
[null,{"$f":"IF(ROWS($1:4)<=COUNTIF($T$21:$T$24,1),INDEX($U$21:$U$24,SMALL(IF($T$21:$T$24=1,ROW(INDIRECT(\"1:\"&ROWS($T$21:$T$24)))),ROWS($1:4))),\"\")","v":"Australie"},null,null,null,null,null,null,null,null,null,null,null,null,null,null,null,null,null,"Rg","Groupe E","MJ","G","N","P","BP","BC","Pts","Pts"]
[null,"Tirage au sort C2",null,null,null,null,null,null,null,null,null,null,null,null,null,null,"E_1",{"$f":"TEXT(S84,\"00000\")&U84","v":"00000Costa Rica"},{"$f":"AC84*1000+AB84*100+Z84*10","v":0},{"$f":"RANK(S84,$S84:$S88,0)","v":1},{"$f":"VLOOKUP(Q84,TABLEAU_TEAMS[#All],2,FALSE)","v":"Costa Rica"},{"$f":"SUMPRODUCT((Teams1=U84)*(Teams1_Score<>\"\"))+SUMPRODUCT((Teams2=U84)*(Teams2_Score<>\"\"))","v":0},{"$f":"SUMPRODUCT((Teams1=U84)*(Teams1_Score>Teams2_Score))+SUMPRODUCT((Teams2=U84)*(Teams2_Score>Teams1_Score))","v":0},{"$f":"SUMPRODUCT((Teams1=U84)*(Teams1_Score=Teams2_Score)*(Teams1_Score<>\"\"))+SUMPRODUCT((Teams2=U84)*(Teams2_Score=Teams1_Score)*(Teams2_Score<>\"\"))","v":0},{"$f":"SUMPRODUCT((Teams1=U84)*(Teams1_Score<Teams2_Score))+SUMPRODUCT((Teams2=U84)*(Teams2_Score<Teams1_Score))","v":0},{"$f":"SUMPRODUCT((Teams1=U84)*(Teams1_Score))+SUMPRODUCT((Teams2=U84)*(Teams2_Score))","v":0},{"$f":"SUMPRODUCT((Teams1=U84)*(Teams2_Score))+SUMPRODUCT((Teams2=U84)*(Teams1_Score))","v":0},{"$f":"Z84-AA84","v":0},{"$f":"3*W84+X84","v":0}]
[null,{"$f":"IF(COUNTIF($T$21:$T$24,1)>1,IF(ROWS($1:1)<=COUNTIF($T$21:$T$24,1),INDEX($U$21:$U$24,SMALL(IF($T$21:$T$24=1,ROW(INDIRECT(\"1:\"&ROWS($T$21:$T$24)))),ROWS($1:1))),\"\"),IF(COUNTIF($T$21:$T$24,2)>1,IF(ROWS($1:1)<=COUNTIF($T$21:$T$24,2),INDEX($U$21:$U$24,SMALL(IF($T$21:$T$24=2,ROW(INDIRECT(\"1:\"&ROWS($T$21:$T$24)))),ROWS($1:1))),\"\")))","v":"Pérou"},null,null,null,null,null,null,null,null,null,null,null,null,null,null,"E_2",{"$f":"TEXT(S85,\"00000\")&U85","v":"00000Serbie"},{"$f":"AC85*1000+AB85*100+Z85*10","v":0},{"$f":"RANK(S85,$S84:$S88,0)","v":1},{"$f":"VLOOKUP(Q85,TABLEAU_TEAMS[#All],2,FALSE)","v":"Serbie"},{"$f":"SUMPRODUCT((Teams1=U85)*(Teams1_Score<>\"\"))+SUMPRODUCT((Teams2=U85)*(Teams2_Score<>\"\"))","v":0},{"$f":"SUMPRODUCT((Teams1=U85)*(Teams1_Score>Teams2_Score))+SUMPRODUCT((Teams2=U85)*(Teams2_Score>Teams1_Score))","v":0},{"$f":"SUMPRODUCT((Teams1=U85)*(Teams1_Score=Teams2_Score)*(Teams1_Score<>\"\"))+SUMPRODUCT((Teams2=U85)*(Teams2_Score=Teams1_Score)*(Teams2_Score<>\"\"))","v":0},{"$f":"SUMPRODUCT((Teams1=U85)*(Teams1_Score<Teams2_Score))+SUMPRODUCT((Teams2=U85)*(Teams2_Score<Teams1_Score))","v":0},{"$f":"SUMPRODUCT((Teams1=U85)*(Teams1_Score))+SUMPRODUCT((Teams2=U85)*(Teams2_Score))","v":0},{"$f":"SUMPRODUCT((Teams1=U85)*(Teams2_Score))+SUMPRODUCT((Teams2=U85)*(Teams1_Score))","v":0},0,0]
[null,{"$f":"IF(COUNTIF($T$21:$T$24,1)>1,IF(ROWS($1:2)<=COUNTIF($T$21:$T$24,1),INDEX($U$21:$U$24,SMALL(IF($T$21:$T$24=1,ROW(INDIRECT(\"1:\"&ROWS($T$21:$T$24)))),ROWS($1:2))),\"\"),IF(COUNTIF($T$21:$T$24,2)>1,IF(ROWS($1:2)<=COUNTIF($T$21:$T$24,2),INDEX($U$21:$U$24,SMALL(IF($T$21:$T$24=2,ROW(INDIRECT(\"1:\"&ROWS($T$21:$T$24)))),ROWS($1:2))),\"\")))","v":"France"},null,null,null,null,null,null,null,null,null,null,null,null,null,null,"E_3",{"$f":"TEXT(S86,\"00000\")&U86","v":"00000Brésil"},{"$f":"AC86*1000+AB86*100+Z86*10","v":0},{"$f":"RANK(S86,$S84:$S88,0)","v":1},{"$f":"VLOOKUP(Q86,TABLEAU_TEAMS[#All],2,FALSE)","v":"Brésil"},{"$f":"SUMPRODUCT((Teams1=U86)*(Teams1_Score<>\"\"))+SUMPRODUCT((Teams2=U86)*(Teams2_Score<>\"\"))","v":0},{"$f":"SUMPRODUCT((Teams1=U86)*(Teams1_Score>Teams2_Score))+SUMPRODUCT((Teams2=U86)*(Teams2_Score>Teams1_Score))","v":0},{"$f":"SUMPRODUCT((Teams1=U86)*(Teams1_Score=Teams2_Score)*(Teams1_Score<>\"\"))+SUMPRODUCT((Teams2=U86)*(Teams2_Score=Teams1_Score)*(Teams2_Score<>\"\"))","v":0},{"$f":"SUMPRODUCT((Teams1=U86)*(Teams1_Score<Teams2_Score))+SUMPRODUCT((Teams2=U86)*(Teams2_Score<Teams1_Score))","v":0},{"$f":"SUMPRODUCT((Teams1=U86)*(Teams1_Score))+SUMPRODUCT((Teams2=U86)*(Teams2_Score))","v":0},{"$f":"SUMPRODUCT((Teams1=U86)*(Teams2_Score))+SUMPRODUCT((Teams2=U86)*(Teams1_Score))","v":0},0,0]
[null,{"$f":"IF(COUNTIF($T$21:$T$24,1)>1,IF(ROWS($1:3)<=COUNTIF($T$21:$T$24,1),INDEX($U$21:$U$24,SMALL(IF($T$21:$T$24=1,ROW(INDIRECT(\"1:\"&ROWS($T$21:$T$24)))),ROWS($1:3))),\"\"),IF(COUNTIF($T$21:$T$24,2)>1,IF(ROWS($1:3)<=COUNTIF($T$21:$T$24,2),INDEX($U$21:$U$24,SMALL(IF($T$21:$T$24=2,ROW(INDIRECT(\"1:\"&ROWS($T$21:$T$24)))),ROWS($1:3))),\"\")))","v":"Danemark"},null,null,null,null,null,null,null,null,null,null,null,null,null,null,"E_4",{"$f":"TEXT(S87,\"00000\")&U87","v":"00000Suisse"},{"$f":"AC87*1000+AB87*100+Z87*10","v":0},{"$f":"RANK(S87,$S84:$S88,0)","v":1},{"$f":"VLOOKUP(Q87,TABLEAU_TEAMS[#All],2,FALSE)","v":"Suisse"},{"$f":"SUMPRODUCT((Teams1=U87)*(Teams1_Score<>\"\"))+SUMPRODUCT((Teams2=U87)*(Teams2_Score<>\"\"))","v":0},{"$f":"SUMPRODUCT((Teams1=U87)*(Teams1_Score>Teams2_Score))+SUMPRODUCT((Teams2=U87)*(Teams2_Score>Teams1_Score))","v":0},{"$f":"SUMPRODUCT((Teams1=U87)*(Teams1_Score=Teams2_Score)*(Teams1_Score<>\"\"))+SUMPRODUCT((Teams2=U87)*(Teams2_Score=Teams1_Score)*(Teams2_Score<>\"\"))","v":0},{"$f":"SUMPRODUCT((Teams1=U87)*(Teams1_Score<Teams2_Score))+SUMPRODUCT((Teams2=U87)*(Teams2_Score<Teams1_Score))","v":0},{"$f":"SUMPRODUCT((Teams1=U87)*(Teams1_Score))+SUMPRODUCT((Teams2=U87)*(Teams2_Score))","v":0},{"$f":"SUMPRODUCT((Teams1=U87)*(Teams2_Score))+SUMPRODUCT((Teams2=U87)*(Teams1_Score))","v":0},0,0]
[null,{"$f":"IF(COUNTIF($T$21:$T$24,1)>1,IF(ROWS($1:4)<=COUNTIF($T$21:$T$24,1),INDEX($U$21:$U$24,SMALL(IF($T$21:$T$24=1,ROW(INDIRECT(\"1:\"&ROWS($T$21:$T$24)))),ROWS($1:4))),\"\"),IF(COUNTIF($T$21:$T$24,2)>1,IF(ROWS($1:4)<=COUNTIF($T$21:$T$24,2),INDEX($U$21:$U$24,SMALL(IF($T$21:$T$24=2,ROW(INDIRECT(\"1:\"&ROWS($T$21:$T$24)))),ROWS($1:4))),\"\")))","v":"Australie"}]
[null,"Tirage au sort D1",null,null,null,null,null,null,null,null,null,null,null,null,null,null,null,null,null,"Rg","Groupe F","MJ","G","N","P","BP","BC","Pts","Pts"]
[null,{"$f":"IF(ROWS($1:1)<=COUNTIF($T$27:$T$30,1),INDEX($U$27:$U$30,SMALL(IF($T$27:$T$30=1,ROW(INDIRECT(\"1:\"&ROWS($T$27:$T$30)))),ROWS($1:1))),\"\")","v":"Nigeria"},null,null,null,null,null,null,null,null,null,null,null,null,null,null,"F_1",{"$f":"TEXT(S90,\"00000\")&U90","v":"00000Allemagne"},{"$f":"AC90*1000+AB90*100+Z90*10","v":0},{"$f":"RANK(S90,$S90:$S94,0)","v":1},{"$f":"VLOOKUP(Q90,TABLEAU_TEAMS[#All],2,FALSE)","v":"Allemagne"},{"$f":"SUMPRODUCT((Teams1=U90)*(Teams1_Score<>\"\"))+SUMPRODUCT((Teams2=U90)*(Teams2_Score<>\"\"))","v":0},{"$f":"SUMPRODUCT((Teams1=U90)*(Teams1_Score>Teams2_Score))+SUMPRODUCT((Teams2=U90)*(Teams2_Score>Teams1_Score))","v":0},{"$f":"SUMPRODUCT((Teams1=U90)*(Teams1_Score=Teams2_Score)*(Teams1_Score<>\"\"))+SUMPRODUCT((Teams2=U90)*(Teams2_Score=Teams1_Score)*(Teams2_Score<>\"\"))","v":0},{"$f":"SUMPRODUCT((Teams1=U90)*(Teams1_Score<Teams2_Score))+SUMPRODUCT((Teams2=U90)*(Teams2_Score<Teams1_Score))","v":0},{"$f":"SUMPRODUCT((Teams1=U90)*(Teams1_Score))+SUMPRODUCT((Teams2=U90)*(Teams2_Score))","v":0},{"$f":"SUMPRODUCT((Teams1=U90)*(Teams2_Score))+SUMPRODUCT((Teams2=U90)*(Teams1_Score))","v":0},{"$f":"Z90-AA90","v":0},{"$f":"3*W90+X90","v":0}]
[null,{"$f":"IF(ROWS($1:2)<=COUNTIF($T$27:$T$30,1),INDEX($U$27:$U$30,SMALL(IF($T$27:$T$30=1,ROW(INDIRECT(\"1:\"&ROWS($T$27:$T$30)))),ROWS($1:2))),\"\")","v":"Islande"},null,null,null,null,null,null,null,null,null,null,null,null,null,null,"F_2",{"$f":"TEXT(S91,\"00000\")&U91","v":"00000Mexique"},{"$f":"AC91*1000+AB91*100+Z91*10","v":0},{"$f":"RANK(S91,$S90:$S94,0)","v":1},{"$f":"VLOOKUP(Q91,TABLEAU_TEAMS[#All],2,FALSE)","v":"Mexique"},{"$f":"SUMPRODUCT((Teams1=U91)*(Teams1_Score<>\"\"))+SUMPRODUCT((Teams2=U91)*(Teams2_Score<>\"\"))","v":0},{"$f":"SUMPRODUCT((Teams1=U91)*(Teams1_Score>Teams2_Score))+SUMPRODUCT((Teams2=U91)*(Teams2_Score>Teams1_Score))","v":0},{"$f":"SUMPRODUCT((Teams1=U91)*(Teams1_Score=Teams2_Score)*(Teams1_Score<>\"\"))+SUMPRODUCT((Teams2=U91)*(Teams2_Score=Teams1_Score)*(Teams2_Score<>\"\"))","v":0},{"$f":"SUMPRODUCT((Teams1=U91)*(Teams1_Score<Teams2_Score))+SUMPRODUCT((Teams2=U91)*(Teams2_Score<Teams1_Score))","v":0},{"$f":"SUMPRODUCT((Teams1=U91)*(Teams1_Score))+SUMPRODUCT((Teams2=U91)*(Teams2_Score))","v":0},{"$f":"SUMPRODUCT((Teams1=U91)*(Teams2_Score))+SUMPRODUCT((Teams2=U91)*(Teams1_Score))","v":0},0,0]
[null,{"$f":"IF(ROWS($1:3)<=COUNTIF($T$27:$T$30,1),INDEX($U$27:$U$30,SMALL(IF($T$27:$T$30=1,ROW(INDIRECT(\"1:\"&ROWS($T$27:$T$30)))),ROWS($1:3))),\"\")","v":"Croatie"},null,null,null,null,null,null,null,null,null,null,null,null,null,null,"F_3",{"$f":"TEXT(S92,\"00000\")&U92","v":"00000Suède"},{"$f":"AC92*1000+AB92*100+Z92*10","v":0},{"$f":"RANK(S92,$S90:$S94,0)","v":1},{"$f":"VLOOKUP(Q92,TABLEAU_TEAMS[#All],2,FALSE)","v":"Suède"},{"$f":"SUMPRODUCT((Teams1=U92)*(Teams1_Score<>\"\"))+SUMPRODUCT((Teams2=U92)*(Teams2_Score<>\"\"))","v":0},{"$f":"SUMPRODUCT((Teams1=U92)*(Teams1_Score>Teams2_Score))+SUMPRODUCT((Teams2=U92)*(Teams2_Score>Teams1_Score))","v":0},{"$f":"SUMPRODUCT((Teams1=U92)*(Teams1_Score=Teams2_Score)*(Teams1_Score<>\"\"))+SUMPRODUCT((Teams2=U92)*(Teams2_Score=Teams1_Score)*(Teams2_Score<>\"\"))","v":0},{"$f":"SUMPRODUCT((Teams1=U92)*(Teams1_Score<Teams2_Score))+SUMPRODUCT((Teams2=U92)*(Teams2_Score<Teams1_Score))","v":0},{"$f":"SUMPRODUCT((Teams1=U92)*(Teams1_Score))+SUMPRODUCT((Teams2=U92)*(Teams2_Score))","v":0},{"$f":"SUMPRODUCT((Teams1=U92)*(Teams2_Score))+SUMPRODUCT((Teams2=U92)*(Teams1_Score))","v":0},0,0]
[null,{"$f":"IF(ROWS($1:4)<=COUNTIF($T$27:$T$30,1),INDEX($U$27:$U$30,SMALL(IF($T$27:$T$30=1,ROW(INDIRECT(\"1:\"&ROWS($T$27:$T$30)))),ROWS($1:4))),\"\")","v":"Argentine"},null,null,null,null,null,null,null,null,null,null,null,null,null,null,"F_4",{"$f":"TEXT(S93,\"00000\")&U93","v":"00000République de Corée"},{"$f":"AC93*1000+AB93*100+Z93*10","v":0},{"$f":"RANK(S93,$S90:$S94,0)","v":1},{"$f":"VLOOKUP(Q93,TABLEAU_TEAMS[#All],2,FALSE)","v":"République de Corée"},{"$f":"SUMPRODUCT((Teams1=U93)*(Teams1_Score<>\"\"))+SUMPRODUCT((Teams2=U93)*(Teams2_Score<>\"\"))","v":0},{"$f":"SUMPRODUCT((Teams1=U93)*(Teams1_Score>Teams2_Score))+SUMPRODUCT((Teams2=U93)*(Teams2_Score>Teams1_Score))","v":0},{"$f":"SUMPRODUCT((Teams1=U93)*(Teams1_Score=Teams2_Score)*(Teams1_Score<>\"\"))+SUMPRODUCT((Teams2=U93)*(Teams2_Score=Teams1_Score)*(Teams2_Score<>\"\"))","v":0},{"$f":"SUMPRODUCT((Teams1=U93)*(Teams1_Score<Teams2_Score))+SUMPRODUCT((Teams2=U93)*(Teams2_Score<Teams1_Score))","v":0},{"$f":"SUMPRODUCT((Teams1=U93)*(Teams1_Score))+SUMPRODUCT((Teams2=U93)*(Teams2_Score))","v":0},{"$f":"SUMPRODUCT((Teams1=U93)*(Teams2_Score))+SUMPRODUCT((Teams2=U93)*(Teams1_Score))","v":0},0,0]
[null,"Tirage au sort D2"]
[null,{"$f":"IF(COUNTIF($T$27:$T$30,1)>1,IF(ROWS($1:1)<=COUNTIF($T$27:$T$30,1),INDEX($U$27:$U$30,SMALL(IF($T$27:$T$30=1,ROW(INDIRECT(\"1:\"&ROWS($T$27:$T$30)))),ROWS($1:1))),\"\"),IF(COUNTIF($T$27:$T$30,2)>1,IF(ROWS($1:1)<=COUNTIF($T$27:$T$30,2),INDEX($U$27:$U$30,SMALL(IF($T$27:$T$30=2,ROW(INDIRECT(\"1:\"&ROWS($T$27:$T$30)))),ROWS($1:1))),\"\")))","v":"Nigeria"},null,null,null,null,null,null,null,null,null,null,null,null,null,null,null,null,null,"Rg","Groupe G","MJ","G","N","P","BP","BC","Pts","Pts"]
[null,{"$f":"IF(COUNTIF($T$27:$T$30,1)>1,IF(ROWS($1:2)<=COUNTIF($T$27:$T$30,1),INDEX($U$27:$U$30,SMALL(IF($T$27:$T$30=1,ROW(INDIRECT(\"1:\"&ROWS($T$27:$T$30)))),ROWS($1:2))),\"\"),IF(COUNTIF($T$27:$T$30,2)>1,IF(ROWS($1:2)<=COUNTIF($T$27:$T$30,2),INDEX($U$27:$U$30,SMALL(IF($T$27:$T$30=2,ROW(INDIRECT(\"1:\"&ROWS($T$27:$T$30)))),ROWS($1:2))),\"\")))","v":"Islande"},null,null,null,null,null,null,null,null,null,null,null,null,null,null,"G_1",{"$f":"TEXT(S96,\"00000\")&U96","v":"00000Belgique"},{"$f":"AC96*1000+AB96*100+Z96*10","v":0},{"$f":"RANK(S96,$S96:$S100,0)","v":1},{"$f":"VLOOKUP(Q96,TABLEAU_TEAMS[#All],2,FALSE)","v":"Belgique"},{"$f":"SUMPRODUCT((Teams1=U96)*(Teams1_Score<>\"\"))+SUMPRODUCT((Teams2=U96)*(Teams2_Score<>\"\"))","v":0},{"$f":"SUMPRODUCT((Teams1=U96)*(Teams1_Score>Teams2_Score))+SUMPRODUCT((Teams2=U96)*(Teams2_Score>Teams1_Score))","v":0},{"$f":"SUMPRODUCT((Teams1=U96)*(Teams1_Score=Teams2_Score)*(Teams1_Score<>\"\"))+SUMPRODUCT((Teams2=U96)*(Teams2_Score=Teams1_Score)*(Teams2_Score<>\"\"))","v":0},{"$f":"SUMPRODUCT((Teams1=U96)*(Teams1_Score<Teams2_Score))+SUMPRODUCT((Teams2=U96)*(Teams2_Score<Teams1_Score))","v":0},{"$f":"SUMPRODUCT((Teams1=U96)*(Teams1_Score))+SUMPRODUCT((Teams2=U96)*(Teams2_Score))","v":0},{"$f":"SUMPRODUCT((Teams1=U96)*(Teams2_Score))+SUMPRODUCT((Teams2=U96)*(Teams1_Score))","v":0},{"$f":"Z96-AA96","v":0},{"$f":"3*W96+X96","v":0}]
[null,{"$f":"IF(COUNTIF($T$27:$T$30,1)>1,IF(ROWS($1:3)<=COUNTIF($T$27:$T$30,1),INDEX($U$27:$U$30,SMALL(IF($T$27:$T$30=1,ROW(INDIRECT(\"1:\"&ROWS($T$27:$T$30)))),ROWS($1:3))),\"\"),IF(COUNTIF($T$27:$T$30,2)>1,IF(ROWS($1:3)<=COUNTIF($T$27:$T$30,2),INDEX($U$27:$U$30,SMALL(IF($T$27:$T$30=2,ROW(INDIRECT(\"1:\"&ROWS($T$27:$T$30)))),ROWS($1:3))),\"\")))","v":"Croatie"},null,null,null,null,null,null,null,null,null,null,null,null,null,null,"G_2",{"$f":"TEXT(S97,\"00000\")&U97","v":"00000Panama"},{"$f":"AC97*1000+AB97*100+Z97*10","v":0},{"$f":"RANK(S97,$S96:$S100,0)","v":1},{"$f":"VLOOKUP(Q97,TABLEAU_TEAMS[#All],2,FALSE)","v":"Panama"},{"$f":"SUMPRODUCT((Teams1=U97)*(Teams1_Score<>\"\"))+SUMPRODUCT((Teams2=U97)*(Teams2_Score<>\"\"))","v":0},{"$f":"SUMPRODUCT((Teams1=U97)*(Teams1_Score>Teams2_Score))+SUMPRODUCT((Teams2=U97)*(Teams2_Score>Teams1_Score))","v":0},{"$f":"SUMPRODUCT((Teams1=U97)*(Teams1_Score=Teams2_Score)*(Teams1_Score<>\"\"))+SUMPRODUCT((Teams2=U97)*(Teams2_Score=Teams1_Score)*(Teams2_Score<>\"\"))","v":0},{"$f":"SUMPRODUCT((Teams1=U97)*(Teams1_Score<Teams2_Score))+SUMPRODUCT((Teams2=U97)*(Teams2_Score<Teams1_Score))","v":0},{"$f":"SUMPRODUCT((Teams1=U97)*(Teams1_Score))+SUMPRODUCT((Teams2=U97)*(Teams2_Score))","v":0},{"$f":"SUMPRODUCT((Teams1=U97)*(Teams2_Score))+SUMPRODUCT((Teams2=U97)*(Teams1_Score))","v":0},0,0]
[null,{"$f":"IF(COUNTIF($T$27:$T$30,1)>1,IF(ROWS($1:4)<=COUNTIF($T$27:$T$30,1),INDEX($U$27:$U$30,SMALL(IF($T$27:$T$30=1,ROW(INDIRECT(\"1:\"&ROWS($T$27:$T$30)))),ROWS($1:4))),\"\"),IF(COUNTIF($T$27:$T$30,2)>1,IF(ROWS($1:4)<=COUNTIF($T$27:$T$30,2),INDEX($U$27:$U$30,SMALL(IF($T$27:$T$30=2,ROW(INDIRECT(\"1:\"&ROWS($T$27:$T$30)))),ROWS($1:4))),\"\")))","v":"Argentine"},null,null,null,null,null,null,null,null,null,null,null,null,null,null,"G_3",{"$f":"TEXT(S98,\"00000\")&U98","v":"00000Tunisie"},{"$f":"AC98*1000+AB98*100+Z98*10","v":0},{"$f":"RANK(S98,$S96:$S100,0)","v":1},{"$f":"VLOOKUP(Q98,TABLEAU_TEAMS[#All],2,FALSE)","v":"Tunisie"},{"$f":"SUMPRODUCT((Teams1=U98)*(Teams1_Score<>\"\"))+SUMPRODUCT((Teams2=U98)*(Teams2_Score<>\"\"))","v":0},{"$f":"SUMPRODUCT((Teams1=U98)*(Teams1_Score>Teams2_Score))+SUMPRODUCT((Teams2=U98)*(Teams2_Score>Teams1_Score))","v":0},{"$f":"SUMPRODUCT((Teams1=U98)*(Teams1_Score=Teams2_Score)*(Teams1_Score<>\"\"))+SUMPRODUCT((Teams2=U98)*(Teams2_Score=Teams1_Score)*(Teams2_Score<>\"\"))","v":0},{"$f":"SUMPRODUCT((Teams1=U98)*(Teams1_Score<Teams2_Score))+SUMPRODUCT((Teams2=U98)*(Teams2_Score<Teams1_Score))","v":0},{"$f":"SUMPRODUCT((Teams1=U98)*(Teams1_Score))+SUMPRODUCT((Teams2=U98)*(Teams2_Score))","v":0},{"$f":"SUMPRODUCT((Teams1=U98)*(Teams2_Score))+SUMPRODUCT((Teams2=U98)*(Teams1_Score))","v":0},0,0]
[null,"Tirage au sort E1",null,null,null,null,null,null,null,null,null,null,null,null,null,null,"G_4",{"$f":"TEXT(S99,\"00000\")&U99","v":"00000Angleterre"},{"$f":"AC99*1000+AB99*100+Z99*10","v":0},{"$f":"RANK(S99,$S96:$S100,0)","v":1},{"$f":"VLOOKUP(Q99,TABLEAU_TEAMS[#All],2,FALSE)","v":"Angleterre"},{"$f":"SUMPRODUCT((Teams1=U99)*(Teams1_Score<>\"\"))+SUMPRODUCT((Teams2=U99)*(Teams2_Score<>\"\"))","v":0},{"$f":"SUMPRODUCT((Teams1=U99)*(Teams1_Score>Teams2_Score))+SUMPRODUCT((Teams2=U99)*(Teams2_Score>Teams1_Score))","v":0},{"$f":"SUMPRODUCT((Teams1=U99)*(Teams1_Score=Teams2_Score)*(Teams1_Score<>\"\"))+SUMPRODUCT((Teams2=U99)*(Teams2_Score=Teams1_Score)*(Teams2_Score<>\"\"))","v":0},{"$f":"SUMPRODUCT((Teams1=U99)*(Teams1_Score<Teams2_Score))+SUMPRODUCT((Teams2=U99)*(Teams2_Score<Teams1_Score))","v":0},{"$f":"SUMPRODUCT((Teams1=U99)*(Teams1_Score))+SUMPRODUCT((Teams2=U99)*(Teams2_Score))","v":0},{"$f":"SUMPRODUCT((Teams1=U99)*(Teams2_Score))+SUMPRODUCT((Teams2=U99)*(Teams1_Score))","v":0},0,0]
[null,{"$f":"IF(ROWS($1:1)<=COUNTIF($T$33:$T$36,1),INDEX($U$33:$U$36,SMALL(IF($T$33:$T$36=1,ROW(INDIRECT(\"1:\"&ROWS($T$33:$T$36)))),ROWS($1:1))),\"\")","v":"Suisse"}]
[null,{"$f":"IF(ROWS($1:2)<=COUNTIF($T$33:$T$36,1),INDEX($U$33:$U$36,SMALL(IF($T$33:$T$36=1,ROW(INDIRECT(\"1:\"&ROWS($T$33:$T$36)))),ROWS($1:2))),\"\")","v":"Serbie"},null,null,null,null,null,null,null,null,null,null,null,null,null,null,null,null,null,"Rg","Groupe H","MJ","G","N","P","BP","BC","Pts","Pts"]
[null,{"$f":"IF(ROWS($1:3)<=COUNTIF($T$33:$T$36,1),INDEX($U$33:$U$36,SMALL(IF($T$33:$T$36=1,ROW(INDIRECT(\"1:\"&ROWS($T$33:$T$36)))),ROWS($1:3))),\"\")","v":"Costa Rica"},null,null,null,null,null,null,null,null,null,null,null,null,null,null,"H_1",{"$f":"TEXT(S102,\"00000\")&U102","v":"00000Colombie"},{"$f":"AC102*1000+AB102*100+Z102*10","v":0},{"$f":"RANK(S102,$S102:$S106,0)","v":1},{"$f":"VLOOKUP(Q102,TABLEAU_TEAMS[#All],2,FALSE)","v":"Colombie"},{"$f":"SUMPRODUCT((Teams1=U102)*(Teams1_Score<>\"\"))+SUMPRODUCT((Teams2=U102)*(Teams2_Score<>\"\"))","v":0},{"$f":"SUMPRODUCT((Teams1=U102)*(Teams1_Score>Teams2_Score))+SUMPRODUCT((Teams2=U102)*(Teams2_Score>Teams1_Score))","v":0},{"$f":"SUMPRODUCT((Teams1=U102)*(Teams1_Score=Teams2_Score)*(Teams1_Score<>\"\"))+SUMPRODUCT((Teams2=U102)*(Teams2_Score=Teams1_Score)*(Teams2_Score<>\"\"))","v":0},{"$f":"SUMPRODUCT((Teams1=U102)*(Teams1_Score<Teams2_Score))+SUMPRODUCT((Teams2=U102)*(Teams2_Score<Teams1_Score))","v":0},{"$f":"SUMPRODUCT((Teams1=U102)*(Teams1_Score))+SUMPRODUCT((Teams2=U102)*(Teams2_Score))","v":0},{"$f":"SUMPRODUCT((Teams1=U102)*(Teams2_Score))+SUMPRODUCT((Teams2=U102)*(Teams1_Score))","v":0},{"$f":"Z102-AA102","v":0},{"$f":"3*W102+X102","v":0}]
[null,{"$f":"IF(ROWS($1:4)<=COUNTIF($T$33:$T$36,1),INDEX($U$33:$U$36,SMALL(IF($T$33:$T$36=1,ROW(INDIRECT(\"1:\"&ROWS($T$33:$T$36)))),ROWS($1:4))),\"\")","v":"Brésil"},null,null,null,null,null,null,null,null,null,null,null,null,null,null,"H_2",{"$f":"TEXT(S103,\"00000\")&U103","v":"00000Japon"},{"$f":"AC103*1000+AB103*100+Z103*10","v":0},{"$f":"RANK(S103,$S102:$S106,0)","v":1},{"$f":"VLOOKUP(Q103,TABLEAU_TEAMS[#All],2,FALSE)","v":"Japon"},{"$f":"SUMPRODUCT((Teams1=U103)*(Teams1_Score<>\"\"))+SUMPRODUCT((Teams2=U103)*(Teams2_Score<>\"\"))","v":0},{"$f":"SUMPRODUCT((Teams1=U103)*(Teams1_Score>Teams2_Score))+SUMPRODUCT((Teams2=U103)*(Teams2_Score>Teams1_Score))","v":0},{"$f":"SUMPRODUCT((Teams1=U103)*(Teams1_Score=Teams2_Score)*(Teams1_Score<>\"\"))+SUMPRODUCT((Teams2=U103)*(Teams2_Score=Teams1_Score)*(Teams2_Score<>\"\"))","v":0},{"$f":"SUMPRODUCT((Teams1=U103)*(Teams1_Score<Teams2_Score))+SUMPRODUCT((Teams2=U103)*(Teams2_Score<Teams1_Score))","v":0},{"$f":"SUMPRODUCT((Teams1=U103)*(Teams1_Score))+SUMPRODUCT((Teams2=U103)*(Teams2_Score))","v":0},{"$f":"SUMPRODUCT((Teams1=U103)*(Teams2_Score))+SUMPRODUCT((Teams2=U103)*(Teams1_Score))","v":0},0,0]
[null,"Tirage au sort E2",null,null,null,null,null,null,null,null,null,null,null,null,null,null,"H_3",{"$f":"TEXT(S104,\"00000\")&U104","v":"00000Pologne"},{"$f":"AC104*1000+AB104*100+Z104*10","v":0},{"$f":"RANK(S104,$S102:$S106,0)","v":1},{"$f":"VLOOKUP(Q104,TABLEAU_TEAMS[#All],2,FALSE)","v":"Pologne"},{"$f":"SUMPRODUCT((Teams1=U104)*(Teams1_Score<>\"\"))+SUMPRODUCT((Teams2=U104)*(Teams2_Score<>\"\"))","v":0},{"$f":"SUMPRODUCT((Teams1=U104)*(Teams1_Score>Teams2_Score))+SUMPRODUCT((Teams2=U104)*(Teams2_Score>Teams1_Score))","v":0},{"$f":"SUMPRODUCT((Teams1=U104)*(Teams1_Score=Teams2_Score)*(Teams1_Score<>\"\"))+SUMPRODUCT((Teams2=U104)*(Teams2_Score=Teams1_Score)*(Teams2_Score<>\"\"))","v":0},{"$f":"SUMPRODUCT((Teams1=U104)*(Teams1_Score<Teams2_Score))+SUMPRODUCT((Teams2=U104)*(Teams2_Score<Teams1_Score))","v":0},{"$f":"SUMPRODUCT((Teams1=U104)*(Teams1_Score))+SUMPRODUCT((Teams2=U104)*(Teams2_Score))","v":0},{"$f":"SUMPRODUCT((Teams1=U104)*(Teams2_Score))+SUMPRODUCT((Teams2=U104)*(Teams1_Score))","v":0},0,0]
[null,{"$f":"IF(COUNTIF($T$33:$T$36,1)>1,IF(ROWS($1:1)<=COUNTIF($T$33:$T$36,1),INDEX($U$33:$U$36,SMALL(IF($T$33:$T$36=1,ROW(INDIRECT(\"1:\"&ROWS($T$33:$T$36)))),ROWS($1:1))),\"\"),IF(COUNTIF($T$33:$T$36,2)>1,IF(ROWS($1:1)<=COUNTIF($T$33:$T$36,2),INDEX($U$33:$U$36,SMALL(IF($T$33:$T$36=2,ROW(INDIRECT(\"1:\"&ROWS($T$33:$T$36)))),ROWS($1:1))),\"\")))","v":"Suisse"},null,null,null,null,null,null,null,null,null,null,null,null,null,null,"H_4",{"$f":"TEXT(S105,\"00000\")&U105","v":"00000Sénégal"},{"$f":"AC105*1000+AB105*100+Z105*10","v":0},{"$f":"RANK(S105,$S102:$S106,0)","v":1},{"$f":"VLOOKUP(Q105,TABLEAU_TEAMS[#All],2,FALSE)","v":"Sénégal"},{"$f":"SUMPRODUCT((Teams1=U105)*(Teams1_Score<>\"\"))+SUMPRODUCT((Teams2=U105)*(Teams2_Score<>\"\"))","v":0},{"$f":"SUMPRODUCT((Teams1=U105)*(Teams1_Score>Teams2_Score))+SUMPRODUCT((Teams2=U105)*(Teams2_Score>Teams1_Score))","v":0},{"$f":"SUMPRODUCT((Teams1=U105)*(Teams1_Score=Teams2_Score)*(Teams1_Score<>\"\"))+SUMPRODUCT((Teams2=U105)*(Teams2_Score=Teams1_Score)*(Teams2_Score<>\"\"))","v":0},{"$f":"SUMPRODUCT((Teams1=U105)*(Teams1_Score<Teams2_Score))+SUMPRODUCT((Teams2=U105)*(Teams2_Score<Teams1_Score))","v":0},{"$f":"SUMPRODUCT((Teams1=U105)*(Teams1_Score))+SUMPRODUCT((Teams2=U105)*(Teams2_Score))","v":0},{"$f":"SUMPRODUCT((Teams1=U105)*(Teams2_Score))+SUMPRODUCT((Teams2=U105)*(Teams1_Score))","v":0},0,0]
[null,{"$f":"IF(COUNTIF($T$33:$T$36,1)>1,IF(ROWS($1:2)<=COUNTIF($T$33:$T$36,1),INDEX($U$33:$U$36,SMALL(IF($T$33:$T$36=1,ROW(INDIRECT(\"1:\"&ROWS($T$33:$T$36)))),ROWS($1:2))),\"\"),IF(COUNTIF($T$33:$T$36,2)>1,IF(ROWS($1:2)<=COUNTIF($T$33:$T$36,2),INDEX($U$33:$U$36,SMALL(IF($T$33:$T$36=2,ROW(INDIRECT(\"1:\"&ROWS($T$33:$T$36)))),ROWS($1:2))),\"\")))","v":"Serbie"}]
[null,{"$f":"IF(COUNTIF($T$33:$T$36,1)>1,IF(ROWS($1:3)<=COUNTIF($T$33:$T$36,1),INDEX($U$33:$U$36,SMALL(IF($T$33:$T$36=1,ROW(INDIRECT(\"1:\"&ROWS($T$33:$T$36)))),ROWS($1:3))),\"\"),IF(COUNTIF($T$33:$T$36,2)>1,IF(ROWS($1:3)<=COUNTIF($T$33:$T$36,2),INDEX($U$33:$U$36,SMALL(IF($T$33:$T$36=2,ROW(INDIRECT(\"1:\"&ROWS($T$33:$T$36)))),ROWS($1:3))),\"\")))","v":"Costa Rica"}]
[null,{"$f":"IF(COUNTIF($T$33:$T$36,1)>1,IF(ROWS($1:4)<=COUNTIF($T$33:$T$36,1),INDEX($U$33:$U$36,SMALL(IF($T$33:$T$36=1,ROW(INDIRECT(\"1:\"&ROWS($T$33:$T$36)))),ROWS($1:4))),\"\"),IF(COUNTIF($T$33:$T$36,2)>1,IF(ROWS($1:4)<=COUNTIF($T$33:$T$36,2),INDEX($U$33:$U$36,SMALL(IF($T$33:$T$36=2,ROW(INDIRECT(\"1:\"&ROWS($T$33:$T$36)))),ROWS($1:4))),\"\")))","v":"Brésil"}]
[null,"Tirage au sort F1"]
[null,{"$f":"IF(ROWS($1:1)<=COUNTIF($T$39:$T$42,1),INDEX($U$39:$U$42,SMALL(IF($T$39:$T$42=1,ROW(INDIRECT(\"1:\"&ROWS($T$39:$T$42)))),ROWS($1:1))),\"\")","v":"Suède"}]
[null,{"$f":"IF(ROWS($1:2)<=COUNTIF($T$39:$T$42,1),INDEX($U$39:$U$42,SMALL(IF($T$39:$T$42=1,ROW(INDIRECT(\"1:\"&ROWS($T$39:$T$42)))),ROWS($1:2))),\"\")","v":"République de Corée"}]
[null,{"$f":"IF(ROWS($1:3)<=COUNTIF($T$39:$T$42,1),INDEX($U$39:$U$42,SMALL(IF($T$39:$T$42=1,ROW(INDIRECT(\"1:\"&ROWS($T$39:$T$42)))),ROWS($1:3))),\"\")","v":"Mexique"}]
[null,{"$f":"IF(ROWS($1:4)<=COUNTIF($T$39:$T$42,1),INDEX($U$39:$U$42,SMALL(IF($T$39:$T$42=1,ROW(INDIRECT(\"1:\"&ROWS($T$39:$T$42)))),ROWS($1:4))),\"\")","v":"Allemagne"}]
[null,"Tirage au sort F2"]
[null,{"$f":"IF(COUNTIF($T$39:$T$42,1)>1,IF(ROWS($1:1)<=COUNTIF($T$39:$T$42,1),INDEX($U$39:$U$42,SMALL(IF($T$39:$T$42=1,ROW(INDIRECT(\"1:\"&ROWS($T$39:$T$42)))),ROWS($1:1))),\"\"),IF(COUNTIF($T$39:$T$42,2)>1,IF(ROWS($1:1)<=COUNTIF($T$39:$T$42,2),INDEX($U$39:$U$42,SMALL(IF($T$39:$T$42=2,ROW(INDIRECT(\"1:\"&ROWS($T$39:$T$42)))),ROWS($1:1))),\"\")))","v":"Suède"}]
[null,{"$f":"IF(COUNTIF($T$39:$T$42,1)>1,IF(ROWS($1:2)<=COUNTIF($T$39:$T$42,1),INDEX($U$39:$U$42,SMALL(IF($T$39:$T$42=1,ROW(INDIRECT(\"1:\"&ROWS($T$39:$T$42)))),ROWS($1:2))),\"\"),IF(COUNTIF($T$39:$T$42,2)>1,IF(ROWS($1:2)<=COUNTIF($T$39:$T$42,2),INDEX($U$39:$U$42,SMALL(IF($T$39:$T$42=2,ROW(INDIRECT(\"1:\"&ROWS($T$39:$T$42)))),ROWS($1:2))),\"\")))","v":"République de Corée"}]
[null,{"$f":"IF(COUNTIF($T$39:$T$42,1)>1,IF(ROWS($1:3)<=COUNTIF($T$39:$T$42,1),INDEX($U$39:$U$42,SMALL(IF($T$39:$T$42=1,ROW(INDIRECT(\"1:\"&ROWS($T$39:$T$42)))),ROWS($1:3))),\"\"),IF(COUNTIF($T$39:$T$42,2)>1,IF(ROWS($1:3)<=COUNTIF($T$39:$T$42,2),INDEX($U$39:$U$42,SMALL(IF($T$39:$T$42=2,ROW(INDIRECT(\"1:\"&ROWS($T$39:$T$42)))),ROWS($1:3))),\"\")))","v":"Mexique"}]
[null,{"$f":"IF(COUNTIF($T$39:$T$42,1)>1,IF(ROWS($1:4)<=COUNTIF($T$39:$T$42,1),INDEX($U$39:$U$42,SMALL(IF($T$39:$T$42=1,ROW(INDIRECT(\"1:\"&ROWS($T$39:$T$42)))),ROWS($1:4))),\"\"),IF(COUNTIF($T$39:$T$42,2)>1,IF(ROWS($1:4)<=COUNTIF($T$39:$T$42,2),INDEX($U$39:$U$42,SMALL(IF($T$39:$T$42=2,ROW(INDIRECT(\"1:\"&ROWS($T$39:$T$42)))),ROWS($1:4))),\"\")))","v":"Allemagne"}]
[null,"Tirage au sort G1"]
[null,{"$f":"IF(ROWS($1:1)<=COUNTIF($T$45:$T$48,1),INDEX($U$45:$U$48,SMALL(IF($T$45:$T$48=1,ROW(INDIRECT(\"1:\"&ROWS($T$45:$T$48)))),ROWS($1:1))),\"\")","v":"Tunisie"}]
[null,{"$f":"IF(ROWS($1:2)<=COUNTIF($T$45:$T$48,1),INDEX($U$45:$U$48,SMALL(IF($T$45:$T$48=1,ROW(INDIRECT(\"1:\"&ROWS($T$45:$T$48)))),ROWS($1:2))),\"\")","v":"Panama"}]
[null,{"$f":"IF(ROWS($1:3)<=COUNTIF($T$45:$T$48,1),INDEX($U$45:$U$48,SMALL(IF($T$45:$T$48=1,ROW(INDIRECT(\"1:\"&ROWS($T$45:$T$48)))),ROWS($1:3))),\"\")","v":"Belgique"}]
[null,{"$f":"IF(ROWS($1:4)<=COUNTIF($T$45:$T$48,1),INDEX($U$45:$U$48,SMALL(IF($T$45:$T$48=1,ROW(INDIRECT(\"1:\"&ROWS($T$45:$T$48)))),ROWS($1:4))),\"\")","v":"Angleterre"}]
[null,"Tirage au sort G2"]
[null,{"$f":"IF(COUNTIF($T$45:$T$48,1)>1,IF(ROWS($1:1)<=COUNTIF($T$45:$T$48,1),INDEX($U$45:$U$48,SMALL(IF($T$45:$T$48=1,ROW(INDIRECT(\"1:\"&ROWS($T$45:$T$48)))),ROWS($1:1))),\"\"),IF(COUNTIF($T$45:$T$48,2)>1,IF(ROWS($1:1)<=COUNTIF($T$45:$T$48,2),INDEX($U$45:$U$48,SMALL(IF($T$45:$T$48=2,ROW(INDIRECT(\"1:\"&ROWS($T$45:$T$48)))),ROWS($1:1))),\"\")))","v":"Tunisie"}]
[null,{"$f":"IF(COUNTIF($T$45:$T$48,1)>1,IF(ROWS($1:2)<=COUNTIF($T$45:$T$48,1),INDEX($U$45:$U$48,SMALL(IF($T$45:$T$48=1,ROW(INDIRECT(\"1:\"&ROWS($T$45:$T$48)))),ROWS($1:2))),\"\"),IF(COUNTIF($T$45:$T$48,2)>1,IF(ROWS($1:2)<=COUNTIF($T$45:$T$48,2),INDEX($U$45:$U$48,SMALL(IF($T$45:$T$48=2,ROW(INDIRECT(\"1:\"&ROWS($T$45:$T$48)))),ROWS($1:2))),\"\")))","v":"Panama"}]
[null,{"$f":"IF(COUNTIF($T$45:$T$48,1)>1,IF(ROWS($1:3)<=COUNTIF($T$45:$T$48,1),INDEX($U$45:$U$48,SMALL(IF($T$45:$T$48=1,ROW(INDIRECT(\"1:\"&ROWS($T$45:$T$48)))),ROWS($1:3))),\"\"),IF(COUNTIF($T$45:$T$48,2)>1,IF(ROWS($1:3)<=COUNTIF($T$45:$T$48,2),INDEX($U$45:$U$48,SMALL(IF($T$45:$T$48=2,ROW(INDIRECT(\"1:\"&ROWS($T$45:$T$48)))),ROWS($1:3))),\"\")))","v":"Belgique"}]
[null,{"$f":"IF(COUNTIF($T$45:$T$48,1)>1,IF(ROWS($1:4)<=COUNTIF($T$45:$T$48,1),INDEX($U$45:$U$48,SMALL(IF($T$45:$T$48=1,ROW(INDIRECT(\"1:\"&ROWS($T$45:$T$48)))),ROWS($1:4))),\"\"),IF(COUNTIF($T$45:$T$48,2)>1,IF(ROWS($1:4)<=COUNTIF($T$45:$T$48,2),INDEX($U$45:$U$48,SMALL(IF($T$45:$T$48=2,ROW(INDIRECT(\"1:\"&ROWS($T$45:$T$48)))),ROWS($1:4))),\"\")))","v":"Angleterre"}]
[null,"Tirage au sort H1"]
[null,{"$f":"IF(ROWS($1:1)<=COUNTIF($T$51:$T$54,1),INDEX($U$51:$U$54,SMALL(IF($T$51:$T$54=1,ROW(INDIRECT(\"1:\"&ROWS($T$51:$T$54)))),ROWS($1:1))),\"\")","v":"Sénégal"}]
[null,{"$f":"IF(ROWS($1:2)<=COUNTIF($T$51:$T$54,1),INDEX($U$51:$U$54,SMALL(IF($T$51:$T$54=1,ROW(INDIRECT(\"1:\"&ROWS($T$51:$T$54)))),ROWS($1:2))),\"\")","v":"Pologne"}]
[null,{"$f":"IF(ROWS($1:3)<=COUNTIF($T$51:$T$54,1),INDEX($U$51:$U$54,SMALL(IF($T$51:$T$54=1,ROW(INDIRECT(\"1:\"&ROWS($T$51:$T$54)))),ROWS($1:3))),\"\")","v":"Japon"}]
[null,{"$f":"IF(ROWS($1:4)<=COUNTIF($T$51:$T$54,1),INDEX($U$51:$U$54,SMALL(IF($T$51:$T$54=1,ROW(INDIRECT(\"1:\"&ROWS($T$51:$T$54)))),ROWS($1:4))),\"\")","v":"Colombie"}]
[null,"Tirage au sort H2"]
[null,{"$f":"IF(COUNTIF($T$51:$T$54,1)>1,IF(ROWS($1:1)<=COUNTIF($T$51:$T$54,1),INDEX($U$51:$U$54,SMALL(IF($T$51:$T$54=1,ROW(INDIRECT(\"1:\"&ROWS($T$51:$T$54)))),ROWS($1:1))),\"\"),IF(COUNTIF($T$51:$T$54,2)>1,IF(ROWS($1:1)<=COUNTIF($T$51:$T$54,2),INDEX($U$51:$U$54,SMALL(IF($T$51:$T$54=2,ROW(INDIRECT(\"1:\"&ROWS($T$51:$T$54)))),ROWS($1:1))),\"\")))","v":"Sénégal"}]
[null,{"$f":"IF(COUNTIF($T$51:$T$54,1)>1,IF(ROWS($1:2)<=COUNTIF($T$51:$T$54,1),INDEX($U$51:$U$54,SMALL(IF($T$51:$T$54=1,ROW(INDIRECT(\"1:\"&ROWS($T$51:$T$54)))),ROWS($1:2))),\"\"),IF(COUNTIF($T$51:$T$54,2)>1,IF(ROWS($1:2)<=COUNTIF($T$51:$T$54,2),INDEX($U$51:$U$54,SMALL(IF($T$51:$T$54=2,ROW(INDIRECT(\"1:\"&ROWS($T$51:$T$54)))),ROWS($1:2))),\"\")))","v":"Pologne"}]
[null,{"$f":"IF(COUNTIF($T$51:$T$54,1)>1,IF(ROWS($1:3)<=COUNTIF($T$51:$T$54,1),INDEX($U$51:$U$54,SMALL(IF($T$51:$T$54=1,ROW(INDIRECT(\"1:\"&ROWS($T$51:$T$54)))),ROWS($1:3))),\"\"),IF(COUNTIF($T$51:$T$54,2)>1,IF(ROWS($1:3)<=COUNTIF($T$51:$T$54,2),INDEX($U$51:$U$54,SMALL(IF($T$51:$T$54=2,ROW(INDIRECT(\"1:\"&ROWS($T$51:$T$54)))),ROWS($1:3))),\"\")))","v":"Japon"}]
[null,{"$f":"IF(COUNTIF($T$51:$T$54,1)>1,IF(ROWS($1:4)<=COUNTIF($T$51:$T$54,1),INDEX($U$51:$U$54,SMALL(IF($T$51:$T$54=1,ROW(INDIRECT(\"1:\"&ROWS($T$51:$T$54)))),ROWS($1:4))),\"\"),IF(COUNTIF($T$51:$T$54,2)>1,IF(ROWS($1:4)<=COUNTIF($T$51:$T$54,2),INDEX($U$51:$U$54,SMALL(IF($T$51:$T$54=2,ROW(INDIRECT(\"1:\"&ROWS($T$51:$T$54)))),ROWS($1:4))),\"\")))","v":"Colombie"}]

{"sheet":"Pronostiqueur 2","index":6,"n_rows":138,"n_cols":46,"rows_kept":138,"cut":false,"hidden":false,"merged":[[2,1,2,8],[3,1,3,8],[3,9,3,12]]}
[]
[null,"Pronostics de :"]
[]
[null,{"$f":"MID(CELL(\"filename\",A1),FIND(\"]\",CELL(\"filename\",A1))+1,32)","v":"Pronostiqueur 2"}]
[]
[null,"SAISIE DES PRONOSTICS",null,null,null,null,null,null,null,null,null,null,null,null,null,null,null,null,null,"GROUPES",null,null,null,null,null,null,null,null,null,null,null,null,"SCORE PRONOSTIQUEUR",null,null,null,null,null,null,null,null,{"$f":"AN8+AN12","v":0}]
[null,"Date","Heure","Match","Groupe",1,"N",2,null,"Buts",null,null,"Buts"]
[null,{"$f":"VLOOKUP($D8,TABLEAU_MATCHS[#All],2,FALSE)","v":"2018-06-14"},{"$f":"VLOOKUP($D8,TABLEAU_MATCHS[#All],3,FALSE)","v":"18:00:00"},1,{"$f":"\"Groupe \"&VLOOKUP($I8,TABLEAU_TEAMS[[#All],[TEAM]:[GROUP_INITIAL_RANK]],2,FALSE)","v":"Groupe A"},1.3,4.3,10,{"$f":"VLOOKUP($D8,TABLEAU_MATCHS[#All],4,FALSE)","v":"Russie"},null,null,{"$f":"VLOOKUP($D8,TABLEAU_MATCHS[#All],5,FALSE)","v":"Arabie Saoudite"},null,{"$f":"IF(OR(ISBLANK(RESULTATS!J8),ISBLANK(J8)),\"\",IF(AND('Pronostiqueur 2'!J8=RESULTATS!J8,'Pronostiqueur 2'!M8=RESULTATS!M8),3,IF(OR(AND('Pronostiqueur 2'!J8>'Pronostiqueur 2'!M8,RESULTATS!J8>RESULTATS!M8),AND('Pronostiqueur 2'!J8<'Pronostiqueur 2'!M8,RESULTATS!J8<RESULTATS!M8),AND('Pronostiqueur 2'!J8='Pronostiqueur 2'!M8,RESULTATS!J8=RESULTATS!M8)),1,0)))","v":""},null,null,null,null,null,"Rg","Groupe A","MJ","G","N","P","BP","BC","+/-","Pts",null,null,null,"Phases de groupes",null,null,null,null,null,null,{"$f":"N56","v":0},null,"points"]
[null,{"$f":"VLOOKUP($D9,TABLEAU_MATCHS[#All],2,FALSE)","v":"2018-06-15"},{"$f":"VLOOKUP($D9,TABLEAU_MATCHS[#All],3,FALSE)","v":"17:00:00"},2,{"$f":"\"Groupe \"&VLOOKUP($I9,TABLEAU_TEAMS[[#All],[TEAM]:[GROUP_INITIAL_RANK]],2,FALSE)","v":"Groupe A"},2.2000000000000002,2.9,3.25,{"$f":"VLOOKUP($D9,TABLEAU_MATCHS[#All],4,FALSE)","v":"Egypte"},null,null,{"$f":"VLOOKUP($D9,TABLEAU_MATCHS[#All],5,FALSE)","v":"Uruguay"},null,{"$f":"IF(OR(ISBLANK(RESULTATS!J9),ISBLANK(J9)),\"\",IF(AND('Pronostiqueur 2'!J9=RESULTATS!J9,'Pronostiqueur 2'!M9=RESULTATS!M9),3,IF(OR(AND('Pronostiqueur 2'!J9>'Pronostiqueur 2'!M9,RESULTATS!J9>RESULTATS!M9),AND('Pronostiqueur 2'!J9<'Pronostiqueur 2'!M9,RESULTATS!J9<RESULTATS!M9),AND('Pronostiqueur 2'!J9='Pronostiqueur 2'!M9,RESULTATS!J9=RESULTATS!M9)),1,0)))","v":""},null,null,null,{"$f":"INDEX($R60:$R63,MATCH(SMALL(COUNTIF($R60:$R63,\">=\"&$R60:$R63),ROW(INDIRECT(\"1:\"&ROWS($R60:$R63)))),COUNTIF($R60:$R63,\">=\"&$R60:$R63),0))","v":"00000Uruguay"},{"$f":"INDEX($S60:$S63,MATCH(SMALL(COUNTIF($R60:$R63,\">=\"&$R60:$R63),ROW(INDIRECT(\"1:\"&ROWS($R60:$R63)))),COUNTIF($R60:$R63,\">=\"&$R60:$R63),0))","v":0},{"$f":"INDEX($T60:$T63,MATCH(SMALL(COUNTIF($R60:$R63,\">=\"&$R60:$R63),ROW(INDIRECT(\"1:\"&ROWS($R60:$R63)))),COUNTIF($R60:$R63,\">=\"&$R60:$R63),0))","v":1},{"$f":"INDEX($U60:$U63,MATCH(SMALL(COUNTIF($R60:$R63,\">=\"&$R60:$R63),ROW(INDIRECT(\"1:\"&ROWS($R60:$R63)))),COUNTIF($R60:$R63,\">=\"&$R60:$R63),0))","v":"Uruguay"},{"$f":"SUMPRODUCT((Teams1=U9)*(Teams1_Score<>\"\"))+SUMPRODUCT((Teams2=U9)*(Teams2_Score<>\"\"))","v":0},{"$f":"SUMPRODUCT((Teams1=U9)*(Teams1_Score>Teams2_Score))+SUMPRODUCT((Teams2=U9)*(Teams2_Score>Teams1_Score))","v":0},{"$f":"SUMPRODUCT((Teams1=U9)*(Teams1_Score=Teams2_Score)*(Teams1_Score<>\"\"))+SUMPRODUCT((Teams2=U9)*(Teams2_Score=Teams1_Score)*(Teams2_Score<>\"\"))","v":0},{"$f":"SUMPRODUCT((Teams1=U9)*(Teams1_Score<Teams2_Score))+SUMPRODUCT((Teams2=U9)*(Teams2_Score<Teams1_Score))","v":0},{"$f":"SUMPRODUCT((Teams1=U9)*(Teams1_Score))+SUMPRODUCT((Teams2=U9)*(Teams2_Score))","v":0},{"$f":"SUMPRODUCT((Teams1=U9)*(Teams2_Score))+SUMPRODUCT((Teams2=U9)*(Teams1_Score))","v":0},{"$f":"Z9-AA9","v":0},{"$f":"3*W9+X9","v":0},null,null,null,"Vainqueur ou nul trouvé (1 pt)",null,null,{"$f":"COUNTIF($N$8:$N$55,1)+COUNTIF($N$8:$N$55,3)","v":0},"matchs",null,null,{"$f":"AJ9","v":0},null,"points"]
[null,{"$f":"VLOOKUP($D10,TABLEAU_MATCHS[#All],2,FALSE)","v":"2018-06-15"},{"$f":"VLOOKUP($D10,TABLEAU_MATCHS[#All],3,FALSE)","v":"18:00:00"},3,{"$f":"\"Groupe \"&VLOOKUP($I10,TABLEAU_TEAMS[[#All],[TEAM]:[GROUP_INITIAL_RANK]],2,FALSE)","v":"Groupe B"},1.8,3.05,4.5,{"$f":"VLOOKUP($D10,TABLEAU_MATCHS[#All],4,FALSE)","v":"Maroc"},null,null,{"$f":"VLOOKUP($D10,TABLEAU_MATCHS[#All],5,FALSE)","v":"RI Iran"},null,{"$f":"IF(OR(ISBLANK(RESULTATS!J10),ISBLANK(J10)),\"\",IF(AND('Pronostiqueur 2'!J10=RESULTATS!J10,'Pronostiqueur 2'!M10=RESULTATS!M10),3,IF(OR(AND('Pronostiqueur 2'!J10>'Pronostiqueur 2'!M10,RESULTATS!J10>RESULTATS!M10),AND('Pronostiqueur 2'!J10<'Pronostiqueur 2'!M10,RESULTATS!J10<RESULTATS!M10),AND('Pronostiqueur 2'!J10='Pronostiqueur 2'!M10,RESULTATS!J10=RESULTATS!M10)),1,0)))","v":""},null,null,null,"00000Russie",0,1,"Russie",{"$f":"SUMPRODUCT((Teams1=U10)*(Teams1_Score<>\"\"))+SUMPRODUCT((Teams2=U10)*(Teams2_Score<>\"\"))","v":0},{"$f":"SUMPRODUCT((Teams1=U10)*(Teams1_Score>Teams2_Score))+SUMPRODUCT((Teams2=U10)*(Teams2_Score>Teams1_Score))","v":0},{"$f":"SUMPRODUCT((Teams1=U10)*(Teams1_Score=Teams2_Score)*(Teams1_Score<>\"\"))+SUMPRODUCT((Teams2=U10)*(Teams2_Score=Teams1_Score)*(Teams2_Score<>\"\"))","v":0},{"$f":"SUMPRODUCT((Teams1=U10)*(Teams1_Score<Teams2_Score))+SUMPRODUCT((Teams2=U10)*(Teams2_Score<Teams1_Score))","v":0},{"$f":"SUMPRODUCT((Teams1=U10)*(Teams1_Score))+SUMPRODUCT((Teams2=U10)*(Teams2_Score))","v":0},{"$f":"SUMPRODUCT((Teams1=U10)*(Teams2_Score))+SUMPRODUCT((Teams2=U10)*(Teams1_Score))","v":0},{"$f":"Z10-AA10","v":0},{"$f":"3*W10+X10","v":0},null,null,null,"Bonus score exact (2 pts)",null,null,{"$f":"+COUNTIF($N$8:$N$55,3)","v":0},"matchs",null,null,{"$f":"AJ10*2","v":0},null,"points"]
[null,{"$f":"VLOOKUP($D11,TABLEAU_MATCHS[#All],2,FALSE)","v":"2018-06-15"},{"$f":"VLOOKUP($D11,TABLEAU_MATCHS[#All],3,FALSE)","v":"21:00:00"},4,{"$f":"\"Groupe \"&VLOOKUP($I11,TABLEAU_TEAMS[[#All],[TEAM]:[GROUP_INITIAL_RANK]],2,FALSE)","v":"Groupe B"},1.42,3.9,7,{"$f":"VLOOKUP($D11,TABLEAU_MATCHS[#All],4,FALSE)","v":"Portugal"},null,null,{"$f":"VLOOKUP($D11,TABLEAU_MATCHS[#All],5,FALSE)","v":"Espagne"},null,{"$f":"IF(OR(ISBLANK(RESULTATS!J11),ISBLANK(J11)),\"\",IF(AND('Pronostiqueur 2'!J11=RESULTATS!J11,'Pronostiqueur 2'!M11=RESULTATS!M11),3,IF(OR(AND('Pronostiqueur 2'!J11>'Pronostiqueur 2'!M11,RESULTATS!J11>RESULTATS!M11),AND('Pronostiqueur 2'!J11<'Pronostiqueur 2'!M11,RESULTATS!J11<RESULTATS!M11),AND('Pronostiqueur 2'!J11='Pronostiqueur 2'!M11,RESULTATS!J11=RESULTATS!M11)),1,0)))","v":""},null,null,null,"00000Egypte",0,1,"Egypte",{"$f":"SUMPRODUCT((Teams1=U11)*(Teams1_Score<>\"\"))+SUMPRODUCT((Teams2=U11)*(Teams2_Score<>\"\"))","v":0},{"$f":"SUMPRODUCT((Teams1=U11)*(Teams1_Score>Teams2_Score))+SUMPRODUCT((Teams2=U11)*(Teams2_Score>Teams1_Score))","v":0},{"$f":"SUMPRODUCT((Teams1=U11)*(Teams1_Score=Teams2_Score)*(Teams1_Score<>\"\"))+SUMPRODUCT((Teams2=U11)*(Teams2_Score=Teams1_Score)*(Teams2_Score<>\"\"))","v":0},{"$f":"SUMPRODUCT((Teams1=U11)*(Teams1_Score<Teams2_Score))+SUMPRODUCT((Teams2=U11)*(Teams2_Score<Teams1_Score))","v":0},{"$f":"SUMPRODUCT((Teams1=U11)*(Teams1_Score))+SUMPRODUCT((Teams2=U11)*(Teams2_Score))","v":0},{"$f":"SUMPRODUCT((Teams1=U11)*(Teams2_Score))+SUMPRODUCT((Teams2=U11)*(Teams1_Score))","v":0},0,0]
[null,{"$f":"VLOOKUP($D12,TABLEAU_MATCHS[#All],2,FALSE)","v":"2018-06-16"},{"$f":"VLOOKUP($D12,TABLEAU_MATCHS[#All],3,FALSE)","v":"13:00:00"},5,{"$f":"\"Groupe \"&VLOOKUP($I12,TABLEAU_TEAMS[[#All],[TEAM]:[GROUP_INITIAL_RANK]],2,FALSE)","v":"Groupe C"},1.7,3.1,5,{"$f":"VLOOKUP($D12,TABLEAU_MATCHS[#All],4,FALSE)","v":"France"},null,null,{"$f":"VLOOKUP($D12,TABLEAU_MATCHS[#All],5,FALSE)","v":"Australie"},null,{"$f":"IF(OR(ISBLANK(RESULTATS!J12),ISBLANK(J12)),\"\",IF(AND('Pronostiqueur 2'!J12=RESULTATS!J12,'Pronostiqueur 2'!M12=RESULTATS!M12),3,IF(OR(AND('Pronostiqueur 2'!J12>'Pronostiqueur 2'!M12,RESULTATS!J12>RESULTATS!M12),AND('Pronostiqueur 2'!J12<'Pronostiqueur 2'!M12,RESULTATS!J12<RESULTATS!M12),AND('Pronostiqueur 2'!J12='Pronostiqueur 2'!M12,RESULTATS!J12=RESULTATS!M12)),1,0)))","v":""},null,null,null,"00000Arabie Saoudite",0,1,"Arabie Saoudite",{"$f":"SUMPRODUCT((Teams1=U12)*(Teams1_Score<>\"\"))+SUMPRODUCT((Teams2=U12)*(Teams2_Score<>\"\"))","v":0},{"$f":"SUMPRODUCT((Teams1=U12)*(Teams1_Score>Teams2_Score))+SUMPRODUCT((Teams2=U12)*(Teams2_Score>Teams1_Score))","v":0},{"$f":"SUMPRODUCT((Teams1=U12)*(Teams1_Score=Teams2_Score)*(Teams1_Score<>\"\"))+SUMPRODUCT((Teams2=U12)*(Teams2_Score=Teams1_Score)*(Teams2_Score<>\"\"))","v":0},{"$f":"SUMPRODUCT((Teams1=U12)*(Teams1_Score<Teams2_Score))+SUMPRODUCT((Teams2=U12)*(Teams2_Score<Teams1_Score))","v":0},{"$f":"SUMPRODUCT((Teams1=U12)*(Teams1_Score))+SUMPRODUCT((Teams2=U12)*(Teams2_Score))","v":0},{"$f":"SUMPRODUCT((Teams1=U12)*(Teams2_Score))+SUMPRODUCT((Teams2=U12)*(Teams1_Score))","v":0},0,0,null,null,null,"Phases finales",null,null,null,null,null,null,{"$f":"SUM(AN13:AN17)","v":0},null,"points"]
[null,{"$f":"VLOOKUP($D13,TABLEAU_MATCHS[#All],2,FALSE)","v":"2018-06-16"},{"$f":"VLOOKUP($D13,TABLEAU_MATCHS[#All],3,FALSE)","v":"19:00:00"},6,{"$f":"\"Groupe \"&VLOOKUP($I13,TABLEAU_TEAMS[[#All],[TEAM]:[GROUP_INITIAL_RANK]],2,FALSE)","v":"Groupe C"},2.5499999999999998,2.9,2.7,{"$f":"VLOOKUP($D13,TABLEAU_MATCHS[#All],4,FALSE)","v":"Pérou"},null,null,{"$f":"VLOOKUP($D13,TABLEAU_MATCHS[#All],5,FALSE)","v":"Danemark"},null,{"$f":"IF(OR(ISBLANK(RESULTATS!J13),ISBLANK(J13)),\"\",IF(AND('Pronostiqueur 2'!J13=RESULTATS!J13,'Pronostiqueur 2'!M13=RESULTATS!M13),3,IF(OR(AND('Pronostiqueur 2'!J13>'Pronostiqueur 2'!M13,RESULTATS!J13>RESULTATS!M13),AND('Pronostiqueur 2'!J13<'Pronostiqueur 2'!M13,RESULTATS!J13<RESULTATS!M13),AND('Pronostiqueur 2'!J13='Pronostiqueur 2'!M13,RESULTATS!J13=RESULTATS!M13)),1,0)))","v":""},null,null,null,null,null,null,null,null,null,null,null,null,null,null,null,null,null,null,"Huitièmes de finaliste trouvés (2 pts)",null,null,{"$f":"IF(CLASSEMENT!PHASES_FINALES=\"OUI\",$AK$53+$AQ$53)","v":false},"équipe(s) ",null,null,{"$f":"AJ13*2","v":0},null,"points"]
[null,{"$f":"VLOOKUP($D14,TABLEAU_MATCHS[#All],2,FALSE)","v":"2018-06-16"},{"$f":"VLOOKUP($D14,TABLEAU_MATCHS[#All],3,FALSE)","v":"16:00:00"},7,{"$f":"\"Groupe \"&VLOOKUP($I14,TABLEAU_TEAMS[[#All],[TEAM]:[GROUP_INITIAL_RANK]],2,FALSE)","v":"Groupe D"},1.4,4,7.25,{"$f":"VLOOKUP($D14,TABLEAU_MATCHS[#All],4,FALSE)","v":"Argentine"},null,null,{"$f":"VLOOKUP($D14,TABLEAU_MATCHS[#All],5,FALSE)","v":"Islande"},null,{"$f":"IF(OR(ISBLANK(RESULTATS!J14),ISBLANK(J14)),\"\",IF(AND('Pronostiqueur 2'!J14=RESULTATS!J14,'Pronostiqueur 2'!M14=RESULTATS!M14),3,IF(OR(AND('Pronostiqueur 2'!J14>'Pronostiqueur 2'!M14,RESULTATS!J14>RESULTATS!M14),AND('Pronostiqueur 2'!J14<'Pronostiqueur 2'!M14,RESULTATS!J14<RESULTATS!M14),AND('Pronostiqueur 2'!J14='Pronostiqueur 2'!M14,RESULTATS!J14=RESULTATS!M14)),1,0)))","v":""},null,null,null,null,null,"Rg","Groupe B","MJ","G","N","P","BP","BC","+/-","Pts",null,null,null,"Quarts de finalistes trouvés (4 pts)",null,null,{"$f":"IF(CLASSEMENT!PHASES_FINALES=\"OUI\",$AK$42+$AQ$42)","v":false},"équipe(s) ",null,null,{"$f":"AJ14*4","v":0},null,"points"]
[null,{"$f":"VLOOKUP($D15,TABLEAU_MATCHS[#All],2,FALSE)","v":"2018-06-16"},{"$f":"VLOOKUP($D15,TABLEAU_MATCHS[#All],3,FALSE)","v":"21:00:00"},8,{"$f":"\"Groupe \"&VLOOKUP($I15,TABLEAU_TEAMS[[#All],[TEAM]:[GROUP_INITIAL_RANK]],2,FALSE)","v":"Groupe D"},2.95,2.7,2.5499999999999998,{"$f":"VLOOKUP($D15,TABLEAU_MATCHS[#All],4,FALSE)","v":"Croatie"},null,null,{"$f":"VLOOKUP($D15,TABLEAU_MATCHS[#All],5,FALSE)","v":"Nigeria"},null,{"$f":"IF(OR(ISBLANK(RESULTATS!J15),ISBLANK(J15)),\"\",IF(AND('Pronostiqueur 2'!J15=RESULTATS!J15,'Pronostiqueur 2'!M15=RESULTATS!M15),3,IF(OR(AND('Pronostiqueur 2'!J15>'Pronostiqueur 2'!M15,RESULTATS!J15>RESULTATS!M15),AND('Pronostiqueur 2'!J15<'Pronostiqueur 2'!M15,RESULTATS!J15<RESULTATS!M15),AND('Pronostiqueur 2'!J15='Pronostiqueur 2'!M15,RESULTATS!J15=RESULTATS!M15)),1,0)))","v":""},null,null,null,{"$f":"INDEX($R66:$R69,MATCH(SMALL(COUNTIF($R66:$R69,\">=\"&$R66:$R69),ROW(INDIRECT(\"1:\"&ROWS($R66:$R69)))),COUNTIF($R66:$R69,\">=\"&$R66:$R69),0))","v":"00000RI Iran"},{"$f":"INDEX($S66:$S69,MATCH(SMALL(COUNTIF($R66:$R69,\">=\"&$R66:$R69),ROW(INDIRECT(\"1:\"&ROWS($R66:$R69)))),COUNTIF($R66:$R69,\">=\"&$R66:$R69),0))","v":0},{"$f":"INDEX($T66:$T69,MATCH(SMALL(COUNTIF($R66:$R69,\">=\"&$R66:$R69),ROW(INDIRECT(\"1:\"&ROWS($R66:$R69)))),COUNTIF($R66:$R69,\">=\"&$R66:$R69),0))","v":1},{"$f":"INDEX($U66:$U69,MATCH(SMALL(COUNTIF($R66:$R69,\">=\"&$R66:$R69),ROW(INDIRECT(\"1:\"&ROWS($R66:$R69)))),COUNTIF($R66:$R69,\">=\"&$R66:$R69),0))","v":"RI Iran"},{"$f":"SUMPRODUCT((Teams1=U15)*(Teams1_Score<>\"\"))+SUMPRODUCT((Teams2=U15)*(Teams2_Score<>\"\"))","v":0},{"$f":"SUMPRODUCT((Teams1=U15)*(Teams1_Score>Teams2_Score))+SUMPRODUCT((Teams2=U15)*(Teams2_Score>Teams1_Score))","v":0},{"$f":"SUMPRODUCT((Teams1=U15)*(Teams1_Score=Teams2_Score)*(Teams1_Score<>\"\"))+SUMPRODUCT((Teams2=U15)*(Teams2_Score=Teams1_Score)*(Teams2_Score<>\"\"))","v":0},{"$f":"SUMPRODUCT((Teams1=U15)*(Teams1_Score<Teams2_Score))+SUMPRODUCT((Teams2=U15)*(Teams2_Score<Teams1_Score))","v":0},{"$f":"SUMPRODUCT((Teams1=U15)*(Teams1_Score))+SUMPRODUCT((Teams2=U15)*(Teams2_Score))","v":0},{"$f":"SUMPRODUCT((Teams1=U15)*(Teams2_Score))+SUMPRODUCT((Teams2=U15)*(Teams1_Score))","v":0},{"$f":"Z15-AA15","v":0},{"$f":"3*W15+X15","v":0},null,null,null,"Demi finalistes trouvés (5 pts)",null,null,{"$f":"IF(CLASSEMENT!PHASES_FINALES=\"OUI\",$AK$35+$AQ$35)","v":false},"équipe(s) ",null,null,{"$f":"AJ15*5","v":0},null,"points"]
[null,{"$f":"VLOOKUP($D16,TABLEAU_MATCHS[#All],2,FALSE)","v":"2018-06-17"},{"$f":"VLOOKUP($D16,TABLEAU_MATCHS[#All],3,FALSE)","v":"16:00:00"},9,{"$f":"\"Groupe \"&VLOOKUP($I16,TABLEAU_TEAMS[[#All],[TEAM]:[GROUP_INITIAL_RANK]],2,FALSE)","v":"Groupe E"},2.35,2.9,2.95,{"$f":"VLOOKUP($D16,TABLEAU_MATCHS[#All],4,FALSE)","v":"Costa Rica"},null,null,{"$f":"VLOOKUP($D16,TABLEAU_MATCHS[#All],5,FALSE)","v":"Serbie"},null,{"$f":"IF(OR(ISBLANK(RESULTATS!J16),ISBLANK(J16)),\"\",IF(AND('Pronostiqueur 2'!J16=RESULTATS!J16,'Pronostiqueur 2'!M16=RESULTATS!M16),3,IF(OR(AND('Pronostiqueur 2'!J16>'Pronostiqueur 2'!M16,RESULTATS!J16>RESULTATS!M16),AND('Pronostiqueur 2'!J16<'Pronostiqueur 2'!M16,RESULTATS!J16<RESULTATS!M16),AND('Pronostiqueur 2'!J16='Pronostiqueur 2'!M16,RESULTATS!J16=RESULTATS!M16)),1,0)))","v":""},null,null,null,"00000Portugal",0,1,"Portugal",{"$f":"SUMPRODUCT((Teams1=U16)*(Teams1_Score<>\"\"))+SUMPRODUCT((Teams2=U16)*(Teams2_Score<>\"\"))","v":0},{"$f":"SUMPRODUCT((Teams1=U16)*(Teams1_Score>Teams2_Score))+SUMPRODUCT((Teams2=U16)*(Teams2_Score>Teams1_Score))","v":0},{"$f":"SUMPRODUCT((Teams1=U16)*(Teams1_Score=Teams2_Score)*(Teams1_Score<>\"\"))+SUMPRODUCT((Teams2=U16)*(Teams2_Score=Teams1_Score)*(Teams2_Score<>\"\"))","v":0},{"$f":"SUMPRODUCT((Teams1=U16)*(Teams1_Score<Teams2_Score))+SUMPRODUCT((Teams2=U16)*(Teams2_Score<Teams1_Score))","v":0},{"$f":"SUMPRODUCT((Teams1=U16)*(Teams1_Score))+SUMPRODUCT((Teams2=U16)*(Teams2_Score))","v":0},{"$f":"SUMPRODUCT((Teams1=U16)*(Teams2_Score))+SUMPRODUCT((Teams2=U16)*(Teams1_Score))","v":0},0,0,null,null,null,"Finalistes trouvés (6 pts)",null,null,{"$f":"IF(CLASSEMENT!PHASES_FINALES=\"OUI\",$AK$25+$AQ$25)","v":false},"équipe(s) ",null,null,{"$f":"AJ16*6","v":0},null,"points"]
[null,{"$f":"VLOOKUP($D17,TABLEAU_MATCHS[#All],2,FALSE)","v":"2018-06-17"},{"$f":"VLOOKUP($D17,TABLEAU_MATCHS[#All],3,FALSE)","v":"21:00:00"},10,{"$f":"\"Groupe \"&VLOOKUP($I17,TABLEAU_TEAMS[[#All],[TEAM]:[GROUP_INITIAL_RANK]],2,FALSE)","v":"Groupe E"},1.28,4.7,9.5,{"$f":"VLOOKUP($D17,TABLEAU_MATCHS[#All],4,FALSE)","v":"Brésil"},null,null,{"$f":"VLOOKUP($D17,TABLEAU_MATCHS[#All],5,FALSE)","v":"Suisse"},null,{"$f":"IF(OR(ISBLANK(RESULTATS!J17),ISBLANK(J17)),\"\",IF(AND('Pronostiqueur 2'!J17=RESULTATS!J17,'Pronostiqueur 2'!M17=RESULTATS!M17),3,IF(OR(AND('Pronostiqueur 2'!J17>'Pronostiqueur 2'!M17,RESULTATS!J17>RESULTATS!M17),AND('Pronostiqueur 2'!J17<'Pronostiqueur 2'!M17,RESULTATS!J17<RESULTATS!M17),AND('Pronostiqueur 2'!J17='Pronostiqueur 2'!M17,RESULTATS!J17=RESULTATS!M17)),1,0)))","v":""},null,null,null,"00000Maroc",0,1,"Maroc",{"$f":"SUMPRODUCT((Teams1=U17)*(Teams1_Score<>\"\"))+SUMPRODUCT((Teams2=U17)*(Teams2_Score<>\"\"))","v":0},{"$f":"SUMPRODUCT((Teams1=U17)*(Teams1_Score>Teams2_Score))+SUMPRODUCT((Teams2=U17)*(Teams2_Score>Teams1_Score))","v":0},{"$f":"SUMPRODUCT((Teams1=U17)*(Teams1_Score=Teams2_Score)*(Teams1_Score<>\"\"))+SUMPRODUCT((Teams2=U17)*(Teams2_Score=Teams1_Score)*(Teams2_Score<>\"\"))","v":0},{"$f":"SUMPRODUCT((Teams1=U17)*(Teams1_Score<Teams2_Score))+SUMPRODUCT((Teams2=U17)*(Teams2_Score<Teams1_Score))","v":0},{"$f":"SUMPRODUCT((Teams1=U17)*(Teams1_Score))+SUMPRODUCT((Teams2=U17)*(Teams2_Score))","v":0},{"$f":"SUMPRODUCT((Teams1=U17)*(Teams2_Score))+SUMPRODUCT((Teams2=U17)*(Teams1_Score))","v":0},0,0,null,null,null,"Champion du monde trouvé (7 pts)",null,null,{"$f":"IF(CLASSEMENT!PHASES_FINALES=\"OUI\",IF(AJ25<>\"\",IF($AT$25=RESULTATS!AS10,1,0),0))","v":false},"équipe",null,null,{"$f":"AJ17*7","v":0},null,"points"]
[null,{"$f":"VLOOKUP($D18,TABLEAU_MATCHS[#All],2,FALSE)","v":"2018-06-17"},{"$f":"VLOOKUP($D18,TABLEAU_MATCHS[#All],3,FALSE)","v":"18:00:00"},11,{"$f":"\"Groupe \"&VLOOKUP($I18,TABLEAU_TEAMS[[#All],[TEAM]:[GROUP_INITIAL_RANK]],2,FALSE)","v":"Groupe F"},1.34,4.3,7.5,{"$f":"VLOOKUP($D18,TABLEAU_MATCHS[#All],4,FALSE)","v":"Allemagne"},null,null,{"$f":"VLOOKUP($D18,TABLEAU_MATCHS[#All],5,FALSE)","v":"Mexique"},null,{"$f":"IF(OR(ISBLANK(RESULTATS!J18),ISBLANK(J18)),\"\",IF(AND('Pronostiqueur 2'!J18=RESULTATS!J18,'Pronostiqueur 2'!M18=RESULTATS!M18),3,IF(OR(AND('Pronostiqueur 2'!J18>'Pronostiqueur 2'!M18,RESULTATS!J18>RESULTATS!M18),AND('Pronostiqueur 2'!J18<'Pronostiqueur 2'!M18,RESULTATS!J18<RESULTATS!M18),AND('Pronostiqueur 2'!J18='Pronostiqueur 2'!M18,RESULTATS!J18=RESULTATS!M18)),1,0)))","v":""},null,null,null,"00000Espagne",0,1,"Espagne",{"$f":"SUMPRODUCT((Teams1=U18)*(Teams1_Score<>\"\"))+SUMPRODUCT((Teams2=U18)*(Teams2_Score<>\"\"))","v":0},{"$f":"SUMPRODUCT((Teams1=U18)*(Teams1_Score>Teams2_Score))+SUMPRODUCT((Teams2=U18)*(Teams2_Score>Teams1_Score))","v":0},{"$f":"SUMPRODUCT((Teams1=U18)*(Teams1_Score=Teams2_Score)*(Teams1_Score<>\"\"))+SUMPRODUCT((Teams2=U18)*(Teams2_Score=Teams1_Score)*(Teams2_Score<>\"\"))","v":0},{"$f":"SUMPRODUCT((Teams1=U18)*(Teams1_Score<Teams2_Score))+SUMPRODUCT((Teams2=U18)*(Teams2_Score<Teams1_Score))","v":0},{"$f":"SUMPRODUCT((Teams1=U18)*(Teams1_Score))+SUMPRODUCT((Teams2=U18)*(Teams2_Score))","v":0},{"$f":"SUMPRODUCT((Teams1=U18)*(Teams2_Score))+SUMPRODUCT((Teams2=U18)*(Teams1_Score))","v":0},0,0]
[null,{"$f":"VLOOKUP($D19,TABLEAU_MATCHS[#All],2,FALSE)","v":"2018-06-18"},{"$f":"VLOOKUP($D19,TABLEAU_MATCHS[#All],3,FALSE)","v":"15:00:00"},12,{"$f":"\"Groupe \"&VLOOKUP($I19,TABLEAU_TEAMS[[#All],[TEAM]:[GROUP_INITIAL_RANK]],2,FALSE)","v":"Groupe F"},3.3,2.95,2.15,{"$f":"VLOOKUP($D19,TABLEAU_MATCHS[#All],4,FALSE)","v":"Suède"},null,null,{"$f":"VLOOKUP($D19,TABLEAU_MATCHS[#All],5,FALSE)","v":"République de Corée"},null,{"$f":"IF(OR(ISBLANK(RESULTATS!J19),ISBLANK(J19)),\"\",IF(AND('Pronostiqueur 2'!J19=RESULTATS!J19,'Pronostiqueur 2'!M19=RESULTATS!M19),3,IF(OR(AND('Pronostiqueur 2'!J19>'Pronostiqueur 2'!M19,RESULTATS!J19>RESULTATS!M19),AND('Pronostiqueur 2'!J19<'Pronostiqueur 2'!M19,RESULTATS!J19<RESULTATS!M19),AND('Pronostiqueur 2'!J19='Pronostiqueur 2'!M19,RESULTATS!J19=RESULTATS!M19)),1,0)))","v":""}]
[null,{"$f":"VLOOKUP($D20,TABLEAU_MATCHS[#All],2,FALSE)","v":"2018-06-18"},{"$f":"VLOOKUP($D20,TABLEAU_MATCHS[#All],3,FALSE)","v":"18:00:00"},13,{"$f":"\"Groupe \"&VLOOKUP($I20,TABLEAU_TEAMS[[#All],[TEAM]:[GROUP_INITIAL_RANK]],2,FALSE)","v":"Groupe G"},1.95,2.95,4,{"$f":"VLOOKUP($D20,TABLEAU_MATCHS[#All],4,FALSE)","v":"Belgique"},null,null,{"$f":"VLOOKUP($D20,TABLEAU_MATCHS[#All],5,FALSE)","v":"Panama"},null,{"$f":"IF(OR(ISBLANK(RESULTATS!J20),ISBLANK(J20)),\"\",IF(AND('Pronostiqueur 2'!J20=RESULTATS!J20,'Pronostiqueur 2'!M20=RESULTATS!M20),3,IF(OR(AND('Pronostiqueur 2'!J20>'Pronostiqueur 2'!M20,RESULTATS!J20>RESULTATS!M20),AND('Pronostiqueur 2'!J20<'Pronostiqueur 2'!M20,RESULTATS!J20<RESULTATS!M20),AND('Pronostiqueur 2'!J20='Pronostiqueur 2'!M20,RESULTATS!J20=RESULTATS!M20)),1,0)))","v":""},null,null,null,null,null,"Rg","Groupe C","MJ","G","N","P","BP","BC","+/-","Pts"]
[null,{"$f":"VLOOKUP($D21,TABLEAU_MATCHS[#All],2,FALSE)","v":"2018-06-18"},{"$f":"VLOOKUP($D21,TABLEAU_MATCHS[#All],3,FALSE)","v":"21:00:00"},14,{"$f":"\"Groupe \"&VLOOKUP($I21,TABLEAU_TEAMS[[#All],[TEAM]:[GROUP_INITIAL_RANK]],2,FALSE)","v":"Groupe G"},2.5499999999999998,2.9,2.7,{"$f":"VLOOKUP($D21,TABLEAU_MATCHS[#All],4,FALSE)","v":"Tunisie"},null,null,{"$f":"VLOOKUP($D21,TABLEAU_MATCHS[#All],5,FALSE)","v":"Angleterre"},null,{"$f":"IF(OR(ISBLANK(RESULTATS!J21),ISBLANK(J21)),\"\",IF(AND('Pronostiqueur 2'!J21=RESULTATS!J21,'Pronostiqueur 2'!M21=RESULTATS!M21),3,IF(OR(AND('Pronostiqueur 2'!J21>'Pronostiqueur 2'!M21,RESULTATS!J21>RESULTATS!M21),AND('Pronostiqueur 2'!J21<'Pronostiqueur 2'!M21,RESULTATS!J21<RESULTATS!M21),AND('Pronostiqueur 2'!J21='Pronostiqueur 2'!M21,RESULTATS!J21=RESULTATS!M21)),1,0)))","v":""},null,null,null,{"$f":"INDEX($R72:$R75,MATCH(SMALL(COUNTIF($R72:$R75,\">=\"&$R72:$R75),ROW(INDIRECT(\"1:\"&ROWS($R72:$R75)))),COUNTIF($R72:$R75,\">=\"&$R72:$R75),0))","v":"00000Pérou"},{"$f":"INDEX($S72:$S75,MATCH(SMALL(COUNTIF($R72:$R75,\">=\"&$R72:$R75),ROW(INDIRECT(\"1:\"&ROWS($R72:$R75)))),COUNTIF($R72:$R75,\">=\"&$R72:$R75),0))","v":0},{"$f":"INDEX($T72:$T75,MATCH(SMALL(COUNTIF($R72:$R75,\">=\"&$R72:$R75),ROW(INDIRECT(\"1:\"&ROWS($R72:$R75)))),COUNTIF($R72:$R75,\">=\"&$R72:$R75),0))","v":1},{"$f":"INDEX($U72:$U75,MATCH(SMALL(COUNTIF($R72:$R75,\">=\"&$R72:$R75),ROW(INDIRECT(\"1:\"&ROWS($R72:$R75)))),COUNTIF($R72:$R75,\">=\"&$R72:$R75),0))","v":"Pérou"},{"$f":"SUMPRODUCT((Teams1=U21)*(Teams1_Score<>\"\"))+SUMPRODUCT((Teams2=U21)*(Teams2_Score<>\"\"))","v":0},{"$f":"SUMPRODUCT((Teams1=U21)*(Teams1_Score>Teams2_Score))+SUMPRODUCT((Teams2=U21)*(Teams2_Score>Teams1_Score))","v":0},{"$f":"SUMPRODUCT((Teams1=U21)*(Teams1_Score=Teams2_Score)*(Teams1_Score<>\"\"))+SUMPRODUCT((Teams2=U21)*(Teams2_Score=Teams1_Score)*(Teams2_Score<>\"\"))","v":0},{"$f":"SUMPRODUCT((Teams1=U21)*(Teams1_Score<Teams2_Score))+SUMPRODUCT((Teams2=U21)*(Teams2_Score<Teams1_Score))","v":0},{"$f":"SUMPRODUCT((Teams1=U21)*(Teams1_Score))+SUMPRODUCT((Teams2=U21)*(Teams2_Score))","v":0},{"$f":"SUMPRODUCT((Teams1=U21)*(Teams2_Score))+SUMPRODUCT((Teams2=U21)*(Teams1_Score))","v":0},{"$f":"Z21-AA21","v":0},{"$f":"3*W21+X21","v":0},null,null,null,"PHASES FINALES"]
[null,{"$f":"VLOOKUP($D22,TABLEAU_MATCHS[#All],2,FALSE)","v":"2018-06-19"},{"$f":"VLOOKUP($D22,TABLEAU_MATCHS[#All],3,FALSE)","v":"15:00:00"},15,{"$f":"\"Groupe \"&VLOOKUP($I22,TABLEAU_TEAMS[[#All],[TEAM]:[GROUP_INITIAL_RANK]],2,FALSE)","v":"Groupe H"},1.38,3.9,8,{"$f":"VLOOKUP($D22,TABLEAU_MATCHS[#All],4,FALSE)","v":"Colombie"},null,null,{"$f":"VLOOKUP($D22,TABLEAU_MATCHS[#All],5,FALSE)","v":"Japon"},null,{"$f":"IF(OR(ISBLANK(RESULTATS!J22),ISBLANK(J22)),\"\",IF(AND('Pronostiqueur 2'!J22=RESULTATS!J22,'Pronostiqueur 2'!M22=RESULTATS!M22),3,IF(OR(AND('Pronostiqueur 2'!J22>'Pronostiqueur 2'!M22,RESULTATS!J22>RESULTATS!M22),AND('Pronostiqueur 2'!J22<'Pronostiqueur 2'!M22,RESULTATS!J22<RESULTATS!M22),AND('Pronostiqueur 2'!J22='Pronostiqueur 2'!M22,RESULTATS!J22=RESULTATS!M22)),1,0)))","v":""},null,null,null,"00000France",0,1,"France",{"$f":"SUMPRODUCT((Teams1=U22)*(Teams1_Score<>\"\"))+SUMPRODUCT((Teams2=U22)*(Teams2_Score<>\"\"))","v":0},{"$f":"SUMPRODUCT((Teams1=U22)*(Teams1_Score>Teams2_Score))+SUMPRODUCT((Teams2=U22)*(Teams2_Score>Teams1_Score))","v":0},{"$f":"SUMPRODUCT((Teams1=U22)*(Teams1_Score=Teams2_Score)*(Teams1_Score<>\"\"))+SUMPRODUCT((Teams2=U22)*(Teams2_Score=Teams1_Score)*(Teams2_Score<>\"\"))","v":0},{"$f":"SUMPRODUCT((Teams1=U22)*(Teams1_Score<Teams2_Score))+SUMPRODUCT((Teams2=U22)*(Teams2_Score<Teams1_Score))","v":0},{"$f":"SUMPRODUCT((Teams1=U22)*(Teams1_Score))+SUMPRODUCT((Teams2=U22)*(Teams2_Score))","v":0},{"$f":"SUMPRODUCT((Teams1=U22)*(Teams2_Score))+SUMPRODUCT((Teams2=U22)*(Teams1_Score))","v":0},0,0]
[null,{"$f":"VLOOKUP($D23,TABLEAU_MATCHS[#All],2,FALSE)","v":"2018-06-19"},{"$f":"VLOOKUP($D23,TABLEAU_MATCHS[#All],3,FALSE)","v":"18:00:00"},16,{"$f":"\"Groupe \"&VLOOKUP($I23,TABLEAU_TEAMS[[#All],[TEAM]:[GROUP_INITIAL_RANK]],2,FALSE)","v":"Groupe H"},2.0499999999999998,2.9,3.5,{"$f":"VLOOKUP($D23,TABLEAU_MATCHS[#All],4,FALSE)","v":"Pologne"},null,null,{"$f":"VLOOKUP($D23,TABLEAU_MATCHS[#All],5,FALSE)","v":"Sénégal"},null,{"$f":"IF(OR(ISBLANK(RESULTATS!J23),ISBLANK(J23)),\"\",IF(AND('Pronostiqueur 2'!J23=RESULTATS!J23,'Pronostiqueur 2'!M23=RESULTATS!M23),3,IF(OR(AND('Pronostiqueur 2'!J23>'Pronostiqueur 2'!M23,RESULTATS!J23>RESULTATS!M23),AND('Pronostiqueur 2'!J23<'Pronostiqueur 2'!M23,RESULTATS!J23<RESULTATS!M23),AND('Pronostiqueur 2'!J23='Pronostiqueur 2'!M23,RESULTATS!J23=RESULTATS!M23)),1,0)))","v":""},null,null,null,"00000Danemark",0,1,"Danemark",{"$f":"SUMPRODUCT((Teams1=U23)*(Teams1_Score<>\"\"))+SUMPRODUCT((Teams2=U23)*(Teams2_Score<>\"\"))","v":0},{"$f":"SUMPRODUCT((Teams1=U23)*(Teams1_Score>Teams2_Score))+SUMPRODUCT((Teams2=U23)*(Teams2_Score>Teams1_Score))","v":0},{"$f":"SUMPRODUCT((Teams1=U23)*(Teams1_Score=Teams2_Score)*(Teams1_Score<>\"\"))+SUMPRODUCT((Teams2=U23)*(Teams2_Score=Teams1_Score)*(Teams2_Score<>\"\"))","v":0},{"$f":"SUMPRODUCT((Teams1=U23)*(Teams1_Score<Teams2_Score))+SUMPRODUCT((Teams2=U23)*(Teams2_Score<Teams1_Score))","v":0},{"$f":"SUMPRODUCT((Teams1=U23)*(Teams1_Score))+SUMPRODUCT((Teams2=U23)*(Teams2_Score))","v":0},{"$f":"SUMPRODUCT((Teams1=U23)*(Teams2_Score))+SUMPRODUCT((Teams2=U23)*(Teams1_Score))","v":0},0,0,null,null,"Date","Finale",null,null,"Buts",null,"Pen",null,null,null,"Buts",null,"Pen"]
[null,{"$f":"VLOOKUP($D24,TABLEAU_MATCHS[#All],2,FALSE)","v":"2018-06-19"},{"$f":"VLOOKUP($D24,TABLEAU_MATCHS[#All],3,FALSE)","v":"21:00:00"},17,{"$f":"\"Groupe \"&VLOOKUP($I24,TABLEAU_TEAMS[[#All],[TEAM]:[GROUP_INITIAL_RANK]],2,FALSE)","v":"Groupe A"},1.26,4.8,9,{"$f":"VLOOKUP($D24,TABLEAU_MATCHS[#All],4,FALSE)","v":"Russie"},null,null,{"$f":"VLOOKUP($D24,TABLEAU_MATCHS[#All],5,FALSE)","v":"Egypte"},null,{"$f":"IF(OR(ISBLANK(RESULTATS!J24),ISBLANK(J24)),\"\",IF(AND('Pronostiqueur 2'!J24=RESULTATS!J24,'Pronostiqueur 2'!M24=RESULTATS!M24),3,IF(OR(AND('Pronostiqueur 2'!J24>'Pronostiqueur 2'!M24,RESULTATS!J24>RESULTATS!M24),AND('Pronostiqueur 2'!J24<'Pronostiqueur 2'!M24,RESULTATS!J24<RESULTATS!M24),AND('Pronostiqueur 2'!J24='Pronostiqueur 2'!M24,RESULTATS!J24=RESULTATS!M24)),1,0)))","v":""},null,null,null,"00000Australie",0,1,"Australie",{"$f":"SUMPRODUCT((Teams1=U24)*(Teams1_Score<>\"\"))+SUMPRODUCT((Teams2=U24)*(Teams2_Score<>\"\"))","v":0},{"$f":"SUMPRODUCT((Teams1=U24)*(Teams1_Score>Teams2_Score))+SUMPRODUCT((Teams2=U24)*(Teams2_Score>Teams1_Score))","v":0},{"$f":"SUMPRODUCT((Teams1=U24)*(Teams1_Score=Teams2_Score)*(Teams1_Score<>\"\"))+SUMPRODUCT((Teams2=U24)*(Teams2_Score=Teams1_Score)*(Teams2_Score<>\"\"))","v":0},{"$f":"SUMPRODUCT((Teams1=U24)*(Teams1_Score<Teams2_Score))+SUMPRODUCT((Teams2=U24)*(Teams2_Score<Teams1_Score))","v":0},{"$f":"SUMPRODUCT((Teams1=U24)*(Teams1_Score))+SUMPRODUCT((Teams2=U24)*(Teams2_Score))","v":0},{"$f":"SUMPRODUCT((Teams1=U24)*(Teams2_Score))+SUMPRODUCT((Teams2=U24)*(Teams1_Score))","v":0},0,0]
[null,{"$f":"VLOOKUP($D25,TABLEAU_MATCHS[#All],2,FALSE)","v":"2018-06-20"},{"$f":"VLOOKUP($D25,TABLEAU_MATCHS[#All],3,FALSE)","v":"18:00:00"},18,{"$f":"\"Groupe \"&VLOOKUP($I25,TABLEAU_TEAMS[[#All],[TEAM]:[GROUP_INITIAL_RANK]],2,FALSE)","v":"Groupe A"},3.5,3,2,{"$f":"VLOOKUP($D25,TABLEAU_MATCHS[#All],4,FALSE)","v":"Uruguay"},null,null,{"$f":"VLOOKUP($D25,TABLEAU_MATCHS[#All],5,FALSE)","v":"Arabie Saoudite"},null,{"$f":"IF(OR(ISBLANK(RESULTATS!J25),ISBLANK(J25)),\"\",IF(AND('Pronostiqueur 2'!J25=RESULTATS!J25,'Pronostiqueur 2'!M25=RESULTATS!M25),3,IF(OR(AND('Pronostiqueur 2'!J25>'Pronostiqueur 2'!M25,RESULTATS!J25>RESULTATS!M25),AND('Pronostiqueur 2'!J25<'Pronostiqueur 2'!M25,RESULTATS!J25<RESULTATS!M25),AND('Pronostiqueur 2'!J25='Pronostiqueur 2'!M25,RESULTATS!J25=RESULTATS!M25)),1,0)))","v":""},null,null,null,null,null,null,null,null,null,null,null,null,null,null,null,null,null,"2018-07-15",null,{"$f":"+IF(AJ33<>\"\",IF(AI33>AO33,AH33,AN33),\"Vainqueur 1\")","v":"Vainqueur 1"},{"$f":"AJ25*10+AL25","v":0},null,{"$f":"IF(LEFT(AH25,5)<>\"Vainq\",COUNTIF(RESULTATS!$AG$10:$AM$10,AH25),0)","v":0},null,null,{"$f":"+IF(AJ34<>\"\",IF(AI34>AO34,AH34,AN34),\"Vainqueur 2\")","v":"Vainqueur 2"},{"$f":"AP25*10+AR25","v":0},null,{"$f":"IF(LEFT(AN25,5)<>\"Vainq\",COUNTIF(RESULTATS!$AG$10:$AM$10,AN25),0)","v":0},null,null,{"$f":"IF(AJ25<>\"\",IF(AI25>AO25,AH25,AN25),\"\")","v":""}]
[null,{"$f":"VLOOKUP($D26,TABLEAU_MATCHS[#All],2,FALSE)","v":"2018-06-20"},{"$f":"VLOOKUP($D26,TABLEAU_MATCHS[#All],3,FALSE)","v":"15:00:00"},19,{"$f":"\"Groupe \"&VLOOKUP($I26,TABLEAU_TEAMS[[#All],[TEAM]:[GROUP_INITIAL_RANK]],2,FALSE)","v":"Groupe B"},1.66,3.35,4.8,{"$f":"VLOOKUP($D26,TABLEAU_MATCHS[#All],4,FALSE)","v":"Portugal"},null,null,{"$f":"VLOOKUP($D26,TABLEAU_MATCHS[#All],5,FALSE)","v":"Maroc"},null,{"$f":"IF(OR(ISBLANK(RESULTATS!J26),ISBLANK(J26)),\"\",IF(AND('Pronostiqueur 2'!J26=RESULTATS!J26,'Pronostiqueur 2'!M26=RESULTATS!M26),3,IF(OR(AND('Pronostiqueur 2'!J26>'Pronostiqueur 2'!M26,RESULTATS!J26>RESULTATS!M26),AND('Pronostiqueur 2'!J26<'Pronostiqueur 2'!M26,RESULTATS!J26<RESULTATS!M26),AND('Pronostiqueur 2'!J26='Pronostiqueur 2'!M26,RESULTATS!J26=RESULTATS!M26)),1,0)))","v":""},null,null,null,null,null,"Rg","Groupe D","MJ","G","N","P","BP","BC","+/-","Pts"]
[null,{"$f":"VLOOKUP($D27,TABLEAU_MATCHS[#All],2,FALSE)","v":"2018-06-20"},{"$f":"VLOOKUP($D27,TABLEAU_MATCHS[#All],3,FALSE)","v":"21:00:00"},20,{"$f":"\"Groupe \"&VLOOKUP($I27,TABLEAU_TEAMS[[#All],[TEAM]:[GROUP_INITIAL_RANK]],2,FALSE)","v":"Groupe B"},8.5,4.7,1.28,{"$f":"VLOOKUP($D27,TABLEAU_MATCHS[#All],4,FALSE)","v":"RI Iran"},null,null,{"$f":"VLOOKUP($D27,TABLEAU_MATCHS[#All],5,FALSE)","v":"Espagne"},null,{"$f":"IF(OR(ISBLANK(RESULTATS!J27),ISBLANK(J27)),\"\",IF(AND('Pronostiqueur 2'!J27=RESULTATS!J27,'Pronostiqueur 2'!M27=RESULTATS!M27),3,IF(OR(AND('Pronostiqueur 2'!J27>'Pronostiqueur 2'!M27,RESULTATS!J27>RESULTATS!M27),AND('Pronostiqueur 2'!J27<'Pronostiqueur 2'!M27,RESULTATS!J27<RESULTATS!M27),AND('Pronostiqueur 2'!J27='Pronostiqueur 2'!M27,RESULTATS!J27=RESULTATS!M27)),1,0)))","v":""},null,null,null,{"$f":"INDEX($R78:$R81,MATCH(SMALL(COUNTIF($R78:$R81,\">=\"&$R78:$R81),ROW(INDIRECT(\"1:\"&ROWS($R78:$R81)))),COUNTIF($R78:$R81,\">=\"&$R78:$R81),0))","v":"00000Nigeria"},{"$f":"INDEX($S78:$S81,MATCH(SMALL(COUNTIF($R78:$R81,\">=\"&$R78:$R81),ROW(INDIRECT(\"1:\"&ROWS($R78:$R81)))),COUNTIF($R78:$R81,\">=\"&$R78:$R81),0))","v":0},{"$f":"INDEX($T78:$T81,MATCH(SMALL(COUNTIF($R78:$R81,\">=\"&$R78:$R81),ROW(INDIRECT(\"1:\"&ROWS($R78:$R81)))),COUNTIF($R78:$R81,\">=\"&$R78:$R81),0))","v":1},{"$f":"INDEX($U78:$U81,MATCH(SMALL(COUNTIF($R78:$R81,\">=\"&$R78:$R81),ROW(INDIRECT(\"1:\"&ROWS($R78:$R81)))),COUNTIF($R78:$R81,\">=\"&$R78:$R81),0))","v":"Nigeria"},{"$f":"SUMPRODUCT((Teams1=U27)*(Teams1_Score<>\"\"))+SUMPRODUCT((Teams2=U27)*(Teams2_Score<>\"\"))","v":0},{"$f":"SUMPRODUCT((Teams1=U27)*(Teams1_Score>Teams2_Score))+SUMPRODUCT((Teams2=U27)*(Teams2_Score>Teams1_Score))","v":0},{"$f":"SUMPRODUCT((Teams1=U27)*(Teams1_Score=Teams2_Score)*(Teams1_Score<>\"\"))+SUMPRODUCT((Teams2=U27)*(Teams2_Score=Teams1_Score)*(Teams2_Score<>\"\"))","v":0},{"$f":"SUMPRODUCT((Teams1=U27)*(Teams1_Score<Teams2_Score))+SUMPRODUCT((Teams2=U27)*(Teams2_Score<Teams1_Score))","v":0},{"$f":"SUMPRODUCT((Teams1=U27)*(Teams1_Score))+SUMPRODUCT((Teams2=U27)*(Teams2_Score))","v":0},{"$f":"SUMPRODUCT((Teams1=U27)*(Teams2_Score))+SUMPRODUCT((Teams2=U27)*(Teams1_Score))","v":0},{"$f":"Z27-AA27","v":0},{"$f":"3*W27+X27","v":0},null,null,"Date","Petite Finale",null,null,"Buts",null,"Pen",null,null,null,"Buts",null,"Pen"]
[null,{"$f":"VLOOKUP($D28,TABLEAU_MATCHS[#All],2,FALSE)","v":"2018-06-21"},{"$f":"VLOOKUP($D28,TABLEAU_MATCHS[#All],3,FALSE)","v":"16:00:00"},21,{"$f":"\"Groupe \"&VLOOKUP($I28,TABLEAU_TEAMS[[#All],[TEAM]:[GROUP_INITIAL_RANK]],2,FALSE)","v":"Groupe C"},1.85,3,4,{"$f":"VLOOKUP($D28,TABLEAU_MATCHS[#All],4,FALSE)","v":"Danemark"},null,null,{"$f":"VLOOKUP($D28,TABLEAU_MATCHS[#All],5,FALSE)","v":"Australie"},null,{"$f":"IF(OR(ISBLANK(RESULTATS!J28),ISBLANK(J28)),\"\",IF(AND('Pronostiqueur 2'!J28=RESULTATS!J28,'Pronostiqueur 2'!M28=RESULTATS!M28),3,IF(OR(AND('Pronostiqueur 2'!J28>'Pronostiqueur 2'!M28,RESULTATS!J28>RESULTATS!M28),AND('Pronostiqueur 2'!J28<'Pronostiqueur 2'!M28,RESULTATS!J28<RESULTATS!M28),AND('Pronostiqueur 2'!J28='Pronostiqueur 2'!M28,RESULTATS!J28=RESULTATS!M28)),1,0)))","v":""},null,null,null,"00000Islande",0,1,"Islande",{"$f":"SUMPRODUCT((Teams1=U28)*(Teams1_Score<>\"\"))+SUMPRODUCT((Teams2=U28)*(Teams2_Score<>\"\"))","v":0},{"$f":"SUMPRODUCT((Teams1=U28)*(Teams1_Score>Teams2_Score))+SUMPRODUCT((Teams2=U28)*(Teams2_Score>Teams1_Score))","v":0},{"$f":"SUMPRODUCT((Teams1=U28)*(Teams1_Score=Teams2_Score)*(Teams1_Score<>\"\"))+SUMPRODUCT((Teams2=U28)*(Teams2_Score=Teams1_Score)*(Teams2_Score<>\"\"))","v":0},{"$f":"SUMPRODUCT((Teams1=U28)*(Teams1_Score<Teams2_Score))+SUMPRODUCT((Teams2=U28)*(Teams2_Score<Teams1_Score))","v":0},{"$f":"SUMPRODUCT((Teams1=U28)*(Teams1_Score))+SUMPRODUCT((Teams2=U28)*(Teams2_Score))","v":0},{"$f":"SUMPRODUCT((Teams1=U28)*(Teams2_Score))+SUMPRODUCT((Teams2=U28)*(Teams1_Score))","v":0},0,0]
[null,{"$f":"VLOOKUP($D29,TABLEAU_MATCHS[#All],2,FALSE)","v":"2018-06-21"},{"$f":"VLOOKUP($D29,TABLEAU_MATCHS[#All],3,FALSE)","v":"20:00:00"},22,{"$f":"\"Groupe \"&VLOOKUP($I29,TABLEAU_TEAMS[[#All],[TEAM]:[GROUP_INITIAL_RANK]],2,FALSE)","v":"Groupe C"},2.2999999999999998,3,2.9,{"$f":"VLOOKUP($D29,TABLEAU_MATCHS[#All],4,FALSE)","v":"France"},null,null,{"$f":"VLOOKUP($D29,TABLEAU_MATCHS[#All],5,FALSE)","v":"Pérou"},null,{"$f":"IF(OR(ISBLANK(RESULTATS!J29),ISBLANK(J29)),\"\",IF(AND('Pronostiqueur 2'!J29=RESULTATS!J29,'Pronostiqueur 2'!M29=RESULTATS!M29),3,IF(OR(AND('Pronostiqueur 2'!J29>'Pronostiqueur 2'!M29,RESULTATS!J29>RESULTATS!M29),AND('Pronostiqueur 2'!J29<'Pronostiqueur 2'!M29,RESULTATS!J29<RESULTATS!M29),AND('Pronostiqueur 2'!J29='Pronostiqueur 2'!M29,RESULTATS!J29=RESULTATS!M29)),1,0)))","v":""},null,null,null,"00000Croatie",0,1,"Croatie",{"$f":"SUMPRODUCT((Teams1=U29)*(Teams1_Score<>\"\"))+SUMPRODUCT((Teams2=U29)*(Teams2_Score<>\"\"))","v":0},{"$f":"SUMPRODUCT((Teams1=U29)*(Teams1_Score>Teams2_Score))+SUMPRODUCT((Teams2=U29)*(Teams2_Score>Teams1_Score))","v":0},{"$f":"SUMPRODUCT((Teams1=U29)*(Teams1_Score=Teams2_Score)*(Teams1_Score<>\"\"))+SUMPRODUCT((Teams2=U29)*(Teams2_Score=Teams1_Score)*(Teams2_Score<>\"\"))","v":0},{"$f":"SUMPRODUCT((Teams1=U29)*(Teams1_Score<Teams2_Score))+SUMPRODUCT((Teams2=U29)*(Teams2_Score<Teams1_Score))","v":0},{"$f":"SUMPRODUCT((Teams1=U29)*(Teams1_Score))+SUMPRODUCT((Teams2=U29)*(Teams2_Score))","v":0},{"$f":"SUMPRODUCT((Teams1=U29)*(Teams2_Score))+SUMPRODUCT((Teams2=U29)*(Teams1_Score))","v":0},0,0,null,null,"2018-07-14",null,{"$f":"+IF(AJ33<>\"\",IF(AI33>AO33,AN33,AH33),\"Perdant 1\")","v":"Perdant 1"},{"$f":"AJ29*10+AL29","v":0},null,null,null,null,{"$f":"+IF(AJ34<>\"\",IF(AI34>AO34,AN34,AH34),\"Perdant 2\")","v":"Perdant 2"},{"$f":"AP29*10+AR29","v":0}]
[null,{"$f":"VLOOKUP($D30,TABLEAU_MATCHS[#All],2,FALSE)","v":"2018-06-21"},{"$f":"VLOOKUP($D30,TABLEAU_MATCHS[#All],3,FALSE)","v":"21:00:00"},23,{"$f":"\"Groupe \"&VLOOKUP($I30,TABLEAU_TEAMS[[#All],[TEAM]:[GROUP_INITIAL_RANK]],2,FALSE)","v":"Groupe D"},2.4,3,2.8,{"$f":"VLOOKUP($D30,TABLEAU_MATCHS[#All],4,FALSE)","v":"Argentine"},null,null,{"$f":"VLOOKUP($D30,TABLEAU_MATCHS[#All],5,FALSE)","v":"Croatie"},null,{"$f":"IF(OR(ISBLANK(RESULTATS!J30),ISBLANK(J30)),\"\",IF(AND('Pronostiqueur 2'!J30=RESULTATS!J30,'Pronostiqueur 2'!M30=RESULTATS!M30),3,IF(OR(AND('Pronostiqueur 2'!J30>'Pronostiqueur 2'!M30,RESULTATS!J30>RESULTATS!M30),AND('Pronostiqueur 2'!J30<'Pronostiqueur 2'!M30,RESULTATS!J30<RESULTATS!M30),AND('Pronostiqueur 2'!J30='Pronostiqueur 2'!M30,RESULTATS!J30=RESULTATS!M30)),1,0)))","v":""},null,null,null,"00000Argentine",0,1,"Argentine",{"$f":"SUMPRODUCT((Teams1=U30)*(Teams1_Score<>\"\"))+SUMPRODUCT((Teams2=U30)*(Teams2_Score<>\"\"))","v":0},{"$f":"SUMPRODUCT((Teams1=U30)*(Teams1_Score>Teams2_Score))+SUMPRODUCT((Teams2=U30)*(Teams2_Score>Teams1_Score))","v":0},{"$f":"SUMPRODUCT((Teams1=U30)*(Teams1_Score=Teams2_Score)*(Teams1_Score<>\"\"))+SUMPRODUCT((Teams2=U30)*(Teams2_Score=Teams1_Score)*(Teams2_Score<>\"\"))","v":0},{"$f":"SUMPRODUCT((Teams1=U30)*(Teams1_Score<Teams2_Score))+SUMPRODUCT((Teams2=U30)*(Teams2_Score<Teams1_Score))","v":0},{"$f":"SUMPRODUCT((Teams1=U30)*(Teams1_Score))+SUMPRODUCT((Teams2=U30)*(Teams2_Score))","v":0},{"$f":"SUMPRODUCT((Teams1=U30)*(Teams2_Score))+SUMPRODUCT((Teams2=U30)*(Teams1_Score))","v":0},0,0]
[null,{"$f":"VLOOKUP($D31,TABLEAU_MATCHS[#All],2,FALSE)","v":"2018-06-22"},{"$f":"VLOOKUP($D31,TABLEAU_MATCHS[#All],3,FALSE)","v":"18:00:00"},24,{"$f":"\"Groupe \"&VLOOKUP($I31,TABLEAU_TEAMS[[#All],[TEAM]:[GROUP_INITIAL_RANK]],2,FALSE)","v":"Groupe D"},1.26,4.5999999999999996,9.5,{"$f":"VLOOKUP($D31,TABLEAU_MATCHS[#All],4,FALSE)","v":"Nigeria"},null,null,{"$f":"VLOOKUP($D31,TABLEAU_MATCHS[#All],5,FALSE)","v":"Islande"},null,{"$f":"IF(OR(ISBLANK(RESULTATS!J31),ISBLANK(J31)),\"\",IF(AND('Pronostiqueur 2'!J31=RESULTATS!J31,'Pronostiqueur 2'!M31=RESULTATS!M31),3,IF(OR(AND('Pronostiqueur 2'!J31>'Pronostiqueur 2'!M31,RESULTATS!J31>RESULTATS!M31),AND('Pronostiqueur 2'!J31<'Pronostiqueur 2'!M31,RESULTATS!J31<RESULTATS!M31),AND('Pronostiqueur 2'!J31='Pronostiqueur 2'!M31,RESULTATS!J31=RESULTATS!M31)),1,0)))","v":""},null,null,null,null,null,null,null,null,null,null,null,null,null,null,null,null,null,"Date","Demi Finale",null,null,"Buts",null,"Pen",null,null,null,"Buts",null,"Pen"]
[null,{"$f":"VLOOKUP($D32,TABLEAU_MATCHS[#All],2,FALSE)","v":"2018-06-22"},{"$f":"VLOOKUP($D32,TABLEAU_MATCHS[#All],3,FALSE)","v":"15:00:00"},25,{"$f":"\"Groupe \"&VLOOKUP($I32,TABLEAU_TEAMS[[#All],[TEAM]:[GROUP_INITIAL_RANK]],2,FALSE)","v":"Groupe E"},3.5,2.95,2.1,{"$f":"VLOOKUP($D32,TABLEAU_MATCHS[#All],4,FALSE)","v":"Brésil"},null,null,{"$f":"VLOOKUP($D32,TABLEAU_MATCHS[#All],5,FALSE)","v":"Costa Rica"},null,{"$f":"IF(OR(ISBLANK(RESULTATS!J32),ISBLANK(J32)),\"\",IF(AND('Pronostiqueur 2'!J32=RESULTATS!J32,'Pronostiqueur 2'!M32=RESULTATS!M32),3,IF(OR(AND('Pronostiqueur 2'!J32>'Pronostiqueur 2'!M32,RESULTATS!J32>RESULTATS!M32),AND('Pronostiqueur 2'!J32<'Pronostiqueur 2'!M32,RESULTATS!J32<RESULTATS!M32),AND('Pronostiqueur 2'!J32='Pronostiqueur 2'!M32,RESULTATS!J32=RESULTATS!M32)),1,0)))","v":""},null,null,null,null,null,"Rg","Groupe E","MJ","G","N","P","BP","BC","+/-","Pts"]
[null,{"$f":"VLOOKUP($D33,TABLEAU_MATCHS[#All],2,FALSE)","v":"2018-06-22"},{"$f":"VLOOKUP($D33,TABLEAU_MATCHS[#All],3,FALSE)","v":"20:00:00"},26,{"$f":"\"Groupe \"&VLOOKUP($I33,TABLEAU_TEAMS[[#All],[TEAM]:[GROUP_INITIAL_RANK]],2,FALSE)","v":"Groupe E"},4.8,3.25,1.62,{"$f":"VLOOKUP($D33,TABLEAU_MATCHS[#All],4,FALSE)","v":"Serbie"},null,null,{"$f":"VLOOKUP($D33,TABLEAU_MATCHS[#All],5,FALSE)","v":"Suisse"},null,{"$f":"IF(OR(ISBLANK(RESULTATS!J33),ISBLANK(J33)),\"\",IF(AND('Pronostiqueur 2'!J33=RESULTATS!J33,'Pronostiqueur 2'!M33=RESULTATS!M33),3,IF(OR(AND('Pronostiqueur 2'!J33>'Pronostiqueur 2'!M33,RESULTATS!J33>RESULTATS!M33),AND('Pronostiqueur 2'!J33<'Pronostiqueur 2'!M33,RESULTATS!J33<RESULTATS!M33),AND('Pronostiqueur 2'!J33='Pronostiqueur 2'!M33,RESULTATS!J33=RESULTATS!M33)),1,0)))","v":""},null,null,null,{"$f":"INDEX($R84:$R87,MATCH(SMALL(COUNTIF($R84:$R87,\">=\"&$R84:$R87),ROW(INDIRECT(\"1:\"&ROWS($R84:$R87)))),COUNTIF($R84:$R87,\">=\"&$R84:$R87),0))","v":"00000Suisse"},{"$f":"INDEX($S84:$S87,MATCH(SMALL(COUNTIF($R84:$R87,\">=\"&$R84:$R87),ROW(INDIRECT(\"1:\"&ROWS($R84:$R87)))),COUNTIF($R84:$R87,\">=\"&$R84:$R87),0))","v":0},{"$f":"INDEX($T84:$T87,MATCH(SMALL(COUNTIF($R84:$R87,\">=\"&$R84:$R87),ROW(INDIRECT(\"1:\"&ROWS($R84:$R87)))),COUNTIF($R84:$R87,\">=\"&$R84:$R87),0))","v":1},{"$f":"INDEX($U84:$U87,MATCH(SMALL(COUNTIF($R84:$R87,\">=\"&$R84:$R87),ROW(INDIRECT(\"1:\"&ROWS($R84:$R87)))),COUNTIF($R84:$R87,\">=\"&$R84:$R87),0))","v":"Suisse"},{"$f":"SUMPRODUCT((Teams1=U33)*(Teams1_Score<>\"\"))+SUMPRODUCT((Teams2=U33)*(Teams2_Score<>\"\"))","v":0},{"$f":"SUMPRODUCT((Teams1=U33)*(Teams1_Score>Teams2_Score))+SUMPRODUCT((Teams2=U33)*(Teams2_Score>Teams1_Score))","v":0},{"$f":"SUMPRODUCT((Teams1=U33)*(Teams1_Score=Teams2_Score)*(Teams1_Score<>\"\"))+SUMPRODUCT((Teams2=U33)*(Teams2_Score=Teams1_Score)*(Teams2_Score<>\"\"))","v":0},{"$f":"SUMPRODUCT((Teams1=U33)*(Teams1_Score<Teams2_Score))+SUMPRODUCT((Teams2=U33)*(Teams2_Score<Teams1_Score))","v":0},{"$f":"SUMPRODUCT((Teams1=U33)*(Teams1_Score))+SUMPRODUCT((Teams2=U33)*(Teams2_Score))","v":0},{"$f":"SUMPRODUCT((Teams1=U33)*(Teams2_Score))+SUMPRODUCT((Teams2=U33)*(Teams1_Score))","v":0},{"$f":"Z33-AA33","v":0},{"$f":"3*W33+X33","v":0},null,null,"2018-07-10",1,{"$f":"+IF(AJ38<>\"\",IF(AI38>AO38,AH38,AN38),\"Vainqueur A\")","v":"Vainqueur A"},{"$f":"AJ33*10+AL33","v":0},null,{"$f":"IF(LEFT(AH33,5)<>\"Vainq\",COUNTIF(RESULTATS!$AG$18:$AM$19,AH33),0)","v":0},null,null,{"$f":"+IF(AJ40<>\"\",IF(AI40>AO40,AH40,AN40),\"Vainqueur C\")","v":"Vainqueur C"},{"$f":"AP33*10+AR33","v":0},null,{"$f":"IF(LEFT(AN33,5)<>\"Vainq\",COUNTIF(RESULTATS!$AG$18:$AM$19,AN33),0)","v":0}]
[null,{"$f":"VLOOKUP($D34,TABLEAU_MATCHS[#All],2,FALSE)","v":"2018-06-23"},{"$f":"VLOOKUP($D34,TABLEAU_MATCHS[#All],3,FALSE)","v":"18:00:00"},27,{"$f":"\"Groupe \"&VLOOKUP($I34,TABLEAU_TEAMS[[#All],[TEAM]:[GROUP_INITIAL_RANK]],2,FALSE)","v":"Groupe F"},1.1200000000000001,6.5,15,{"$f":"VLOOKUP($D34,TABLEAU_MATCHS[#All],4,FALSE)","v":"République de Corée"},null,null,{"$f":"VLOOKUP($D34,TABLEAU_MATCHS[#All],5,FALSE)","v":"Mexique"},null,{"$f":"IF(OR(ISBLANK(RESULTATS!J34),ISBLANK(J34)),\"\",IF(AND('Pronostiqueur 2'!J34=RESULTATS!J34,'Pronostiqueur 2'!M34=RESULTATS!M34),3,IF(OR(AND('Pronostiqueur 2'!J34>'Pronostiqueur 2'!M34,RESULTATS!J34>RESULTATS!M34),AND('Pronostiqueur 2'!J34<'Pronostiqueur 2'!M34,RESULTATS!J34<RESULTATS!M34),AND('Pronostiqueur 2'!J34='Pronostiqueur 2'!M34,RESULTATS!J34=RESULTATS!M34)),1,0)))","v":""},null,null,null,"00000Serbie",0,1,"Serbie",{"$f":"SUMPRODUCT((Teams1=U34)*(Teams1_Score<>\"\"))+SUMPRODUCT((Teams2=U34)*(Teams2_Score<>\"\"))","v":0},{"$f":"SUMPRODUCT((Teams1=U34)*(Teams1_Score>Teams2_Score))+SUMPRODUCT((Teams2=U34)*(Teams2_Score>Teams1_Score))","v":0},{"$f":"SUMPRODUCT((Teams1=U34)*(Teams1_Score=Teams2_Score)*(Teams1_Score<>\"\"))+SUMPRODUCT((Teams2=U34)*(Teams2_Score=Teams1_Score)*(Teams2_Score<>\"\"))","v":0},{"$f":"SUMPRODUCT((Teams1=U34)*(Teams1_Score<Teams2_Score))+SUMPRODUCT((Teams2=U34)*(Teams2_Score<Teams1_Score))","v":0},{"$f":"SUMPRODUCT((Teams1=U34)*(Teams1_Score))+SUMPRODUCT((Teams2=U34)*(Teams2_Score))","v":0},{"$f":"SUMPRODUCT((Teams1=U34)*(Teams2_Score))+SUMPRODUCT((Teams2=U34)*(Teams1_Score))","v":0},0,0,null,null,"2018-07-11",2,{"$f":"+IF(AJ39<>\"\",IF(AI39>AO39,AH39,AN39),\"Vainqueur B\")","v":"Vainqueur B"},0,null,{"$f":"IF(LEFT(AH34,5)<>\"Vainq\",COUNTIF(RESULTATS!$AG$18:$AM$19,AH34),0)","v":0},null,null,{"$f":"+IF(AJ41<>\"\",IF(AI41>AO41,AH41,AN41),\"Vainqueur D\")","v":"Vainqueur D"},0,null,{"$f":"IF(LEFT(AN34,5)<>\"Vainq\",COUNTIF(RESULTATS!$AG$18:$AM$19,AN34),0)","v":0}]
[null,{"$f":"VLOOKUP($D35,TABLEAU_MATCHS[#All],2,FALSE)","v":"2018-06-23"},{"$f":"VLOOKUP($D35,TABLEAU_MATCHS[#All],3,FALSE)","v":"21:00:00"},28,{"$f":"\"Groupe \"&VLOOKUP($I35,TABLEAU_TEAMS[[#All],[TEAM]:[GROUP_INITIAL_RANK]],2,FALSE)","v":"Groupe F"},2.8,2.95,2.4,{"$f":"VLOOKUP($D35,TABLEAU_MATCHS[#All],4,FALSE)","v":"Allemagne"},null,null,{"$f":"VLOOKUP($D35,TABLEAU_MATCHS[#All],5,FALSE)","v":"Suède"},null,{"$f":"IF(OR(ISBLANK(RESULTATS!J35),ISBLANK(J35)),\"\",IF(AND('Pronostiqueur 2'!J35=RESULTATS!J35,'Pronostiqueur 2'!M35=RESULTATS!M35),3,IF(OR(AND('Pronostiqueur 2'!J35>'Pronostiqueur 2'!M35,RESULTATS!J35>RESULTATS!M35),AND('Pronostiqueur 2'!J35<'Pronostiqueur 2'!M35,RESULTATS!J35<RESULTATS!M35),AND('Pronostiqueur 2'!J35='Pronostiqueur 2'!M35,RESULTATS!J35=RESULTATS!M35)),1,0)))","v":""},null,null,null,"00000Costa Rica",0,1,"Costa Rica",{"$f":"SUMPRODUCT((Teams1=U35)*(Teams1_Score<>\"\"))+SUMPRODUCT((Teams2=U35)*(Teams2_Score<>\"\"))","v":0},{"$f":"SUMPRODUCT((Teams1=U35)*(Teams1_Score>Teams2_Score))+SUMPRODUCT((Teams2=U35)*(Teams2_Score>Teams1_Score))","v":0},{"$f":"SUMPRODUCT((Teams1=U35)*(Teams1_Score=Teams2_Score)*(Teams1_Score<>\"\"))+SUMPRODUCT((Teams2=U35)*(Teams2_Score=Teams1_Score)*(Teams2_Score<>\"\"))","v":0},{"$f":"SUMPRODUCT((Teams1=U35)*(Teams1_Score<Teams2_Score))+SUMPRODUCT((Teams2=U35)*(Teams2_Score<Teams1_Score))","v":0},{"$f":"SUMPRODUCT((Teams1=U35)*(Teams1_Score))+SUMPRODUCT((Teams2=U35)*(Teams2_Score))","v":0},{"$f":"SUMPRODUCT((Teams1=U35)*(Teams2_Score))+SUMPRODUCT((Teams2=U35)*(Teams1_Score))","v":0},0,0,null,null,null,null,null,null,null,{"$f":"SUM(AK33:AK34)","v":0},null,null,null,null,null,{"$f":"SUM(AQ33:AQ34)","v":0}]
[null,{"$f":"VLOOKUP($D36,TABLEAU_MATCHS[#All],2,FALSE)","v":"2018-06-23"},{"$f":"VLOOKUP($D36,TABLEAU_MATCHS[#All],3,FALSE)","v":"15:00:00"},29,{"$f":"\"Groupe \"&VLOOKUP($I36,TABLEAU_TEAMS[[#All],[TEAM]:[GROUP_INITIAL_RANK]],2,FALSE)","v":"Groupe G"},1.36,4,7.5,{"$f":"VLOOKUP($D36,TABLEAU_MATCHS[#All],4,FALSE)","v":"Belgique"},null,null,{"$f":"VLOOKUP($D36,TABLEAU_MATCHS[#All],5,FALSE)","v":"Tunisie"},null,{"$f":"IF(OR(ISBLANK(RESULTATS!J36),ISBLANK(J36)),\"\",IF(AND('Pronostiqueur 2'!J36=RESULTATS!J36,'Pronostiqueur 2'!M36=RESULTATS!M36),3,IF(OR(AND('Pronostiqueur 2'!J36>'Pronostiqueur 2'!M36,RESULTATS!J36>RESULTATS!M36),AND('Pronostiqueur 2'!J36<'Pronostiqueur 2'!M36,RESULTATS!J36<RESULTATS!M36),AND('Pronostiqueur 2'!J36='Pronostiqueur 2'!M36,RESULTATS!J36=RESULTATS!M36)),1,0)))","v":""},null,null,null,"00000Brésil",0,1,"Brésil",{"$f":"SUMPRODUCT((Teams1=U36)*(Teams1_Score<>\"\"))+SUMPRODUCT((Teams2=U36)*(Teams2_Score<>\"\"))","v":0},{"$f":"SUMPRODUCT((Teams1=U36)*(Teams1_Score>Teams2_Score))+SUMPRODUCT((Teams2=U36)*(Teams2_Score>Teams1_Score))","v":0},{"$f":"SUMPRODUCT((Teams1=U36)*(Teams1_Score=Teams2_Score)*(Teams1_Score<>\"\"))+SUMPRODUCT((Teams2=U36)*(Teams2_Score=Teams1_Score)*(Teams2_Score<>\"\"))","v":0},{"$f":"SUMPRODUCT((Teams1=U36)*(Teams1_Score<Teams2_Score))+SUMPRODUCT((Teams2=U36)*(Teams2_Score<Teams1_Score))","v":0},{"$f":"SUMPRODUCT((Teams1=U36)*(Teams1_Score))+SUMPRODUCT((Teams2=U36)*(Teams2_Score))","v":0},{"$f":"SUMPRODUCT((Teams1=U36)*(Teams2_Score))+SUMPRODUCT((Teams2=U36)*(Teams1_Score))","v":0},0,0,null,null,"Date","Quart de Finale",null,null,"Buts",null,"Pen",null,null,null,"Buts",null,"Pen"]
[null,{"$f":"VLOOKUP($D37,TABLEAU_MATCHS[#All],2,FALSE)","v":"2018-06-24"},{"$f":"VLOOKUP($D37,TABLEAU_MATCHS[#All],3,FALSE)","v":"15:00:00"},30,{"$f":"\"Groupe \"&VLOOKUP($I37,TABLEAU_TEAMS[[#All],[TEAM]:[GROUP_INITIAL_RANK]],2,FALSE)","v":"Groupe G"},4.7,3.4,1.62,{"$f":"VLOOKUP($D37,TABLEAU_MATCHS[#All],4,FALSE)","v":"Angleterre"},null,null,{"$f":"VLOOKUP($D37,TABLEAU_MATCHS[#All],5,FALSE)","v":"Panama"},null,{"$f":"IF(OR(ISBLANK(RESULTATS!J37),ISBLANK(J37)),\"\",IF(AND('Pronostiqueur 2'!J37=RESULTATS!J37,'Pronostiqueur 2'!M37=RESULTATS!M37),3,IF(OR(AND('Pronostiqueur 2'!J37>'Pronostiqueur 2'!M37,RESULTATS!J37>RESULTATS!M37),AND('Pronostiqueur 2'!J37<'Pronostiqueur 2'!M37,RESULTATS!J37<RESULTATS!M37),AND('Pronostiqueur 2'!J37='Pronostiqueur 2'!M37,RESULTATS!J37=RESULTATS!M37)),1,0)))","v":""}]
[null,{"$f":"VLOOKUP($D38,TABLEAU_MATCHS[#All],2,FALSE)","v":"2018-06-24"},{"$f":"VLOOKUP($D38,TABLEAU_MATCHS[#All],3,FALSE)","v":"20:00:00"},31,{"$f":"\"Groupe \"&VLOOKUP($I38,TABLEAU_TEAMS[[#All],[TEAM]:[GROUP_INITIAL_RANK]],2,FALSE)","v":"Groupe H"},2.1,2.95,3.35,{"$f":"VLOOKUP($D38,TABLEAU_MATCHS[#All],4,FALSE)","v":"Japon"},null,null,{"$f":"VLOOKUP($D38,TABLEAU_MATCHS[#All],5,FALSE)","v":"Sénégal"},null,{"$f":"IF(OR(ISBLANK(RESULTATS!J38),ISBLANK(J38)),\"\",IF(AND('Pronostiqueur 2'!J38=RESULTATS!J38,'Pronostiqueur 2'!M38=RESULTATS!M38),3,IF(OR(AND('Pronostiqueur 2'!J38>'Pronostiqueur 2'!M38,RESULTATS!J38>RESULTATS!M38),AND('Pronostiqueur 2'!J38<'Pronostiqueur 2'!M38,RESULTATS!J38<RESULTATS!M38),AND('Pronostiqueur 2'!J38='Pronostiqueur 2'!M38,RESULTATS!J38=RESULTATS!M38)),1,0)))","v":""},null,null,null,null,null,"Rg","Groupe F","MJ","G","N","P","BP","BC","+/-","Pts",null,null,"2018-07-06","A",{"$f":"+IF(AJ45<>\"\",IF(AI45>AO45,AH45,AN45),\"Vainqueur 1\")","v":"Vainqueur 1"},{"$f":"AJ38*10+AL38","v":0},null,{"$f":"IF(LEFT(AH38,5)<>\"Vainq\",COUNTIF(RESULTATS!$AG$23:$AM$26,AH38),0)","v":0},null,null,{"$f":"+IF(AJ47<>\"\",IF(AI47>AO47,AH47,AN47),\"Vainqueur 3\")","v":"Vainqueur 3"},{"$f":"AP38*10+AR38","v":0},null,{"$f":"IF(LEFT(AN38,5)<>\"Vainq\",COUNTIF(RESULTATS!$AG$23:$AM$26,AN38),0)","v":0}]
[null,{"$f":"VLOOKUP($D39,TABLEAU_MATCHS[#All],2,FALSE)","v":"2018-06-24"},{"$f":"VLOOKUP($D39,TABLEAU_MATCHS[#All],3,FALSE)","v":"21:00:00"},32,{"$f":"\"Groupe \"&VLOOKUP($I39,TABLEAU_TEAMS[[#All],[TEAM]:[GROUP_INITIAL_RANK]],2,FALSE)","v":"Groupe H"},1.9,3,3.8,{"$f":"VLOOKUP($D39,TABLEAU_MATCHS[#All],4,FALSE)","v":"Pologne"},null,null,{"$f":"VLOOKUP($D39,TABLEAU_MATCHS[#All],5,FALSE)","v":"Colombie"},null,{"$f":"IF(OR(ISBLANK(RESULTATS!J39),ISBLANK(J39)),\"\",IF(AND('Pronostiqueur 2'!J39=RESULTATS!J39,'Pronostiqueur 2'!M39=RESULTATS!M39),3,IF(OR(AND('Pronostiqueur 2'!J39>'Pronostiqueur 2'!M39,RESULTATS!J39>RESULTATS!M39),AND('Pronostiqueur 2'!J39<'Pronostiqueur 2'!M39,RESULTATS!J39<RESULTATS!M39),AND('Pronostiqueur 2'!J39='Pronostiqueur 2'!M39,RESULTATS!J39=RESULTATS!M39)),1,0)))","v":""},null,null,null,{"$f":"INDEX($R90:$R93,MATCH(SMALL(COUNTIF($R90:$R93,\">=\"&$R90:$R93),ROW(INDIRECT(\"1:\"&ROWS($R90:$R93)))),COUNTIF($R90:$R93,\">=\"&$R90:$R93),0))","v":"00000Suède"},{"$f":"INDEX($S90:$S93,MATCH(SMALL(COUNTIF($R90:$R93,\">=\"&$R90:$R93),ROW(INDIRECT(\"1:\"&ROWS($R90:$R93)))),COUNTIF($R90:$R93,\">=\"&$R90:$R93),0))","v":0},{"$f":"INDEX($T90:$T93,MATCH(SMALL(COUNTIF($R90:$R93,\">=\"&$R90:$R93),ROW(INDIRECT(\"1:\"&ROWS($R90:$R93)))),COUNTIF($R90:$R93,\">=\"&$R90:$R93),0))","v":1},{"$f":"INDEX($U90:$U93,MATCH(SMALL(COUNTIF($R90:$R93,\">=\"&$R90:$R93),ROW(INDIRECT(\"1:\"&ROWS($R90:$R93)))),COUNTIF($R90:$R93,\">=\"&$R90:$R93),0))","v":"Suède"},{"$f":"SUMPRODUCT((Teams1=U39)*(Teams1_Score<>\"\"))+SUMPRODUCT((Teams2=U39)*(Teams2_Score<>\"\"))","v":0},{"$f":"SUMPRODUCT((Teams1=U39)*(Teams1_Score>Teams2_Score))+SUMPRODUCT((Teams2=U39)*(Teams2_Score>Teams1_Score))","v":0},{"$f":"SUMPRODUCT((Teams1=U39)*(Teams1_Score=Teams2_Score)*(Teams1_Score<>\"\"))+SUMPRODUCT((Teams2=U39)*(Teams2_Score=Teams1_Score)*(Teams2_Score<>\"\"))","v":0},{"$f":"SUMPRODUCT((Teams1=U39)*(Teams1_Score<Teams2_Score))+SUMPRODUCT((Teams2=U39)*(Teams2_Score<Teams1_Score))","v":0},{"$f":"SUMPRODUCT((Teams1=U39)*(Teams1_Score))+SUMPRODUCT((Teams2=U39)*(Teams2_Score))","v":0},{"$f":"SUMPRODUCT((Teams1=U39)*(Teams2_Score))+SUMPRODUCT((Teams2=U39)*(Teams1_Score))","v":0},{"$f":"Z39-AA39","v":0},{"$f":"3*W39+X39","v":0},null,null,"2018-07-07","B",{"$f":"+IF(AJ46<>\"\",IF(AI46>AO46,AH46,AN46),\"Vainqueur 2\")","v":"Vainqueur 2"},0,null,{"$f":"IF(LEFT(AH39,5)<>\"Vainq\",COUNTIF(RESULTATS!$AG$23:$AM$26,AH39),0)","v":0},null,null,{"$f":"+IF(AJ48<>\"\",IF(AI48>AO48,AH48,AN48),\"Vainqueur 4\")","v":"Vainqueur 4"},0,null,{"$f":"IF(LEFT(AN39,5)<>\"Vainq\",COUNTIF(RESULTATS!$AG$23:$AM$26,AN39),0)","v":0}]
[null,{"$f":"VLOOKUP($D40,TABLEAU_MATCHS[#All],2,FALSE)","v":"2018-06-25"},{"$f":"VLOOKUP($D40,TABLEAU_MATCHS[#All],3,FALSE)","v":"18:00:00"},33,{"$f":"\"Groupe \"&VLOOKUP($I40,TABLEAU_TEAMS[[#All],[TEAM]:[GROUP_INITIAL_RANK]],2,FALSE)","v":"Groupe A"},11,6.5,1.17,{"$f":"VLOOKUP($D40,TABLEAU_MATCHS[#All],4,FALSE)","v":"Uruguay"},null,null,{"$f":"VLOOKUP($D40,TABLEAU_MATCHS[#All],5,FALSE)","v":"Russie"},null,{"$f":"IF(OR(ISBLANK(RESULTATS!J40),ISBLANK(J40)),\"\",IF(AND('Pronostiqueur 2'!J40=RESULTATS!J40,'Pronostiqueur 2'!M40=RESULTATS!M40),3,IF(OR(AND('Pronostiqueur 2'!J40>'Pronostiqueur 2'!M40,RESULTATS!J40>RESULTATS!M40),AND('Pronostiqueur 2'!J40<'Pronostiqueur 2'!M40,RESULTATS!J40<RESULTATS!M40),AND('Pronostiqueur 2'!J40='Pronostiqueur 2'!M40,RESULTATS!J40=RESULTATS!M40)),1,0)))","v":""},null,null,null,"00000République de Corée",0,1,"République de Corée",{"$f":"SUMPRODUCT((Teams1=U40)*(Teams1_Score<>\"\"))+SUMPRODUCT((Teams2=U40)*(Teams2_Score<>\"\"))","v":0},{"$f":"SUMPRODUCT((Teams1=U40)*(Teams1_Score>Teams2_Score))+SUMPRODUCT((Teams2=U40)*(Teams2_Score>Teams1_Score))","v":0},{"$f":"SUMPRODUCT((Teams1=U40)*(Teams1_Score=Teams2_Score)*(Teams1_Score<>\"\"))+SUMPRODUCT((Teams2=U40)*(Teams2_Score=Teams1_Score)*(Teams2_Score<>\"\"))","v":0},{"$f":"SUMPRODUCT((Teams1=U40)*(Teams1_Score<Teams2_Score))+SUMPRODUCT((Teams2=U40)*(Teams2_Score<Teams1_Score))","v":0},{"$f":"SUMPRODUCT((Teams1=U40)*(Teams1_Score))+SUMPRODUCT((Teams2=U40)*(Teams2_Score))","v":0},{"$f":"SUMPRODUCT((Teams1=U40)*(Teams2_Score))+SUMPRODUCT((Teams2=U40)*(Teams1_Score))","v":0},0,0,null,null,"2018-07-06","C",{"$f":"+IF(AJ49<>\"\",IF(AI49>AO49,AH49,AN49),\"Vainqueur 5\")","v":"Vainqueur 5"},0,null,{"$f":"IF(LEFT(AH40,5)<>\"Vainq\",COUNTIF(RESULTATS!$AG$23:$AM$26,AH40),0)","v":0},null,null,{"$f":"+IF(AJ51<>\"\",IF(AI51>AO51,AH51,AN51),\"Vainqueur 7\")","v":"Vainqueur 7"},0,null,{"$f":"IF(LEFT(AN40,5)<>\"Vainq\",COUNTIF(RESULTATS!$AG$23:$AM$26,AN40),0)","v":0}]
[null,{"$f":"VLOOKUP($D41,TABLEAU_MATCHS[#All],2,FALSE)","v":"2018-06-25"},{"$f":"VLOOKUP($D41,TABLEAU_MATCHS[#All],3,FALSE)","v":"17:00:00"},34,{"$f":"\"Groupe \"&VLOOKUP($I41,TABLEAU_TEAMS[[#All],[TEAM]:[GROUP_INITIAL_RANK]],2,FALSE)","v":"Groupe A"},2.4,2.95,2.75,{"$f":"VLOOKUP($D41,TABLEAU_MATCHS[#All],4,FALSE)","v":"Arabie Saoudite"},null,null,{"$f":"VLOOKUP($D41,TABLEAU_MATCHS[#All],5,FALSE)","v":"Egypte"},null,{"$f":"IF(OR(ISBLANK(RESULTATS!J41),ISBLANK(J41)),\"\",IF(AND('Pronostiqueur 2'!J41=RESULTATS!J41,'Pronostiqueur 2'!M41=RESULTATS!M41),3,IF(OR(AND('Pronostiqueur 2'!J41>'Pronostiqueur 2'!M41,RESULTATS!J41>RESULTATS!M41),AND('Pronostiqueur 2'!J41<'Pronostiqueur 2'!M41,RESULTATS!J41<RESULTATS!M41),AND('Pronostiqueur 2'!J41='Pronostiqueur 2'!M41,RESULTATS!J41=RESULTATS!M41)),1,0)))","v":""},null,null,null,"00000Mexique",0,1,"Mexique",{"$f":"SUMPRODUCT((Teams1=U41)*(Teams1_Score<>\"\"))+SUMPRODUCT((Teams2=U41)*(Teams2_Score<>\"\"))","v":0},{"$f":"SUMPRODUCT((Teams1=U41)*(Teams1_Score>Teams2_Score))+SUMPRODUCT((Teams2=U41)*(Teams2_Score>Teams1_Score))","v":0},{"$f":"SUMPRODUCT((Teams1=U41)*(Teams1_Score=Teams2_Score)*(Teams1_Score<>\"\"))+SUMPRODUCT((Teams2=U41)*(Teams2_Score=Teams1_Score)*(Teams2_Score<>\"\"))","v":0},{"$f":"SUMPRODUCT((Teams1=U41)*(Teams1_Score<Teams2_Score))+SUMPRODUCT((Teams2=U41)*(Teams2_Score<Teams1_Score))","v":0},{"$f":"SUMPRODUCT((Teams1=U41)*(Teams1_Score))+SUMPRODUCT((Teams2=U41)*(Teams2_Score))","v":0},{"$f":"SUMPRODUCT((Teams1=U41)*(Teams2_Score))+SUMPRODUCT((Teams2=U41)*(Teams1_Score))","v":0},0,0,null,null,"2018-07-07","D",{"$f":"+IF(AJ50<>\"\",IF(AI50>AO50,AH50,AN50),\"Vainqueur 6\")","v":"Vainqueur 6"},0,null,{"$f":"IF(LEFT(AH41,5)<>\"Vainq\",COUNTIF(RESULTATS!$AG$23:$AM$26,AH41),0)","v":0},null,null,{"$f":"+IF(AJ52<>\"\",IF(AI52>AO52,AH52,AN52),\"Vainqueur 8\")","v":"Vainqueur 8"},0,null,{"$f":"IF(LEFT(AN41,5)<>\"Vainq\",COUNTIF(RESULTATS!$AG$23:$AM$26,AN41),0)","v":0}]
[null,{"$f":"VLOOKUP($D42,TABLEAU_MATCHS[#All],2,FALSE)","v":"2018-06-25"},{"$f":"VLOOKUP($D42,TABLEAU_MATCHS[#All],3,FALSE)","v":"21:00:00"},35,{"$f":"\"Groupe \"&VLOOKUP($I42,TABLEAU_TEAMS[[#All],[TEAM]:[GROUP_INITIAL_RANK]],2,FALSE)","v":"Groupe B"},13,6.5,1.1399999999999999,{"$f":"VLOOKUP($D42,TABLEAU_MATCHS[#All],4,FALSE)","v":"RI Iran"},null,null,{"$f":"VLOOKUP($D42,TABLEAU_MATCHS[#All],5,FALSE)","v":"Portugal"},null,{"$f":"IF(OR(ISBLANK(RESULTATS!J42),ISBLANK(J42)),\"\",IF(AND('Pronostiqueur 2'!J42=RESULTATS!J42,'Pronostiqueur 2'!M42=RESULTATS!M42),3,IF(OR(AND('Pronostiqueur 2'!J42>'Pronostiqueur 2'!M42,RESULTATS!J42>RESULTATS!M42),AND('Pronostiqueur 2'!J42<'Pronostiqueur 2'!M42,RESULTATS!J42<RESULTATS!M42),AND('Pronostiqueur 2'!J42='Pronostiqueur 2'!M42,RESULTATS!J42=RESULTATS!M42)),1,0)))","v":""},null,null,null,"00000Allemagne",0,1,"Allemagne",{"$f":"SUMPRODUCT((Teams1=U42)*(Teams1_Score<>\"\"))+SUMPRODUCT((Teams2=U42)*(Teams2_Score<>\"\"))","v":0},{"$f":"SUMPRODUCT((Teams1=U42)*(Teams1_Score>Teams2_Score))+SUMPRODUCT((Teams2=U42)*(Teams2_Score>Teams1_Score))","v":0},{"$f":"SUMPRODUCT((Teams1=U42)*(Teams1_Score=Teams2_Score)*(Teams1_Score<>\"\"))+SUMPRODUCT((Teams2=U42)*(Teams2_Score=Teams1_Score)*(Teams2_Score<>\"\"))","v":0},{"$f":"SUMPRODUCT((Teams1=U42)*(Teams1_Score<Teams2_Score))+SUMPRODUCT((Teams2=U42)*(Teams2_Score<Teams1_Score))","v":0},{"$f":"SUMPRODUCT((Teams1=U42)*(Teams1_Score))+SUMPRODUCT((Teams2=U42)*(Teams2_Score))","v":0},{"$f":"SUMPRODUCT((Teams1=U42)*(Teams2_Score))+SUMPRODUCT((Teams2=U42)*(Teams1_Score))","v":0},0,0,null,null,null,null,null,null,null,{"$f":"SUM(AK38:AK41)","v":0},null,null,null,null,null,{"$f":"SUM(AQ38:AQ41)","v":0}]
[null,{"$f":"VLOOKUP($D43,TABLEAU_MATCHS[#All],2,FALSE)","v":"2018-06-25"},{"$f":"VLOOKUP($D43,TABLEAU_MATCHS[#All],3,FALSE)","v":"20:00:00"},36,{"$f":"\"Groupe \"&VLOOKUP($I43,TABLEAU_TEAMS[[#All],[TEAM]:[GROUP_INITIAL_RANK]],2,FALSE)","v":"Groupe B"},2.25,3.1,2.95,{"$f":"VLOOKUP($D43,TABLEAU_MATCHS[#All],4,FALSE)","v":"Espagne"},null,null,{"$f":"VLOOKUP($D43,TABLEAU_MATCHS[#All],5,FALSE)","v":"Maroc"},null,{"$f":"IF(OR(ISBLANK(RESULTATS!J43),ISBLANK(J43)),\"\",IF(AND('Pronostiqueur 2'!J43=RESULTATS!J43,'Pronostiqueur 2'!M43=RESULTATS!M43),3,IF(OR(AND('Pronostiqueur 2'!J43>'Pronostiqueur 2'!M43,RESULTATS!J43>RESULTATS!M43),AND('Pronostiqueur 2'!J43<'Pronostiqueur 2'!M43,RESULTATS!J43<RESULTATS!M43),AND('Pronostiqueur 2'!J43='Pronostiqueur 2'!M43,RESULTATS!J43=RESULTATS!M43)),1,0)))","v":""},null,null,null,null,null,null,null,null,null,null,null,null,null,null,null,null,null,"Date","Huitième de Finale",null,null,"Buts",null,"Pen",null,null,null,"Buts",null,"Pen"]
[null,{"$f":"VLOOKUP($D44,TABLEAU_MATCHS[#All],2,FALSE)","v":"2018-06-26"},{"$f":"VLOOKUP($D44,TABLEAU_MATCHS[#All],3,FALSE)","v":"17:00:00"},37,{"$f":"\"Groupe \"&VLOOKUP($I44,TABLEAU_TEAMS[[#All],[TEAM]:[GROUP_INITIAL_RANK]],2,FALSE)","v":"Groupe C"},4.3,3.25,1.76,{"$f":"VLOOKUP($D44,TABLEAU_MATCHS[#All],4,FALSE)","v":"Danemark"},null,null,{"$f":"VLOOKUP($D44,TABLEAU_MATCHS[#All],5,FALSE)","v":"France"},null,{"$f":"IF(OR(ISBLANK(RESULTATS!J44),ISBLANK(J44)),\"\",IF(AND('Pronostiqueur 2'!J44=RESULTATS!J44,'Pronostiqueur 2'!M44=RESULTATS!M44),3,IF(OR(AND('Pronostiqueur 2'!J44>'Pronostiqueur 2'!M44,RESULTATS!J44>RESULTATS!M44),AND('Pronostiqueur 2'!J44<'Pronostiqueur 2'!M44,RESULTATS!J44<RESULTATS!M44),AND('Pronostiqueur 2'!J44='Pronostiqueur 2'!M44,RESULTATS!J44=RESULTATS!M44)),1,0)))","v":""},null,null,null,null,null,"Rg","Groupe G","MJ","G","N","P","BP","BC","+/-","Pts"]
[null,{"$f":"VLOOKUP($D45,TABLEAU_MATCHS[#All],2,FALSE)","v":"2018-06-26"},{"$f":"VLOOKUP($D45,TABLEAU_MATCHS[#All],3,FALSE)","v":"17:00:00"},38,{"$f":"\"Groupe \"&VLOOKUP($I45,TABLEAU_TEAMS[[#All],[TEAM]:[GROUP_INITIAL_RANK]],2,FALSE)","v":"Groupe C"},3.05,3,2.25,{"$f":"VLOOKUP($D45,TABLEAU_MATCHS[#All],4,FALSE)","v":"Australie"},null,null,{"$f":"VLOOKUP($D45,TABLEAU_MATCHS[#All],5,FALSE)","v":"Pérou"},null,{"$f":"IF(OR(ISBLANK(RESULTATS!J45),ISBLANK(J45)),\"\",IF(AND('Pronostiqueur 2'!J45=RESULTATS!J45,'Pronostiqueur 2'!M45=RESULTATS!M45),3,IF(OR(AND('Pronostiqueur 2'!J45>'Pronostiqueur 2'!M45,RESULTATS!J45>RESULTATS!M45),AND('Pronostiqueur 2'!J45<'Pronostiqueur 2'!M45,RESULTATS!J45<RESULTATS!M45),AND('Pronostiqueur 2'!J45='Pronostiqueur 2'!M45,RESULTATS!J45=RESULTATS!M45)),1,0)))","v":""},null,null,null,{"$f":"INDEX($R96:$R99,MATCH(SMALL(COUNTIF($R96:$R99,\">=\"&$R96:$R99),ROW(INDIRECT(\"1:\"&ROWS($R96:$R99)))),COUNTIF($R96:$R99,\">=\"&$R96:$R99),0))","v":"00000Tunisie"},{"$f":"INDEX($S96:$S99,MATCH(SMALL(COUNTIF($R96:$R99,\">=\"&$R96:$R99),ROW(INDIRECT(\"1:\"&ROWS($R96:$R99)))),COUNTIF($R96:$R99,\">=\"&$R96:$R99),0))","v":0},{"$f":"INDEX($T96:$T99,MATCH(SMALL(COUNTIF($R96:$R99,\">=\"&$R96:$R99),ROW(INDIRECT(\"1:\"&ROWS($R96:$R99)))),COUNTIF($R96:$R99,\">=\"&$R96:$R99),0))","v":1},{"$f":"INDEX($U96:$U99,MATCH(SMALL(COUNTIF($R96:$R99,\">=\"&$R96:$R99),ROW(INDIRECT(\"1:\"&ROWS($R96:$R99)))),COUNTIF($R96:$R99,\">=\"&$R96:$R99),0))","v":"Tunisie"},{"$f":"SUMPRODUCT((Teams1=U45)*(Teams1_Score<>\"\"))+SUMPRODUCT((Teams2=U45)*(Teams2_Score<>\"\"))","v":0},{"$f":"SUMPRODUCT((Teams1=U45)*(Teams1_Score>Teams2_Score))+SUMPRODUCT((Teams2=U45)*(Teams2_Score>Teams1_Score))","v":0},{"$f":"SUMPRODUCT((Teams1=U45)*(Teams1_Score=Teams2_Score)*(Teams1_Score<>\"\"))+SUMPRODUCT((Teams2=U45)*(Teams2_Score=Teams1_Score)*(Teams2_Score<>\"\"))","v":0},{"$f":"SUMPRODUCT((Teams1=U45)*(Teams1_Score<Teams2_Score))+SUMPRODUCT((Teams2=U45)*(Teams2_Score<Teams1_Score))","v":0},{"$f":"SUMPRODUCT((Teams1=U45)*(Teams1_Score))+SUMPRODUCT((Teams2=U45)*(Teams2_Score))","v":0},{"$f":"SUMPRODUCT((Teams1=U45)*(Teams2_Score))+SUMPRODUCT((Teams2=U45)*(Teams1_Score))","v":0},{"$f":"Z45-AA45","v":0},{"$f":"3*W45+X45","v":0},null,null,"2018-06-30",1,{"$f":"IF(SUM(V9:V12)=0,\"1er Groupe A\",IF(COUNTIF(T9:T12,1)=1,VLOOKUP(1,T9:U12,2,FALSE),IF(COUNTIF(T9:T12,1)>=2,\"Tirage au Sort A1\")))","v":"1er Groupe A"},{"$f":"AJ45*10+AL45","v":0},null,{"$f":"IF(AND(LEFT(AH45,3)<>\"1er\",LEFT(AH45,3)<>\"2nd\"),COUNTIF(RESULTATS!$AG$30:$AM$37,AH45),0)","v":0},null,null,{"$f":"IF(SUM(V15:V18)=0,\"2nd Groupe B\",IF(OR(COUNTIF(T15:T18,1)>1,COUNTIF(T15:T18,2)>1),\"Tirage au sort B2\",VLOOKUP(2,T15:U18,2,FALSE)))","v":"2nd Groupe B"},{"$f":"AP45*10+AR45","v":0},null,{"$f":"IF(AND(LEFT(AN45,3)<>\"1er\",LEFT(AN45,3)<>\"2nd\"),COUNTIF(RESULTATS!$AG$30:$AM$37,AN45),0)","v":0}]
[null,{"$f":"VLOOKUP($D46,TABLEAU_MATCHS[#All],2,FALSE)","v":"2018-06-26"},{"$f":"VLOOKUP($D46,TABLEAU_MATCHS[#All],3,FALSE)","v":"21:00:00"},39,{"$f":"\"Groupe \"&VLOOKUP($I46,TABLEAU_TEAMS[[#All],[TEAM]:[GROUP_INITIAL_RANK]],2,FALSE)","v":"Groupe D"},2.4,2.9,2.85,{"$f":"VLOOKUP($D46,TABLEAU_MATCHS[#All],4,FALSE)","v":"Nigeria"},null,null,{"$f":"VLOOKUP($D46,TABLEAU_MATCHS[#All],5,FALSE)","v":"Argentine"},null,{"$f":"IF(OR(ISBLANK(RESULTATS!J46),ISBLANK(J46)),\"\",IF(AND('Pronostiqueur 2'!J46=RESULTATS!J46,'Pronostiqueur 2'!M46=RESULTATS!M46),3,IF(OR(AND('Pronostiqueur 2'!J46>'Pronostiqueur 2'!M46,RESULTATS!J46>RESULTATS!M46),AND('Pronostiqueur 2'!J46<'Pronostiqueur 2'!M46,RESULTATS!J46<RESULTATS!M46),AND('Pronostiqueur 2'!J46='Pronostiqueur 2'!M46,RESULTATS!J46=RESULTATS!M46)),1,0)))","v":""},null,null,null,"00000Panama",0,1,"Panama",{"$f":"SUMPRODUCT((Teams1=U46)*(Teams1_Score<>\"\"))+SUMPRODUCT((Teams2=U46)*(Teams2_Score<>\"\"))","v":0},{"$f":"SUMPRODUCT((Teams1=U46)*(Teams1_Score>Teams2_Score))+SUMPRODUCT((Teams2=U46)*(Teams2_Score>Teams1_Score))","v":0},{"$f":"SUMPRODUCT((Teams1=U46)*(Teams1_Score=Teams2_Score)*(Teams1_Score<>\"\"))+SUMPRODUCT((Teams2=U46)*(Teams2_Score=Teams1_Score)*(Teams2_Score<>\"\"))","v":0},{"$f":"SUMPRODUCT((Teams1=U46)*(Teams1_Score<Teams2_Score))+SUMPRODUCT((Teams2=U46)*(Teams2_Score<Teams1_Score))","v":0},{"$f":"SUMPRODUCT((Teams1=U46)*(Teams1_Score))+SUMPRODUCT((Teams2=U46)*(Teams2_Score))","v":0},{"$f":"SUMPRODUCT((Teams1=U46)*(Teams2_Score))+SUMPRODUCT((Teams2=U46)*(Teams1_Score))","v":0},0,0,null,null,"2018-07-01",2,{"$f":"IF(SUM(V15:V18)=0,\"1er Groupe B\",IF(COUNTIF(T15:T18,1)=1,VLOOKUP(1,T15:U18,2,FALSE),IF(COUNTIF(T15:T18,1)>=2,\"Tirage au Sort B1\")))","v":"1er Groupe B"},{"$f":"AJ46*10+AL46","v":0},null,{"$f":"IF(AND(LEFT(AH46,3)<>\"1er\",LEFT(AH46,3)<>\"2nd\"),COUNTIF(RESULTATS!$AG$30:$AM$37,AH46),0)","v":0},null,null,{"$f":"IF(SUM(V9:V12)=0,\"2nd Groupe A\",IF(OR(COUNTIF(T9:T12,1)>1,COUNTIF(T9:T12,2)>1),\"Tirage au sort A2\",VLOOKUP(2,T9:U12,2,FALSE)))","v":"2nd Groupe A"},0,null,{"$f":"IF(AND(LEFT(AN46,3)<>\"1er\",LEFT(AN46,3)<>\"2nd\"),COUNTIF(RESULTATS!$AG$30:$AM$37,AN46),0)","v":0}]
[null,{"$f":"VLOOKUP($D47,TABLEAU_MATCHS[#All],2,FALSE)","v":"2018-06-26"},{"$f":"VLOOKUP($D47,TABLEAU_MATCHS[#All],3,FALSE)","v":"21:00:00"},40,{"$f":"\"Groupe \"&VLOOKUP($I47,TABLEAU_TEAMS[[#All],[TEAM]:[GROUP_INITIAL_RANK]],2,FALSE)","v":"Groupe D"},6.5,3.7,1.44,{"$f":"VLOOKUP($D47,TABLEAU_MATCHS[#All],4,FALSE)","v":"Islande"},null,null,{"$f":"VLOOKUP($D47,TABLEAU_MATCHS[#All],5,FALSE)","v":"Croatie"},null,{"$f":"IF(OR(ISBLANK(RESULTATS!J47),ISBLANK(J47)),\"\",IF(AND('Pronostiqueur 2'!J47=RESULTATS!J47,'Pronostiqueur 2'!M47=RESULTATS!M47),3,IF(OR(AND('Pronostiqueur 2'!J47>'Pronostiqueur 2'!M47,RESULTATS!J47>RESULTATS!M47),AND('Pronostiqueur 2'!J47<'Pronostiqueur 2'!M47,RESULTATS!J47<RESULTATS!M47),AND('Pronostiqueur 2'!J47='Pronostiqueur 2'!M47,RESULTATS!J47=RESULTATS!M47)),1,0)))","v":""},null,null,null,"00000Belgique",0,1,"Belgique",{"$f":"SUMPRODUCT((Teams1=U47)*(Teams1_Score<>\"\"))+SUMPRODUCT((Teams2=U47)*(Teams2_Score<>\"\"))","v":0},{"$f":"SUMPRODUCT((Teams1=U47)*(Teams1_Score>Teams2_Score))+SUMPRODUCT((Teams2=U47)*(Teams2_Score>Teams1_Score))","v":0},{"$f":"SUMPRODUCT((Teams1=U47)*(Teams1_Score=Teams2_Score)*(Teams1_Score<>\"\"))+SUMPRODUCT((Teams2=U47)*(Teams2_Score=Teams1_Score)*(Teams2_Score<>\"\"))","v":0},{"$f":"SUMPRODUCT((Teams1=U47)*(Teams1_Score<Teams2_Score))+SUMPRODUCT((Teams2=U47)*(Teams2_Score<Teams1_Score))","v":0},{"$f":"SUMPRODUCT((Teams1=U47)*(Teams1_Score))+SUMPRODUCT((Teams2=U47)*(Teams2_Score))","v":0},{"$f":"SUMPRODUCT((Teams1=U47)*(Teams2_Score))+SUMPRODUCT((Teams2=U47)*(Teams1_Score))","v":0},0,0,null,null,"2017-06-30",3,{"$f":"IF(SUM(V21:V24)=0,\"1er Groupe C\",IF(COUNTIF(T21:T24,1)=1,VLOOKUP(1,T21:U24,2,FALSE),IF(COUNTIF(T21:T24,1)>=2,\"Tirage au Sort C1\")))","v":"1er Groupe C"},0,null,{"$f":"IF(AND(LEFT(AH47,3)<>\"1er\",LEFT(AH47,3)<>\"2nd\"),COUNTIF(RESULTATS!$AG$30:$AM$37,AH47),0)","v":0},null,null,{"$f":"IF(SUM(V27:V30)=0,\"2nd Groupe D\",IF(OR(COUNTIF(T27:T30,1)>1,COUNTIF(T27:T30,2)>1),\"Tirage au sort D2\",VLOOKUP(2,T27:U30,2,FALSE)))","v":"2nd Groupe D"},0,null,{"$f":"IF(AND(LEFT(AN47,3)<>\"1er\",LEFT(AN47,3)<>\"2nd\"),COUNTIF(RESULTATS!$AG$30:$AM$37,AN47),0)","v":0}]
[null,{"$f":"VLOOKUP($D48,TABLEAU_MATCHS[#All],2,FALSE)","v":"2018-06-27"},{"$f":"VLOOKUP($D48,TABLEAU_MATCHS[#All],3,FALSE)","v":"21:00:00"},41,{"$f":"\"Groupe \"&VLOOKUP($I48,TABLEAU_TEAMS[[#All],[TEAM]:[GROUP_INITIAL_RANK]],2,FALSE)","v":"Groupe E"},6.5,3.5,1.48,{"$f":"VLOOKUP($D48,TABLEAU_MATCHS[#All],4,FALSE)","v":"Serbie"},null,null,{"$f":"VLOOKUP($D48,TABLEAU_MATCHS[#All],5,FALSE)","v":"Brésil"},null,{"$f":"IF(OR(ISBLANK(RESULTATS!J48),ISBLANK(J48)),\"\",IF(AND('Pronostiqueur 2'!J48=RESULTATS!J48,'Pronostiqueur 2'!M48=RESULTATS!M48),3,IF(OR(AND('Pronostiqueur 2'!J48>'Pronostiqueur 2'!M48,RESULTATS!J48>RESULTATS!M48),AND('Pronostiqueur 2'!J48<'Pronostiqueur 2'!M48,RESULTATS!J48<RESULTATS!M48),AND('Pronostiqueur 2'!J48='Pronostiqueur 2'!M48,RESULTATS!J48=RESULTATS!M48)),1,0)))","v":""},null,null,null,"00000Angleterre",0,1,"Angleterre",{"$f":"SUMPRODUCT((Teams1=U48)*(Teams1_Score<>\"\"))+SUMPRODUCT((Teams2=U48)*(Teams2_Score<>\"\"))","v":0},{"$f":"SUMPRODUCT((Teams1=U48)*(Teams1_Score>Teams2_Score))+SUMPRODUCT((Teams2=U48)*(Teams2_Score>Teams1_Score))","v":0},{"$f":"SUMPRODUCT((Teams1=U48)*(Teams1_Score=Teams2_Score)*(Teams1_Score<>\"\"))+SUMPRODUCT((Teams2=U48)*(Teams2_Score=Teams1_Score)*(Teams2_Score<>\"\"))","v":0},{"$f":"SUMPRODUCT((Teams1=U48)*(Teams1_Score<Teams2_Score))+SUMPRODUCT((Teams2=U48)*(Teams2_Score<Teams1_Score))","v":0},{"$f":"SUMPRODUCT((Teams1=U48)*(Teams1_Score))+SUMPRODUCT((Teams2=U48)*(Teams2_Score))","v":0},{"$f":"SUMPRODUCT((Teams1=U48)*(Teams2_Score))+SUMPRODUCT((Teams2=U48)*(Teams1_Score))","v":0},0,0,null,null,"2018-07-01",4,{"$f":"IF(SUM(V27:V30)=0,\"1er Groupe D\",IF(COUNTIF(T27:T30,1)=1,VLOOKUP(1,T27:U30,2,FALSE),IF(COUNTIF(T27:T30,1)>=2,\"Tirage au Sort D1\")))","v":"1er Groupe D"},0,null,{"$f":"IF(AND(LEFT(AH48,3)<>\"1er\",LEFT(AH48,3)<>\"2nd\"),COUNTIF(RESULTATS!$AG$30:$AM$37,AH48),0)","v":0},null,null,{"$f":"IF(SUM(V21:V24)=0,\"2nd Groupe C\",IF(OR(COUNTIF(T21:T24,1)>1,COUNTIF(T21:T24,2)>1),\"Tirage au sort C2\",VLOOKUP(2,T21:U24,2,FALSE)))","v":"2nd Groupe C"},0,null,{"$f":"IF(AND(LEFT(AN48,3)<>\"1er\",LEFT(AN48,3)<>\"2nd\"),COUNTIF(RESULTATS!$AG$30:$AM$37,AN48),0)","v":0}]
[null,{"$f":"VLOOKUP($D49,TABLEAU_MATCHS[#All],2,FALSE)","v":"2018-06-27"},{"$f":"VLOOKUP($D49,TABLEAU_MATCHS[#All],3,FALSE)","v":"21:00:00"},42,{"$f":"\"Groupe \"&VLOOKUP($I49,TABLEAU_TEAMS[[#All],[TEAM]:[GROUP_INITIAL_RANK]],2,FALSE)","v":"Groupe E"},4,3.05,1.9,{"$f":"VLOOKUP($D49,TABLEAU_MATCHS[#All],4,FALSE)","v":"Suisse"},null,null,{"$f":"VLOOKUP($D49,TABLEAU_MATCHS[#All],5,FALSE)","v":"Costa Rica"},null,{"$f":"IF(OR(ISBLANK(RESULTATS!J49),ISBLANK(J49)),\"\",IF(AND('Pronostiqueur 2'!J49=RESULTATS!J49,'Pronostiqueur 2'!M49=RESULTATS!M49),3,IF(OR(AND('Pronostiqueur 2'!J49>'Pronostiqueur 2'!M49,RESULTATS!J49>RESULTATS!M49),AND('Pronostiqueur 2'!J49<'Pronostiqueur 2'!M49,RESULTATS!J49<RESULTATS!M49),AND('Pronostiqueur 2'!J49='Pronostiqueur 2'!M49,RESULTATS!J49=RESULTATS!M49)),1,0)))","v":""},null,null,null,null,null,null,null,null,null,null,null,null,null,null,null,null,null,"2018-07-02",5,{"$f":"IF(SUM(V33:V36)=0,\"1er Groupe E\",IF(COUNTIF(T33:T36,1)=1,VLOOKUP(1,T33:U36,2,FALSE),IF(COUNTIF(T33:T36,1)>=2,\"Tirage au Sort E1\")))","v":"1er Groupe E"},0,null,{"$f":"IF(AND(LEFT(AH49,3)<>\"1er\",LEFT(AH49,3)<>\"2nd\"),COUNTIF(RESULTATS!$AG$30:$AM$37,AH49),0)","v":0},null,null,{"$f":"IF(SUM(V39:V42)=0,\"2nd Groupe F\",IF(OR(COUNTIF(T39:T42,1)>1,COUNTIF(T39:T42,2)>1),\"Tirage au sort F2\",VLOOKUP(2,T39:U42,2,FALSE)))","v":"2nd Groupe F"},0,null,{"$f":"IF(AND(LEFT(AN49,3)<>\"1er\",LEFT(AN49,3)<>\"2nd\"),COUNTIF(RESULTATS!$AG$30:$AM$37,AN49),0)","v":0}]
[null,{"$f":"VLOOKUP($D50,TABLEAU_MATCHS[#All],2,FALSE)","v":"2018-06-27"},{"$f":"VLOOKUP($D50,TABLEAU_MATCHS[#All],3,FALSE)","v":"19:00:00"},43,{"$f":"\"Groupe \"&VLOOKUP($I50,TABLEAU_TEAMS[[#All],[TEAM]:[GROUP_INITIAL_RANK]],2,FALSE)","v":"Groupe F"},8.5,4.3,1.3,{"$f":"VLOOKUP($D50,TABLEAU_MATCHS[#All],4,FALSE)","v":"Mexique"},null,null,{"$f":"VLOOKUP($D50,TABLEAU_MATCHS[#All],5,FALSE)","v":"Suède"},null,{"$f":"IF(OR(ISBLANK(RESULTATS!J50),ISBLANK(J50)),\"\",IF(AND('Pronostiqueur 2'!J50=RESULTATS!J50,'Pronostiqueur 2'!M50=RESULTATS!M50),3,IF(OR(AND('Pronostiqueur 2'!J50>'Pronostiqueur 2'!M50,RESULTATS!J50>RESULTATS!M50),AND('Pronostiqueur 2'!J50<'Pronostiqueur 2'!M50,RESULTATS!J50<RESULTATS!M50),AND('Pronostiqueur 2'!J50='Pronostiqueur 2'!M50,RESULTATS!J50=RESULTATS!M50)),1,0)))","v":""},null,null,null,null,null,"Rg","Groupe H","MJ","G","N","P","BP","BC","+/-","Pts",null,null,"2018-07-03",6,{"$f":"IF(SUM(V39:V42)=0,\"1er Groupe F\",IF(COUNTIF(T39:T42,1)=1,VLOOKUP(1,T39:U42,2,FALSE),IF(COUNTIF(T39:T42,1)>=2,\"Tirage au Sort F1\")))","v":"1er Groupe F"},0,null,{"$f":"IF(AND(LEFT(AH50,3)<>\"1er\",LEFT(AH50,3)<>\"2nd\"),COUNTIF(RESULTATS!$AG$30:$AM$37,AH50),0)","v":0},null,null,{"$f":"IF(SUM(V33:V36)=0,\"2nd Groupe E\",IF(OR(COUNTIF(T33:T36,1)>1,COUNTIF(T33:T36,2)>1),\"Tirage au sort E2\",VLOOKUP(2,T33:U36,2,FALSE)))","v":"2nd Groupe E"},0,null,{"$f":"IF(AND(LEFT(AN50,3)<>\"1er\",LEFT(AN50,3)<>\"2nd\"),COUNTIF(RESULTATS!$AG$30:$AM$37,AN50),0)","v":0}]
[null,{"$f":"VLOOKUP($D51,TABLEAU_MATCHS[#All],2,FALSE)","v":"2018-06-27"},{"$f":"VLOOKUP($D51,TABLEAU_MATCHS[#All],3,FALSE)","v":"17:00:00"},44,{"$f":"\"Groupe \"&VLOOKUP($I51,TABLEAU_TEAMS[[#All],[TEAM]:[GROUP_INITIAL_RANK]],2,FALSE)","v":"Groupe F"},1.48,3.6,6.25,{"$f":"VLOOKUP($D51,TABLEAU_MATCHS[#All],4,FALSE)","v":"République de Corée"},null,null,{"$f":"VLOOKUP($D51,TABLEAU_MATCHS[#All],5,FALSE)","v":"Allemagne"},null,{"$f":"IF(OR(ISBLANK(RESULTATS!J51),ISBLANK(J51)),\"\",IF(AND('Pronostiqueur 2'!J51=RESULTATS!J51,'Pronostiqueur 2'!M51=RESULTATS!M51),3,IF(OR(AND('Pronostiqueur 2'!J51>'Pronostiqueur 2'!M51,RESULTATS!J51>RESULTATS!M51),AND('Pronostiqueur 2'!J51<'Pronostiqueur 2'!M51,RESULTATS!J51<RESULTATS!M51),AND('Pronostiqueur 2'!J51='Pronostiqueur 2'!M51,RESULTATS!J51=RESULTATS!M51)),1,0)))","v":""},null,null,null,{"$f":"INDEX($R102:$R105,MATCH(SMALL(COUNTIF($R102:$R105,\">=\"&$R102:$R105),ROW(INDIRECT(\"1:\"&ROWS($R102:$R105)))),COUNTIF($R102:$R105,\">=\"&$R102:$R105),0))","v":"00000Sénégal"},{"$f":"INDEX($S102:$S105,MATCH(SMALL(COUNTIF($R102:$R105,\">=\"&$R102:$R105),ROW(INDIRECT(\"1:\"&ROWS($R102:$R105)))),COUNTIF($R102:$R105,\">=\"&$R102:$R105),0))","v":0},{"$f":"INDEX($T102:$T105,MATCH(SMALL(COUNTIF($R102:$R105,\">=\"&$R102:$R105),ROW(INDIRECT(\"1:\"&ROWS($R102:$R105)))),COUNTIF($R102:$R105,\">=\"&$R102:$R105),0))","v":1},{"$f":"INDEX($U102:$U105,MATCH(SMALL(COUNTIF($R102:$R105,\">=\"&$R102:$R105),ROW(INDIRECT(\"1:\"&ROWS($R102:$R105)))),COUNTIF($R102:$R105,\">=\"&$R102:$R105),0))","v":"Sénégal"},{"$f":"SUMPRODUCT((Teams1=U51)*(Teams1_Score<>\"\"))+SUMPRODUCT((Teams2=U51)*(Teams2_Score<>\"\"))","v":0},{"$f":"SUMPRODUCT((Teams1=U51)*(Teams1_Score>Teams2_Score))+SUMPRODUCT((Teams2=U51)*(Teams2_Score>Teams1_Score))","v":0},{"$f":"SUMPRODUCT((Teams1=U51)*(Teams1_Score=Teams2_Score)*(Teams1_Score<>\"\"))+SUMPRODUCT((Teams2=U51)*(Teams2_Score=Teams1_Score)*(Teams2_Score<>\"\"))","v":0},{"$f":"SUMPRODUCT((Teams1=U51)*(Teams1_Score<Teams2_Score))+SUMPRODUCT((Teams2=U51)*(Teams2_Score<Teams1_Score))","v":0},{"$f":"SUMPRODUCT((Teams1=U51)*(Teams1_Score))+SUMPRODUCT((Teams2=U51)*(Teams2_Score))","v":0},{"$f":"SUMPRODUCT((Teams1=U51)*(Teams2_Score))+SUMPRODUCT((Teams2=U51)*(Teams1_Score))","v":0},{"$f":"Z51-AA51","v":0},{"$f":"3*W51+X51","v":0},null,null,"2018-07-02",7,{"$f":"IF(SUM(V45:V48)=0,\"1er Groupe G\",IF(COUNTIF(T45:T48,1)=1,VLOOKUP(1,T45:U48,2,FALSE),IF(COUNTIF(T45:T48,1)>=2,\"Tirage au Sort G1\")))","v":"1er Groupe G"},0,null,{"$f":"IF(AND(LEFT(AH51,3)<>\"1er\",LEFT(AH51,3)<>\"2nd\"),COUNTIF(RESULTATS!$AG$30:$AM$37,AH51),0)","v":0},null,null,{"$f":"IF(SUM(V51:V54)=0,\"2nd Groupe H\",IF(OR(COUNTIF(T51:T54,1)>1,COUNTIF(T51:T54,2)>1),\"Tirage au sort H2\",VLOOKUP(2,T51:U54,2,FALSE)))","v":"2nd Groupe H"},0,null,{"$f":"IF(AND(LEFT(AN51,3)<>\"1er\",LEFT(AN51,3)<>\"2nd\"),COUNTIF(RESULTATS!$AG$30:$AM$37,AN51),0)","v":0}]
[null,{"$f":"VLOOKUP($D52,TABLEAU_MATCHS[#All],2,FALSE)","v":"2018-06-28"},{"$f":"VLOOKUP($D52,TABLEAU_MATCHS[#All],3,FALSE)","v":"21:00:00"},45,{"$f":"\"Groupe \"&VLOOKUP($I52,TABLEAU_TEAMS[[#All],[TEAM]:[GROUP_INITIAL_RANK]],2,FALSE)","v":"Groupe G"},8,4.2,1.32,{"$f":"VLOOKUP($D52,TABLEAU_MATCHS[#All],4,FALSE)","v":"Panama"},null,null,{"$f":"VLOOKUP($D52,TABLEAU_MATCHS[#All],5,FALSE)","v":"Tunisie"},null,{"$f":"IF(OR(ISBLANK(RESULTATS!J52),ISBLANK(J52)),\"\",IF(AND('Pronostiqueur 2'!J52=RESULTATS!J52,'Pronostiqueur 2'!M52=RESULTATS!M52),3,IF(OR(AND('Pronostiqueur 2'!J52>'Pronostiqueur 2'!M52,RESULTATS!J52>RESULTATS!M52),AND('Pronostiqueur 2'!J52<'Pronostiqueur 2'!M52,RESULTATS!J52<RESULTATS!M52),AND('Pronostiqueur 2'!J52='Pronostiqueur 2'!M52,RESULTATS!J52=RESULTATS!M52)),1,0)))","v":""},null,null,null,"00000Pologne",0,1,"Pologne",{"$f":"SUMPRODUCT((Teams1=U52)*(Teams1_Score<>\"\"))+SUMPRODUCT((Teams2=U52)*(Teams2_Score<>\"\"))","v":0},{"$f":"SUMPRODUCT((Teams1=U52)*(Teams1_Score>Teams2_Score))+SUMPRODUCT((Teams2=U52)*(Teams2_Score>Teams1_Score))","v":0},{"$f":"SUMPRODUCT((Teams1=U52)*(Teams1_Score=Teams2_Score)*(Teams1_Score<>\"\"))+SUMPRODUCT((Teams2=U52)*(Teams2_Score=Teams1_Score)*(Teams2_Score<>\"\"))","v":0},{"$f":"SUMPRODUCT((Teams1=U52)*(Teams1_Score<Teams2_Score))+SUMPRODUCT((Teams2=U52)*(Teams2_Score<Teams1_Score))","v":0},{"$f":"SUMPRODUCT((Teams1=U52)*(Teams1_Score))+SUMPRODUCT((Teams2=U52)*(Teams2_Score))","v":0},{"$f":"SUMPRODUCT((Teams1=U52)*(Teams2_Score))+SUMPRODUCT((Teams2=U52)*(Teams1_Score))","v":0},0,0,null,null,"2018-07-03",8,{"$f":"IF(SUM(V51:V54)=0,\"1er Groupe H\",IF(COUNTIF(T51:T54,1)=1,VLOOKUP(1,T51:U54,2,FALSE),IF(COUNTIF(T51:T54,1)>=2,\"Tirage au Sort H1\")))","v":"1er Groupe H"},0,null,{"$f":"IF(AND(LEFT(AH52,3)<>\"1er\",LEFT(AH52,3)<>\"2nd\"),COUNTIF(RESULTATS!$AG$30:$AM$37,AH52),0)","v":0},null,null,{"$f":"IF(SUM(V45:V48)=0,\"2nd Groupe G\",IF(OR(COUNTIF(T45:T48,1)>1,COUNTIF(T45:T48,2)>1),\"Tirage au sort G2\",VLOOKUP(2,T45:U48,2,FALSE)))","v":"2nd Groupe G"},0,null,{"$f":"IF(AND(LEFT(AN52,3)<>\"1er\",LEFT(AN52,3)<>\"2nd\"),COUNTIF(RESULTATS!$AG$30:$AM$37,AN52),0)","v":0}]
[null,{"$f":"VLOOKUP($D53,TABLEAU_MATCHS[#All],2,FALSE)","v":"2018-06-28"},{"$f":"VLOOKUP($D53,TABLEAU_MATCHS[#All],3,FALSE)","v":"20:00:00"},46,{"$f":"\"Groupe \"&VLOOKUP($I53,TABLEAU_TEAMS[[#All],[TEAM]:[GROUP_INITIAL_RANK]],2,FALSE)","v":"Groupe G"},1.74,3.2,4.0999999999999996,{"$f":"VLOOKUP($D53,TABLEAU_MATCHS[#All],4,FALSE)","v":"Angleterre"},null,null,{"$f":"VLOOKUP($D53,TABLEAU_MATCHS[#All],5,FALSE)","v":"Belgique"},null,{"$f":"IF(OR(ISBLANK(RESULTATS!J53),ISBLANK(J53)),\"\",IF(AND('Pronostiqueur 2'!J53=RESULTATS!J53,'Pronostiqueur 2'!M53=RESULTATS!M53),3,IF(OR(AND('Pronostiqueur 2'!J53>'Pronostiqueur 2'!M53,RESULTATS!J53>RESULTATS!M53),AND('Pronostiqueur 2'!J53<'Pronostiqueur 2'!M53,RESULTATS!J53<RESULTATS!M53),AND('Pronostiqueur 2'!J53='Pronostiqueur 2'!M53,RESULTATS!J53=RESULTATS!M53)),1,0)))","v":""},null,null,null,"00000Japon",0,1,"Japon",{"$f":"SUMPRODUCT((Teams1=U53)*(Teams1_Score<>\"\"))+SUMPRODUCT((Teams2=U53)*(Teams2_Score<>\"\"))","v":0},{"$f":"SUMPRODUCT((Teams1=U53)*(Teams1_Score>Teams2_Score))+SUMPRODUCT((Teams2=U53)*(Teams2_Score>Teams1_Score))","v":0},{"$f":"SUMPRODUCT((Teams1=U53)*(Teams1_Score=Teams2_Score)*(Teams1_Score<>\"\"))+SUMPRODUCT((Teams2=U53)*(Teams2_Score=Teams1_Score)*(Teams2_Score<>\"\"))","v":0},{"$f":"SUMPRODUCT((Teams1=U53)*(Teams1_Score<Teams2_Score))+SUMPRODUCT((Teams2=U53)*(Teams2_Score<Teams1_Score))","v":0},{"$f":"SUMPRODUCT((Teams1=U53)*(Teams1_Score))+SUMPRODUCT((Teams2=U53)*(Teams2_Score))","v":0},{"$f":"SUMPRODUCT((Teams1=U53)*(Teams2_Score))+SUMPRODUCT((Teams2=U53)*(Teams1_Score))","v":0},0,0,null,null,null,null,null,null,null,{"$f":"SUM(AK45:AK52)","v":0},null,null,null,0,null,{"$f":"SUM(AQ45:AQ52)","v":0}]
[null,{"$f":"VLOOKUP($D54,TABLEAU_MATCHS[#All],2,FALSE)","v":"2018-06-28"},{"$f":"VLOOKUP($D54,TABLEAU_MATCHS[#All],3,FALSE)","v":"17:00:00"},47,{"$f":"\"Groupe \"&VLOOKUP($I54,TABLEAU_TEAMS[[#All],[TEAM]:[GROUP_INITIAL_RANK]],2,FALSE)","v":"Groupe H"},4.9000000000000004,3.25,1.62,{"$f":"VLOOKUP($D54,TABLEAU_MATCHS[#All],4,FALSE)","v":"Japon"},null,null,{"$f":"VLOOKUP($D54,TABLEAU_MATCHS[#All],5,FALSE)","v":"Pologne"},null,{"$f":"IF(OR(ISBLANK(RESULTATS!J54),ISBLANK(J54)),\"\",IF(AND('Pronostiqueur 2'!J54=RESULTATS!J54,'Pronostiqueur 2'!M54=RESULTATS!M54),3,IF(OR(AND('Pronostiqueur 2'!J54>'Pronostiqueur 2'!M54,RESULTATS!J54>RESULTATS!M54),AND('Pronostiqueur 2'!J54<'Pronostiqueur 2'!M54,RESULTATS!J54<RESULTATS!M54),AND('Pronostiqueur 2'!J54='Pronostiqueur 2'!M54,RESULTATS!J54=RESULTATS!M54)),1,0)))","v":""},null,null,null,"00000Colombie",0,1,"Colombie",{"$f":"SUMPRODUCT((Teams1=U54)*(Teams1_Score<>\"\"))+SUMPRODUCT((Teams2=U54)*(Teams2_Score<>\"\"))","v":0},{"$f":"SUMPRODUCT((Teams1=U54)*(Teams1_Score>Teams2_Score))+SUMPRODUCT((Teams2=U54)*(Teams2_Score>Teams1_Score))","v":0},{"$f":"SUMPRODUCT((Teams1=U54)*(Teams1_Score=Teams2_Score)*(Teams1_Score<>\"\"))+SUMPRODUCT((Teams2=U54)*(Teams2_Score=Teams1_Score)*(Teams2_Score<>\"\"))","v":0},{"$f":"SUMPRODUCT((Teams1=U54)*(Teams1_Score<Teams2_Score))+SUMPRODUCT((Teams2=U54)*(Teams2_Score<Teams1_Score))","v":0},{"$f":"SUMPRODUCT((Teams1=U54)*(Teams1_Score))+SUMPRODUCT((Teams2=U54)*(Teams2_Score))","v":0},{"$f":"SUMPRODUCT((Teams1=U54)*(Teams2_Score))+SUMPRODUCT((Teams2=U54)*(Teams1_Score))","v":0},0,0]
[null,{"$f":"VLOOKUP($D55,TABLEAU_MATCHS[#All],2,FALSE)","v":"2018-06-28"},{"$f":"VLOOKUP($D55,TABLEAU_MATCHS[#All],3,FALSE)","v":"18:00:00"},48,{"$f":"\"Groupe \"&VLOOKUP($I55,TABLEAU_TEAMS[[#All],[TEAM]:[GROUP_INITIAL_RANK]],2,FALSE)","v":"Groupe H"},6,3.4,1.52,{"$f":"VLOOKUP($D55,TABLEAU_MATCHS[#All],4,FALSE)","v":"Sénégal"},null,null,{"$f":"VLOOKUP($D55,TABLEAU_MATCHS[#All],5,FALSE)","v":"Colombie"},null,{"$f":"IF(OR(ISBLANK(RESULTATS!J55),ISBLANK(J55)),\"\",IF(AND('Pronostiqueur 2'!J55=RESULTATS!J55,'Pronostiqueur 2'!M55=RESULTATS!M55),3,IF(OR(AND('Pronostiqueur 2'!J55>'Pronostiqueur 2'!M55,RESULTATS!J55>RESULTATS!M55),AND('Pronostiqueur 2'!J55<'Pronostiqueur 2'!M55,RESULTATS!J55<RESULTATS!M55),AND('Pronostiqueur 2'!J55='Pronostiqueur 2'!M55,RESULTATS!J55=RESULTATS!M55)),1,0)))","v":""}]
[null,null,null,null,null,null,null,null,null,null,null,null,null,{"$f":"SUM(N8:N55)","v":0}]
[]
[]
[null,"Tirage au sort A1",null,null,null,null,null,null,null,null,null,null,null,null,null,null,null,null,null,"Rg","Groupe A","MJ","G","N","P","BP","BC","+/-","Pts"]
[null,{"$f":"IF(ROWS($1:1)<=COUNTIF($T$9:$T$12,1),INDEX($U$9:$U$12,SMALL(IF($T$9:$T$12=1,ROW(INDIRECT(\"1:\"&ROWS($T$9:$T$12)))),ROWS($1:1))),\"\")","v":"Uruguay"},null,null,null,null,null,null,null,null,null,null,null,null,null,null,"A_1",{"$f":"TEXT(S60,\"00000\")&U60","v":"00000Russie"},{"$f":"AC60*1000+AB60*100+Z60*10","v":0},{"$f":"RANK(S60,$S60:$S64,0)","v":1},{"$f":"VLOOKUP(Q60,TABLEAU_TEAMS[#All],2,FALSE)","v":"Russie"},{"$f":"SUMPRODUCT((Teams1=U60)*(Teams1_Score<>\"\"))+SUMPRODUCT((Teams2=U60)*(Teams2_Score<>\"\"))","v":0},{"$f":"SUMPRODUCT((Teams1=U60)*(Teams1_Score>Teams2_Score))+SUMPRODUCT((Teams2=U60)*(Teams2_Score>Teams1_Score))","v":0},{"$f":"SUMPRODUCT((Teams1=U60)*(Teams1_Score=Teams2_Score)*(Teams1_Score<>\"\"))+SUMPRODUCT((Teams2=U60)*(Teams2_Score=Teams1_Score)*(Teams2_Score<>\"\"))","v":0},{"$f":"SUMPRODUCT((Teams1=U60)*(Teams1_Score<Teams2_Score))+SUMPRODUCT((Teams2=U60)*(Teams2_Score<Teams1_Score))","v":0},{"$f":"SUMPRODUCT((Teams1=U60)*(Teams1_Score))+SUMPRODUCT((Teams2=U60)*(Teams2_Score))","v":0},{"$f":"SUMPRODUCT((Teams1=U60)*(Teams2_Score))+SUMPRODUCT((Teams2=U60)*(Teams1_Score))","v":0},{"$f":"Z60-AA60","v":0},{"$f":"3*W60+X60","v":0}]
[null,{"$f":"IF(ROWS($1:2)<=COUNTIF($T$9:$T$12,1),INDEX($U$9:$U$12,SMALL(IF($T$9:$T$12=1,ROW(INDIRECT(\"1:\"&ROWS($T$9:$T$12)))),ROWS($1:2))),\"\")","v":"Russie"},null,null,null,null,null,null,null,null,null,null,null,null,null,null,"A_2",{"$f":"TEXT(S61,\"00000\")&U61","v":"00000Arabie Saoudite"},{"$f":"AC61*1000+AB61*100+Z61*10","v":0},{"$f":"RANK(S61,$S60:$S64,0)","v":1},{"$f":"VLOOKUP(Q61,TABLEAU_TEAMS[#All],2,FALSE)","v":"Arabie Saoudite"},{"$f":"SUMPRODUCT((Teams1=U61)*(Teams1_Score<>\"\"))+SUMPRODUCT((Teams2=U61)*(Teams2_Score<>\"\"))","v":0},{"$f":"SUMPRODUCT((Teams1=U61)*(Teams1_Score>Teams2_Score))+SUMPRODUCT((Teams2=U61)*(Teams2_Score>Teams1_Score))","v":0},{"$f":"SUMPRODUCT((Teams1=U61)*(Teams1_Score=Teams2_Score)*(Teams1_Score<>\"\"))+SUMPRODUCT((Teams2=U61)*(Teams2_Score=Teams1_Score)*(Teams2_Score<>\"\"))","v":0},{"$f":"SUMPRODUCT((Teams1=U61)*(Teams1_Score<Teams2_Score))+SUMPRODUCT((Teams2=U61)*(Teams2_Score<Teams1_Score))","v":0},{"$f":"SUMPRODUCT((Teams1=U61)*(Teams1_Score))+SUMPRODUCT((Teams2=U61)*(Teams2_Score))","v":0},{"$f":"SUMPRODUCT((Teams1=U61)*(Teams2_Score))+SUMPRODUCT((Teams2=U61)*(Teams1_Score))","v":0},{"$f":"Z61-AA61","v":0},{"$f":"3*W61+X61","v":0}]
[null,{"$f":"IF(ROWS($1:3)<=COUNTIF($T$9:$T$12,1),INDEX($U$9:$U$12,SMALL(IF($T$9:$T$12=1,ROW(INDIRECT(\"1:\"&ROWS($T$9:$T$12)))),ROWS($1:3))),\"\")","v":"Egypte"},null,null,null,null,null,null,null,null,null,null,null,null,null,null,"A_3",{"$f":"TEXT(S62,\"00000\")&U62","v":"00000Egypte"},{"$f":"AC62*1000+AB62*100+Z62*10","v":0},{"$f":"RANK(S62,$S60:$S64,0)","v":1},{"$f":"VLOOKUP(Q62,TABLEAU_TEAMS[#All],2,FALSE)","v":"Egypte"},{"$f":"SUMPRODUCT((Teams1=U62)*(Teams1_Score<>\"\"))+SUMPRODUCT((Teams2=U62)*(Teams2_Score<>\"\"))","v":0},{"$f":"SUMPRODUCT((Teams1=U62)*(Teams1_Score>Teams2_Score))+SUMPRODUCT((Teams2=U62)*(Teams2_Score>Teams1_Score))","v":0},{"$f":"SUMPRODUCT((Teams1=U62)*(Teams1_Score=Teams2_Score)*(Teams1_Score<>\"\"))+SUMPRODUCT((Teams2=U62)*(Teams2_Score=Teams1_Score)*(Teams2_Score<>\"\"))","v":0},{"$f":"SUMPRODUCT((Teams1=U62)*(Teams1_Score<Teams2_Score))+SUMPRODUCT((Teams2=U62)*(Teams2_Score<Teams1_Score))","v":0},{"$f":"SUMPRODUCT((Teams1=U62)*(Teams1_Score))+SUMPRODUCT((Teams2=U62)*(Teams2_Score))","v":0},{"$f":"SUMPRODUCT((Teams1=U62)*(Teams2_Score))+SUMPRODUCT((Teams2=U62)*(Teams1_Score))","v":0},0,0]
[null,{"$f":"IF(ROWS($1:4)<=COUNTIF($T$9:$T$12,1),INDEX($U$9:$U$12,SMALL(IF($T$9:$T$12=1,ROW(INDIRECT(\"1:\"&ROWS($T$9:$T$12)))),ROWS($1:4))),\"\")","v":"Arabie Saoudite"},null,null,null,null,null,null,null,null,null,null,null,null,null,null,"A_4",{"$f":"TEXT(S63,\"00000\")&U63","v":"00000Uruguay"},{"$f":"AC63*1000+AB63*100+Z63*10","v":0},{"$f":"RANK(S63,$S60:$S64,0)","v":1},{"$f":"VLOOKUP(Q63,TABLEAU_TEAMS[#All],2,FALSE)","v":"Uruguay"},{"$f":"SUMPRODUCT((Teams1=U63)*(Teams1_Score<>\"\"))+SUMPRODUCT((Teams2=U63)*(Teams2_Score<>\"\"))","v":0},{"$f":"SUMPRODUCT((Teams1=U63)*(Teams1_Score>Teams2_Score))+SUMPRODUCT((Teams2=U63)*(Teams2_Score>Teams1_Score))","v":0},{"$f":"SUMPRODUCT((Teams1=U63)*(Teams1_Score=Teams2_Score)*(Teams1_Score<>\"\"))+SUMPRODUCT((Teams2=U63)*(Teams2_Score=Teams1_Score)*(Teams2_Score<>\"\"))","v":0},{"$f":"SUMPRODUCT((Teams1=U63)*(Teams1_Score<Teams2_Score))+SUMPRODUCT((Teams2=U63)*(Teams2_Score<Teams1_Score))","v":0},{"$f":"SUMPRODUCT((Teams1=U63)*(Teams1_Score))+SUMPRODUCT((Teams2=U63)*(Teams2_Score))","v":0},{"$f":"SUMPRODUCT((Teams1=U63)*(Teams2_Score))+SUMPRODUCT((Teams2=U63)*(Teams1_Score))","v":0},0,0]
[null,"Tirage au sort A2"]
[null,{"$f":"IF(COUNTIF($T$9:$T$12,1)>1,IF(ROWS($1:1)<=COUNTIF($T$9:$T$12,1),INDEX($U$9:$U$12,SMALL(IF($T$9:$T$12=1,ROW(INDIRECT(\"1:\"&ROWS($T$9:$T$12)))),ROWS($1:1))),\"\"),IF(COUNTIF($T$9:$T$12,2)>1,IF(ROWS($1:1)<=COUNTIF($T$9:$T$12,2),INDEX($U$9:$U$12,SMALL(IF($T$9:$T$12=2,ROW(INDIRECT(\"1:\"&ROWS($T$9:$T$12)))),ROWS($1:1))),\"\")))","v":"Uruguay"},null,null,null,null,null,null,null,null,null,null,null,null,null,null,null,null,null,"Rg","Groupe B","MJ","G","N","P","BP","BC","Pts","Pts"]
[null,{"$f":"IF(COUNTIF($T$9:$T$12,1)>1,IF(ROWS($1:2)<=COUNTIF($T$9:$T$12,1),INDEX($U$9:$U$12,SMALL(IF($T$9:$T$12=1,ROW(INDIRECT(\"1:\"&ROWS($T$9:$T$12)))),ROWS($1:2))),\"\"),IF(COUNTIF($T$9:$T$12,2)>1,IF(ROWS($1:2)<=COUNTIF($T$9:$T$12,2),INDEX($U$9:$U$12,SMALL(IF($T$9:$T$12=2,ROW(INDIRECT(\"1:\"&ROWS($T$9:$T$12)))),ROWS($1:2))),\"\")))","v":"Russie"},null,null,null,null,null,null,null,null,null,null,null,null,null,null,"B_1",{"$f":"TEXT(S66,\"00000\")&U66","v":"00000Maroc"},{"$f":"AC66*1000+AB66*100+Z66*10","v":0},{"$f":"RANK(S66,$S66:$S70,0)","v":1},{"$f":"VLOOKUP(Q66,TABLEAU_TEAMS[#All],2,FALSE)","v":"Maroc"},{"$f":"SUMPRODUCT((Teams1=U66)*(Teams1_Score<>\"\"))+SUMPRODUCT((Teams2=U66)*(Teams2_Score<>\"\"))","v":0},{"$f":"SUMPRODUCT((Teams1=U66)*(Teams1_Score>Teams2_Score))+SUMPRODUCT((Teams2=U66)*(Teams2_Score>Teams1_Score))","v":0},{"$f":"SUMPRODUCT((Teams1=U66)*(Teams1_Score=Teams2_Score)*(Teams1_Score<>\"\"))+SUMPRODUCT((Teams2=U66)*(Teams2_Score=Teams1_Score)*(Teams2_Score<>\"\"))","v":0},{"$f":"SUMPRODUCT((Teams1=U66)*(Teams1_Score<Teams2_Score))+SUMPRODUCT((Teams2=U66)*(Teams2_Score<Teams1_Score))","v":0},{"$f":"SUMPRODUCT((Teams1=U66)*(Teams1_Score))+SUMPRODUCT((Teams2=U66)*(Teams2_Score))","v":0},{"$f":"SUMPRODUCT((Teams1=U66)*(Teams2_Score))+SUMPRODUCT((Teams2=U66)*(Teams1_Score))","v":0},{"$f":"Z66-AA66","v":0},{"$f":"3*W66+X66","v":0}]
[null,{"$f":"IF(COUNTIF($T$9:$T$12,1)>1,IF(ROWS($1:3)<=COUNTIF($T$9:$T$12,1),INDEX($U$9:$U$12,SMALL(IF($T$9:$T$12=1,ROW(INDIRECT(\"1:\"&ROWS($T$9:$T$12)))),ROWS($1:3))),\"\"),IF(COUNTIF($T$9:$T$12,2)>1,IF(ROWS($1:3)<=COUNTIF($T$9:$T$12,2),INDEX($U$9:$U$12,SMALL(IF($T$9:$T$12=2,ROW(INDIRECT(\"1:\"&ROWS($T$9:$T$12)))),ROWS($1:3))),\"\")))","v":"Egypte"},null,null,null,null,null,null,null,null,null,null,null,null,null,null,"B_2",{"$f":"TEXT(S67,\"00000\")&U67","v":"00000RI Iran"},{"$f":"AC67*1000+AB67*100+Z67*10","v":0},{"$f":"RANK(S67,$S66:$S70,0)","v":1},{"$f":"VLOOKUP(Q67,TABLEAU_TEAMS[#All],2,FALSE)","v":"RI Iran"},{"$f":"SUMPRODUCT((Teams1=U67)*(Teams1_Score<>\"\"))+SUMPRODUCT((Teams2=U67)*(Teams2_Score<>\"\"))","v":0},{"$f":"SUMPRODUCT((Teams1=U67)*(Teams1_Score>Teams2_Score))+SUMPRODUCT((Teams2=U67)*(Teams2_Score>Teams1_Score))","v":0},{"$f":"SUMPRODUCT((Teams1=U67)*(Teams1_Score=Teams2_Score)*(Teams1_Score<>\"\"))+SUMPRODUCT((Teams2=U67)*(Teams2_Score=Teams1_Score)*(Teams2_Score<>\"\"))","v":0},{"$f":"SUMPRODUCT((Teams1=U67)*(Teams1_Score<Teams2_Score))+SUMPRODUCT((Teams2=U67)*(Teams2_Score<Teams1_Score))","v":0},{"$f":"SUMPRODUCT((Teams1=U67)*(Teams1_Score))+SUMPRODUCT((Teams2=U67)*(Teams2_Score))","v":0},{"$f":"SUMPRODUCT((Teams1=U67)*(Teams2_Score))+SUMPRODUCT((Teams2=U67)*(Teams1_Score))","v":0},0,0]
[null,{"$f":"IF(COUNTIF($T$9:$T$12,1)>1,IF(ROWS($1:4)<=COUNTIF($T$9:$T$12,1),INDEX($U$9:$U$12,SMALL(IF($T$9:$T$12=1,ROW(INDIRECT(\"1:\"&ROWS($T$9:$T$12)))),ROWS($1:4))),\"\"),IF(COUNTIF($T$9:$T$12,2)>1,IF(ROWS($1:4)<=COUNTIF($T$9:$T$12,2),INDEX($U$9:$U$12,SMALL(IF($T$9:$T$12=2,ROW(INDIRECT(\"1:\"&ROWS($T$9:$T$12)))),ROWS($1:4))),\"\")))","v":"Arabie Saoudite"},null,null,null,null,null,null,null,null,null,null,null,null,null,null,"B_3",{"$f":"TEXT(S68,\"00000\")&U68","v":"00000Portugal"},{"$f":"AC68*1000+AB68*100+Z68*10","v":0},{"$f":"RANK(S68,$S66:$S70,0)","v":1},{"$f":"VLOOKUP(Q68,TABLEAU_TEAMS[#All],2,FALSE)","v":"Portugal"},{"$f":"SUMPRODUCT((Teams1=U68)*(Teams1_Score<>\"\"))+SUMPRODUCT((Teams2=U68)*(Teams2_Score<>\"\"))","v":0},{"$f":"SUMPRODUCT((Teams1=U68)*(Teams1_Score>Teams2_Score))+SUMPRODUCT((Teams2=U68)*(Teams2_Score>Teams1_Score))","v":0},{"$f":"SUMPRODUCT((Teams1=U68)*(Teams1_Score=Teams2_Score)*(Teams1_Score<>\"\"))+SUMPRODUCT((Teams2=U68)*(Teams2_Score=Teams1_Score)*(Teams2_Score<>\"\"))","v":0},{"$f":"SUMPRODUCT((Teams1=U68)*(Teams1_Score<Teams2_Score))+SUMPRODUCT((Teams2=U68)*(Teams2_Score<Teams1_Score))","v":0},{"$f":"SUMPRODUCT((Teams1=U68)*(Teams1_Score))+SUMPRODUCT((Teams2=U68)*(Teams2_Score))","v":0},{"$f":"SUMPRODUCT((Teams1=U68)*(Teams2_Score))+SUMPRODUCT((Teams2=U68)*(Teams1_Score))","v":0},0,0]
[null,"Tirage au sort B1",null,null,null,null,null,null,null,null,null,null,null,null,null,null,"B_4",{"$f":"TEXT(S69,\"00000\")&U69","v":"00000Espagne"},{"$f":"AC69*1000+AB69*100+Z69*10","v":0},{"$f":"RANK(S69,$S66:$S70,0)","v":1},{"$f":"VLOOKUP(Q69,TABLEAU_TEAMS[#All],2,FALSE)","v":"Espagne"},{"$f":"SUMPRODUCT((Teams1=U69)*(Teams1_Score<>\"\"))+SUMPRODUCT((Teams2=U69)*(Teams2_Score<>\"\"))","v":0},{"$f":"SUMPRODUCT((Teams1=U69)*(Teams1_Score>Teams2_Score))+SUMPRODUCT((Teams2=U69)*(Teams2_Score>Teams1_Score))","v":0},{"$f":"SUMPRODUCT((Teams1=U69)*(Teams1_Score=Teams2_Score)*(Teams1_Score<>\"\"))+SUMPRODUCT((Teams2=U69)*(Teams2_Score=Teams1_Score)*(Teams2_Score<>\"\"))","v":0},{"$f":"SUMPRODUCT((Teams1=U69)*(Teams1_Score<Teams2_Score))+SUMPRODUCT((Teams2=U69)*(Teams2_Score<Teams1_Score))","v":0},{"$f":"SUMPRODUCT((Teams1=U69)*(Teams1_Score))+SUMPRODUCT((Teams2=U69)*(Teams2_Score))","v":0},{"$f":"SUMPRODUCT((Teams1=U69)*(Teams2_Score))+SUMPRODUCT((Teams2=U69)*(Teams1_Score))","v":0},0,0]
[null,{"$f":"IF(ROWS($1:1)<=COUNTIF($T$15:$T$18,1),INDEX($U$15:$U$18,SMALL(IF($T$15:$T$18=1,ROW(INDIRECT(\"1:\"&ROWS($T$15:$T$18)))),ROWS($1:1))),\"\")","v":"RI Iran"}]
[null,{"$f":"IF(ROWS($1:2)<=COUNTIF($T$15:$T$18,1),INDEX($U$15:$U$18,SMALL(IF($T$15:$T$18=1,ROW(INDIRECT(\"1:\"&ROWS($T$15:$T$18)))),ROWS($1:2))),\"\")","v":"Portugal"},null,null,null,null,null,null,null,null,null,null,null,null,null,null,null,null,null,"Rg","Groupe C","MJ","G","N","P","BP","BC","Pts","Pts"]
[null,{"$f":"IF(ROWS($1:3)<=COUNTIF($T$15:$T$18,1),INDEX($U$15:$U$18,SMALL(IF($T$15:$T$18=1,ROW(INDIRECT(\"1:\"&ROWS($T$15:$T$18)))),ROWS($1:3))),\"\")","v":"Maroc"},null,null,null,null,null,null,null,null,null,null,null,null,null,null,"C_1",{"$f":"TEXT(S72,\"00000\")&U72","v":"00000France"},{"$f":"AC72*1000+AB72*100+Z72*10","v":0},{"$f":"RANK(S72,$S72:$S76,0)","v":1},{"$f":"VLOOKUP(Q72,TABLEAU_TEAMS[#All],2,FALSE)","v":"France"},{"$f":"SUMPRODUCT((Teams1=U72)*(Teams1_Score<>\"\"))+SUMPRODUCT((Teams2=U72)*(Teams2_Score<>\"\"))","v":0},{"$f":"SUMPRODUCT((Teams1=U72)*(Teams1_Score>Teams2_Score))+SUMPRODUCT((Teams2=U72)*(Teams2_Score>Teams1_Score))","v":0},{"$f":"SUMPRODUCT((Teams1=U72)*(Teams1_Score=Teams2_Score)*(Teams1_Score<>\"\"))+SUMPRODUCT((Teams2=U72)*(Teams2_Score=Teams1_Score)*(Teams2_Score<>\"\"))","v":0},{"$f":"SUMPRODUCT((Teams1=U72)*(Teams1_Score<Teams2_Score))+SUMPRODUCT((Teams2=U72)*(Teams2_Score<Teams1_Score))","v":0},{"$f":"SUMPRODUCT((Teams1=U72)*(Teams1_Score))+SUMPRODUCT((Teams2=U72)*(Teams2_Score))","v":0},{"$f":"SUMPRODUCT((Teams1=U72)*(Teams2_Score))+SUMPRODUCT((Teams2=U72)*(Teams1_Score))","v":0},{"$f":"Z72-AA72","v":0},{"$f":"3*W72+X72","v":0}]
[null,{"$f":"IF(ROWS($1:4)<=COUNTIF($T$15:$T$18,1),INDEX($U$15:$U$18,SMALL(IF($T$15:$T$18=1,ROW(INDIRECT(\"1:\"&ROWS($T$15:$T$18)))),ROWS($1:4))),\"\")","v":"Espagne"},null,null,null,null,null,null,null,null,null,null,null,null,null,null,"C_2",{"$f":"TEXT(S73,\"00000\")&U73","v":"00000Australie"},{"$f":"AC73*1000+AB73*100+Z73*10","v":0},{"$f":"RANK(S73,$S72:$S76,0)","v":1},{"$f":"VLOOKUP(Q73,TABLEAU_TEAMS[#All],2,FALSE)","v":"Australie"},{"$f":"SUMPRODUCT((Teams1=U73)*(Teams1_Score<>\"\"))+SUMPRODUCT((Teams2=U73)*(Teams2_Score<>\"\"))","v":0},{"$f":"SUMPRODUCT((Teams1=U73)*(Teams1_Score>Teams2_Score))+SUMPRODUCT((Teams2=U73)*(Teams2_Score>Teams1_Score))","v":0},{"$f":"SUMPRODUCT((Teams1=U73)*(Teams1_Score=Teams2_Score)*(Teams1_Score<>\"\"))+SUMPRODUCT((Teams2=U73)*(Teams2_Score=Teams1_Score)*(Teams2_Score<>\"\"))","v":0},{"$f":"SUMPRODUCT((Teams1=U73)*(Teams1_Score<Teams2_Score))+SUMPRODUCT((Teams2=U73)*(Teams2_Score<Teams1_Score))","v":0},{"$f":"SUMPRODUCT((Teams1=U73)*(Teams1_Score))+SUMPRODUCT((Teams2=U73)*(Teams2_Score))","v":0},{"$f":"SUMPRODUCT((Teams1=U73)*(Teams2_Score))+SUMPRODUCT((Teams2=U73)*(Teams1_Score))","v":0},0,0]
[null,"Tirage au sort B2",null,null,null,null,null,null,null,null,null,null,null,null,null,null,"C_3",{"$f":"TEXT(S74,\"00000\")&U74","v":"00000Pérou"},{"$f":"AC74*1000+AB74*100+Z74*10","v":0},{"$f":"RANK(S74,$S72:$S76,0)","v":1},{"$f":"VLOOKUP(Q74,TABLEAU_TEAMS[#All],2,FALSE)","v":"Pérou"},{"$f":"SUMPRODUCT((Teams1=U74)*(Teams1_Score<>\"\"))+SUMPRODUCT((Teams2=U74)*(Teams2_Score<>\"\"))","v":0},{"$f":"SUMPRODUCT((Teams1=U74)*(Teams1_Score>Teams2_Score))+SUMPRODUCT((Teams2=U74)*(Teams2_Score>Teams1_Score))","v":0},{"$f":"SUMPRODUCT((Teams1=U74)*(Teams1_Score=Teams2_Score)*(Teams1_Score<>\"\"))+SUMPRODUCT((Teams2=U74)*(Teams2_Score=Teams1_Score)*(Teams2_Score<>\"\"))","v":0},{"$f":"SUMPRODUCT((Teams1=U74)*(Teams1_Score<Teams2_Score))+SUMPRODUCT((Teams2=U74)*(Teams2_Score<Teams1_Score))","v":0},{"$f":"SUMPRODUCT((Teams1=U74)*(Teams1_Score))+SUMPRODUCT((Teams2=U74)*(Teams2_Score))","v":0},{"$f":"SUMPRODUCT((Teams1=U74)*(Teams2_Score))+SUMPRODUCT((Teams2=U74)*(Teams1_Score))","v":0},0,0]
[null,{"$f":"IF(COUNTIF($T$15:$T$18,1)>1,IF(ROWS($1:1)<=COUNTIF($T$15:$T$18,1),INDEX($U$15:$U$18,SMALL(IF($T$15:$T$18=1,ROW(INDIRECT(\"1:\"&ROWS($T$15:$T$18)))),ROWS($1:1))),\"\"),IF(COUNTIF($T$15:$T$18,2)>1,IF(ROWS($1:1)<=COUNTIF($T$15:$T$18,2),INDEX($U$15:$U$18,SMALL(IF($T$15:$T$18=2,ROW(INDIRECT(\"1:\"&ROWS($T$15:$T$18)))),ROWS($1:1))),\"\")))","v":"RI Iran"},null,null,null,null,null,null,null,null,null,null,null,null,null,null,"C_4",{"$f":"TEXT(S75,\"00000\")&U75","v":"00000Danemark"},{"$f":"AC75*1000+AB75*100+Z75*10","v":0},{"$f":"RANK(S75,$S72:$S76,0)","v":1},{"$f":"VLOOKUP(Q75,TABLEAU_TEAMS[#All],2,FALSE)","v":"Danemark"},{"$f":"SUMPRODUCT((Teams1=U75)*(Teams1_Score<>\"\"))+SUMPRODUCT((Teams2=U75)*(Teams2_Score<>\"\"))","v":0},{"$f":"SUMPRODUCT((Teams1=U75)*(Teams1_Score>Teams2_Score))+SUMPRODUCT((Teams2=U75)*(Teams2_Score>Teams1_Score))","v":0},{"$f":"SUMPRODUCT((Teams1=U75)*(Teams1_Score=Teams2_Score)*(Teams1_Score<>\"\"))+SUMPRODUCT((Teams2=U75)*(Teams2_Score=Teams1_Score)*(Teams2_Score<>\"\"))","v":0},{"$f":"SUMPRODUCT((Teams1=U75)*(Teams1_Score<Teams2_Score))+SUMPRODUCT((Teams2=U75)*(Teams2_Score<Teams1_Score))","v":0},{"$f":"SUMPRODUCT((Teams1=U75)*(Teams1_Score))+SUMPRODUCT((Teams2=U75)*(Teams2_Score))","v":0},{"$f":"SUMPRODUCT((Teams1=U75)*(Teams2_Score))+SUMPRODUCT((Teams2=U75)*(Teams1_Score))","v":0},0,0]
[null,{"$f":"IF(COUNTIF($T$15:$T$18,1)>1,IF(ROWS($1:2)<=COUNTIF($T$15:$T$18,1),INDEX($U$15:$U$18,SMALL(IF($T$15:$T$18=1,ROW(INDIRECT(\"1:\"&ROWS($T$15:$T$18)))),ROWS($1:2))),\"\"),IF(COUNTIF($T$15:$T$18,2)>1,IF(ROWS($1:2)<=COUNTIF($T$15:$T$18,2),INDEX($U$15:$U$18,SMALL(IF($T$15:$T$18=2,ROW(INDIRECT(\"1:\"&ROWS($T$15:$T$18)))),ROWS($1:2))),\"\")))","v":"Portugal"}]
[null,{"$f":"IF(COUNTIF($T$15:$T$18,1)>1,IF(ROWS($1:3)<=COUNTIF($T$15:$T$18,1),INDEX($U$15:$U$18,SMALL(IF($T$15:$T$18=1,ROW(INDIRECT(\"1:\"&ROWS($T$15:$T$18)))),ROWS($1:3))),\"\"),IF(COUNTIF($T$15:$T$18,2)>1,IF(ROWS($1:3)<=COUNTIF($T$15:$T$18,2),INDEX($U$15:$U$18,SMALL(IF($T$15:$T$18=2,ROW(INDIRECT(\"1:\"&ROWS($T$15:$T$18)))),ROWS($1:3))),\"\")))","v":"Maroc"},null,null,null,null,null,null,null,null,null,null,null,null,null,null,null,null,null,"Rg","Groupe D","MJ","G","N","P","BP","BC","Pts","Pts"]
[null,{"$f":"IF(COUNTIF($T$15:$T$18,1)>1,IF(ROWS($1:4)<=COUNTIF($T$15:$T$18,1),INDEX($U$15:$U$18,SMALL(IF($T$15:$T$18=1,ROW(INDIRECT(\"1:\"&ROWS($T$15:$T$18)))),ROWS($1:4))),\"\"),IF(COUNTIF($T$15:$T$18,2)>1,IF(ROWS($1:4)<=COUNTIF($T$15:$T$18,2),INDEX($U$15:$U$18,SMALL(IF($T$15:$T$18=2,ROW(INDIRECT(\"1:\"&ROWS($T$15:$T$18)))),ROWS($1:4))),\"\")))","v":"Espagne"},null,null,null,null,null,null,null,null,null,null,null,null,null,null,"D_1",{"$f":"TEXT(S78,\"00000\")&U78","v":"00000Argentine"},{"$f":"AC78*1000+AB78*100+Z78*10","v":0},{"$f":"RANK(S78,$S78:$S82,0)","v":1},{"$f":"VLOOKUP(Q78,TABLEAU_TEAMS[#All],2,FALSE)","v":"Argentine"},{"$f":"SUMPRODUCT((Teams1=U78)*(Teams1_Score<>\"\"))+SUMPRODUCT((Teams2=U78)*(Teams2_Score<>\"\"))","v":0},{"$f":"SUMPRODUCT((Teams1=U78)*(Teams1_Score>Teams2_Score))+SUMPRODUCT((Teams2=U78)*(Teams2_Score>Teams1_Score))","v":0},{"$f":"SUMPRODUCT((Teams1=U78)*(Teams1_Score=Teams2_Score)*(Teams1_Score<>\"\"))+SUMPRODUCT((Teams2=U78)*(Teams2_Score=Teams1_Score)*(Teams2_Score<>\"\"))","v":0},{"$f":"SUMPRODUCT((Teams1=U78)*(Teams1_Score<Teams2_Score))+SUMPRODUCT((Teams2=U78)*(Teams2_Score<Teams1_Score))","v":0},{"$f":"SUMPRODUCT((Teams1=U78)*(Teams1_Score))+SUMPRODUCT((Teams2=U78)*(Teams2_Score))","v":0},{"$f":"SUMPRODUCT((Teams1=U78)*(Teams2_Score))+SUMPRODUCT((Teams2=U78)*(Teams1_Score))","v":0},{"$f":"Z78-AA78","v":0},{"$f":"3*W78+X78","v":0}]
[null,"Tirage au sort C1",null,null,null,null,null,null,null,null,null,null,null,null,null,null,"D_2",{"$f":"TEXT(S79,\"00000\")&U79","v":"00000Islande"},{"$f":"AC79*1000+AB79*100+Z79*10","v":0},{"$f":"RANK(S79,$S78:$S82,0)","v":1},{"$f":"VLOOKUP(Q79,TABLEAU_TEAMS[#All],2,FALSE)","v":"Islande"},{"$f":"SUMPRODUCT((Teams1=U79)*(Teams1_Score<>\"\"))+SUMPRODUCT((Teams2=U79)*(Teams2_Score<>\"\"))","v":0},{"$f":"SUMPRODUCT((Teams1=U79)*(Teams1_Score>Teams2_Score))+SUMPRODUCT((Teams2=U79)*(Teams2_Score>Teams1_Score))","v":0},{"$f":"SUMPRODUCT((Teams1=U79)*(Teams1_Score=Teams2_Score)*(Teams1_Score<>\"\"))+SUMPRODUCT((Teams2=U79)*(Teams2_Score=Teams1_Score)*(Teams2_Score<>\"\"))","v":0},{"$f":"SUMPRODUCT((Teams1=U79)*(Teams1_Score<Teams2_Score))+SUMPRODUCT((Teams2=U79)*(Teams2_Score<Teams1_Score))","v":0},{"$f":"SUMPRODUCT((Teams1=U79)*(Teams1_Score))+SUMPRODUCT((Teams2=U79)*(Teams2_Score))","v":0},{"$f":"SUMPRODUCT((Teams1=U79)*(Teams2_Score))+SUMPRODUCT((Teams2=U79)*(Teams1_Score))","v":0},0,0]
[null,{"$f":"IF(ROWS($1:1)<=COUNTIF($T$21:$T$24,1),INDEX($U$21:$U$24,SMALL(IF($T$21:$T$24=1,ROW(INDIRECT(\"1:\"&ROWS($T$21:$T$24)))),ROWS($1:1))),\"\")","v":"Pérou"},null,null,null,null,null,null,null,null,null,null,null,null,null,null,"D_3",{"$f":"TEXT(S80,\"00000\")&U80","v":"00000Croatie"},{"$f":"AC80*1000+AB80*100+Z80*10","v":0},{"$f":"RANK(S80,$S78:$S82,0)","v":1},{"$f":"VLOOKUP(Q80,TABLEAU_TEAMS[#All],2,FALSE)","v":"Croatie"},{"$f":"SUMPRODUCT((Teams1=U80)*(Teams1_Score<>\"\"))+SUMPRODUCT((Teams2=U80)*(Teams2_Score<>\"\"))","v":0},{"$f":"SUMPRODUCT((Teams1=U80)*(Teams1_Score>Teams2_Score))+SUMPRODUCT((Teams2=U80)*(Teams2_Score>Teams1_Score))","v":0},{"$f":"SUMPRODUCT((Teams1=U80)*(Teams1_Score=Teams2_Score)*(Teams1_Score<>\"\"))+SUMPRODUCT((Teams2=U80)*(Teams2_Score=Teams1_Score)*(Teams2_Score<>\"\"))","v":0},{"$f":"SUMPRODUCT((Teams1=U80)*(Teams1_Score<Teams2_Score))+SUMPRODUCT((Teams2=U80)*(Teams2_Score<Teams1_Score))","v":0},{"$f":"SUMPRODUCT((Teams1=U80)*(Teams1_Score))+SUMPRODUCT((Teams2=U80)*(Teams2_Score))","v":0},{"$f":"SUMPRODUCT((Teams1=U80)*(Teams2_Score))+SUMPRODUCT((Teams2=U80)*(Teams1_Score))","v":0},0,0]
[null,{"$f":"IF(ROWS($1:2)<=COUNTIF($T$21:$T$24,1),INDEX($U$21:$U$24,SMALL(IF($T$21:$T$24=1,ROW(INDIRECT(\"1:\"&ROWS($T$21:$T$24)))),ROWS($1:2))),\"\")","v":"France"},null,null,null,null,null,null,null,null,null,null,null,null,null,null,"D_4",{"$f":"TEXT(S81,\"00000\")&U81","v":"00000Nigeria"},{"$f":"AC81*1000+AB81*100+Z81*10","v":0},{"$f":"RANK(S81,$S78:$S82,0)","v":1},{"$f":"VLOOKUP(Q81,TABLEAU_TEAMS[#All],2,FALSE)","v":"Nigeria"},{"$f":"SUMPRODUCT((Teams1=U81)*(Teams1_Score<>\"\"))+SUMPRODUCT((Teams2=U81)*(Teams2_Score<>\"\"))","v":0},{"$f":"SUMPRODUCT((Teams1=U81)*(Teams1_Score>Teams2_Score))+SUMPRODUCT((Teams2=U81)*(Teams2_Score>Teams1_Score))","v":0},{"$f":"SUMPRODUCT((Teams1=U81)*(Teams1_Score=Teams2_Score)*(Teams1_Score<>\"\"))+SUMPRODUCT((Teams2=U81)*(Teams2_Score=Teams1_Score)*(Teams2_Score<>\"\"))","v":0},{"$f":"SUMPRODUCT((Teams1=U81)*(Teams1_Score<Teams2_Score))+SUMPRODUCT((Teams2=U81)*(Teams2_Score<Teams1_Score))","v":0},{"$f":"SUMPRODUCT((Teams1=U81)*(Teams1_Score))+SUMPRODUCT((Teams2=U81)*(Teams2_Score))","v":0},{"$f":"SUMPRODUCT((Teams1=U81)*(Teams2_Score))+SUMPRODUCT((Teams2=U81)*(Teams1_Score))","v":0},0,0]
[null,{"$f":"IF(ROWS($1:3)<=COUNTIF($T$21:$T$24,1),INDEX($U$21:$U$24,SMALL(IF($T$21:$T$24=1,ROW(INDIRECT(\"1:\"&ROWS($T$21:$T$24)))),ROWS($1:3))),\"\")","v":"Danemark"}]
[null,{"$f":"IF(ROWS($1:4)<=COUNTIF($T$21:$T$24,1),INDEX($U$21:$U$24,SMALL(IF($T$21:$T$24=1,ROW(INDIRECT(\"1:\"&ROWS($T$21:$T$24)))),ROWS($1:4))),\"\")","v":"Australie"},null,null,null,null,null,null,null,null,null,null,null,null,null,null,null,null,null,"Rg","Groupe E","MJ","G","N","P","BP","BC","Pts","Pts"]
[null,"Tirage au sort C2",null,null,null,null,null,null,null,null,null,null,null,null,null,null,"E_1",{"$f":"TEXT(S84,\"00000\")&U84","v":"00000Costa Rica"},{"$f":"AC84*1000+AB84*100+Z84*10","v":0},{"$f":"RANK(S84,$S84:$S88,0)","v":1},{"$f":"VLOOKUP(Q84,TABLEAU_TEAMS[#All],2,FALSE)","v":"Costa Rica"},{"$f":"SUMPRODUCT((Teams1=U84)*(Teams1_Score<>\"\"))+SUMPRODUCT((Teams2=U84)*(Teams2_Score<>\"\"))","v":0},{"$f":"SUMPRODUCT((Teams1=U84)*(Teams1_Score>Teams2_Score))+SUMPRODUCT((Teams2=U84)*(Teams2_Score>Teams1_Score))","v":0},{"$f":"SUMPRODUCT((Teams1=U84)*(Teams1_Score=Teams2_Score)*(Teams1_Score<>\"\"))+SUMPRODUCT((Teams2=U84)*(Teams2_Score=Teams1_Score)*(Teams2_Score<>\"\"))","v":0},{"$f":"SUMPRODUCT((Teams1=U84)*(Teams1_Score<Teams2_Score))+SUMPRODUCT((Teams2=U84)*(Teams2_Score<Teams1_Score))","v":0},{"$f":"SUMPRODUCT((Teams1=U84)*(Teams1_Score))+SUMPRODUCT((Teams2=U84)*(Teams2_Score))","v":0},{"$f":"SUMPRODUCT((Teams1=U84)*(Teams2_Score))+SUMPRODUCT((Teams2=U84)*(Teams1_Score))","v":0},{"$f":"Z84-AA84","v":0},{"$f":"3*W84+X84","v":0}]
[null,{"$f":"IF(COUNTIF($T$21:$T$24,1)>1,IF(ROWS($1:1)<=COUNTIF($T$21:$T$24,1),INDEX($U$21:$U$24,SMALL(IF($T$21:$T$24=1,ROW(INDIRECT(\"1:\"&ROWS($T$21:$T$24)))),ROWS($1:1))),\"\"),IF(COUNTIF($T$21:$T$24,2)>1,IF(ROWS($1:1)<=COUNTIF($T$21:$T$24,2),INDEX($U$21:$U$24,SMALL(IF($T$21:$T$24=2,ROW(INDIRECT(\"1:\"&ROWS($T$21:$T$24)))),ROWS($1:1))),\"\")))","v":"Pérou"},null,null,null,null,null,null,null,null,null,null,null,null,null,null,"E_2",{"$f":"TEXT(S85,\"00000\")&U85","v":"00000Serbie"},{"$f":"AC85*1000+AB85*100+Z85*10","v":0},{"$f":"RANK(S85,$S84:$S88,0)","v":1},{"$f":"VLOOKUP(Q85,TABLEAU_TEAMS[#All],2,FALSE)","v":"Serbie"},{"$f":"SUMPRODUCT((Teams1=U85)*(Teams1_Score<>\"\"))+SUMPRODUCT((Teams2=U85)*(Teams2_Score<>\"\"))","v":0},{"$f":"SUMPRODUCT((Teams1=U85)*(Teams1_Score>Teams2_Score))+SUMPRODUCT((Teams2=U85)*(Teams2_Score>Teams1_Score))","v":0},{"$f":"SUMPRODUCT((Teams1=U85)*(Teams1_Score=Teams2_Score)*(Teams1_Score<>\"\"))+SUMPRODUCT((Teams2=U85)*(Teams2_Score=Teams1_Score)*(Teams2_Score<>\"\"))","v":0},{"$f":"SUMPRODUCT((Teams1=U85)*(Teams1_Score<Teams2_Score))+SUMPRODUCT((Teams2=U85)*(Teams2_Score<Teams1_Score))","v":0},{"$f":"SUMPRODUCT((Teams1=U85)*(Teams1_Score))+SUMPRODUCT((Teams2=U85)*(Teams2_Score))","v":0},{"$f":"SUMPRODUCT((Teams1=U85)*(Teams2_Score))+SUMPRODUCT((Teams2=U85)*(Teams1_Score))","v":0},0,0]
[null,{"$f":"IF(COUNTIF($T$21:$T$24,1)>1,IF(ROWS($1:2)<=COUNTIF($T$21:$T$24,1),INDEX($U$21:$U$24,SMALL(IF($T$21:$T$24=1,ROW(INDIRECT(\"1:\"&ROWS($T$21:$T$24)))),ROWS($1:2))),\"\"),IF(COUNTIF($T$21:$T$24,2)>1,IF(ROWS($1:2)<=COUNTIF($T$21:$T$24,2),INDEX($U$21:$U$24,SMALL(IF($T$21:$T$24=2,ROW(INDIRECT(\"1:\"&ROWS($T$21:$T$24)))),ROWS($1:2))),\"\")))","v":"France"},null,null,null,null,null,null,null,null,null,null,null,null,null,null,"E_3",{"$f":"TEXT(S86,\"00000\")&U86","v":"00000Brésil"},{"$f":"AC86*1000+AB86*100+Z86*10","v":0},{"$f":"RANK(S86,$S84:$S88,0)","v":1},{"$f":"VLOOKUP(Q86,TABLEAU_TEAMS[#All],2,FALSE)","v":"Brésil"},{"$f":"SUMPRODUCT((Teams1=U86)*(Teams1_Score<>\"\"))+SUMPRODUCT((Teams2=U86)*(Teams2_Score<>\"\"))","v":0},{"$f":"SUMPRODUCT((Teams1=U86)*(Teams1_Score>Teams2_Score))+SUMPRODUCT((Teams2=U86)*(Teams2_Score>Teams1_Score))","v":0},{"$f":"SUMPRODUCT((Teams1=U86)*(Teams1_Score=Teams2_Score)*(Teams1_Score<>\"\"))+SUMPRODUCT((Teams2=U86)*(Teams2_Score=Teams1_Score)*(Teams2_Score<>\"\"))","v":0},{"$f":"SUMPRODUCT((Teams1=U86)*(Teams1_Score<Teams2_Score))+SUMPRODUCT((Teams2=U86)*(Teams2_Score<Teams1_Score))","v":0},{"$f":"SUMPRODUCT((Teams1=U86)*(Teams1_Score))+SUMPRODUCT((Teams2=U86)*(Teams2_Score))","v":0},{"$f":"SUMPRODUCT((Teams1=U86)*(Teams2_Score))+SUMPRODUCT((Teams2=U86)*(Teams1_Score))","v":0},0,0]
[null,{"$f":"IF(COUNTIF($T$21:$T$24,1)>1,IF(ROWS($1:3)<=COUNTIF($T$21:$T$24,1),INDEX($U$21:$U$24,SMALL(IF($T$21:$T$24=1,ROW(INDIRECT(\"1:\"&ROWS($T$21:$T$24)))),ROWS($1:3))),\"\"),IF(COUNTIF($T$21:$T$24,2)>1,IF(ROWS($1:3)<=COUNTIF($T$21:$T$24,2),INDEX($U$21:$U$24,SMALL(IF($T$21:$T$24=2,ROW(INDIRECT(\"1:\"&ROWS($T$21:$T$24)))),ROWS($1:3))),\"\")))","v":"Danemark"},null,null,null,null,null,null,null,null,null,null,null,null,null,null,"E_4",{"$f":"TEXT(S87,\"00000\")&U87","v":"00000Suisse"},{"$f":"AC87*1000+AB87*100+Z87*10","v":0},{"$f":"RANK(S87,$S84:$S88,0)","v":1},{"$f":"VLOOKUP(Q87,TABLEAU_TEAMS[#All],2,FALSE)","v":"Suisse"},{"$f":"SUMPRODUCT((Teams1=U87)*(Teams1_Score<>\"\"))+SUMPRODUCT((Teams2=U87)*(Teams2_Score<>\"\"))","v":0},{"$f":"SUMPRODUCT((Teams1=U87)*(Teams1_Score>Teams2_Score))+SUMPRODUCT((Teams2=U87)*(Teams2_Score>Teams1_Score))","v":0},{"$f":"SUMPRODUCT((Teams1=U87)*(Teams1_Score=Teams2_Score)*(Teams1_Score<>\"\"))+SUMPRODUCT((Teams2=U87)*(Teams2_Score=Teams1_Score)*(Teams2_Score<>\"\"))","v":0},{"$f":"SUMPRODUCT((Teams1=U87)*(Teams1_Score<Teams2_Score))+SUMPRODUCT((Teams2=U87)*(Teams2_Score<Teams1_Score))","v":0},{"$f":"SUMPRODUCT((Teams1=U87)*(Teams1_Score))+SUMPRODUCT((Teams2=U87)*(Teams2_Score))","v":0},{"$f":"SUMPRODUCT((Teams1=U87)*(Teams2_Score))+SUMPRODUCT((Teams2=U87)*(Teams1_Score))","v":0},0,0]
[null,{"$f":"IF(COUNTIF($T$21:$T$24,1)>1,IF(ROWS($1:4)<=COUNTIF($T$21:$T$24,1),INDEX($U$21:$U$24,SMALL(IF($T$21:$T$24=1,ROW(INDIRECT(\"1:\"&ROWS($T$21:$T$24)))),ROWS($1:4))),\"\"),IF(COUNTIF($T$21:$T$24,2)>1,IF(ROWS($1:4)<=COUNTIF($T$21:$T$24,2),INDEX($U$21:$U$24,SMALL(IF($T$21:$T$24=2,ROW(INDIRECT(\"1:\"&ROWS($T$21:$T$24)))),ROWS($1:4))),\"\")))","v":"Australie"}]
[null,"Tirage au sort D1",null,null,null,null,null,null,null,null,null,null,null,null,null,null,null,null,null,"Rg","Groupe F","MJ","G","N","P","BP","BC","Pts","Pts"]
[null,{"$f":"IF(ROWS($1:1)<=COUNTIF($T$27:$T$30,1),INDEX($U$27:$U$30,SMALL(IF($T$27:$T$30=1,ROW(INDIRECT(\"1:\"&ROWS($T$27:$T$30)))),ROWS($1:1))),\"\")","v":"Nigeria"},null,null,null,null,null,null,null,null,null,null,null,null,null,null,"F_1",{"$f":"TEXT(S90,\"00000\")&U90","v":"00000Allemagne"},{"$f":"AC90*1000+AB90*100+Z90*10","v":0},{"$f":"RANK(S90,$S90:$S94,0)","v":1},{"$f":"VLOOKUP(Q90,TABLEAU_TEAMS[#All],2,FALSE)","v":"Allemagne"},{"$f":"SUMPRODUCT((Teams1=U90)*(Teams1_Score<>\"\"))+SUMPRODUCT((Teams2=U90)*(Teams2_Score<>\"\"))","v":0},{"$f":"SUMPRODUCT((Teams1=U90)*(Teams1_Score>Teams2_Score))+SUMPRODUCT((Teams2=U90)*(Teams2_Score>Teams1_Score))","v":0},{"$f":"SUMPRODUCT((Teams1=U90)*(Teams1_Score=Teams2_Score)*(Teams1_Score<>\"\"))+SUMPRODUCT((Teams2=U90)*(Teams2_Score=Teams1_Score)*(Teams2_Score<>\"\"))","v":0},{"$f":"SUMPRODUCT((Teams1=U90)*(Teams1_Score<Teams2_Score))+SUMPRODUCT((Teams2=U90)*(Teams2_Score<Teams1_Score))","v":0},{"$f":"SUMPRODUCT((Teams1=U90)*(Teams1_Score))+SUMPRODUCT((Teams2=U90)*(Teams2_Score))","v":0},{"$f":"SUMPRODUCT((Teams1=U90)*(Teams2_Score))+SUMPRODUCT((Teams2=U90)*(Teams1_Score))","v":0},{"$f":"Z90-AA90","v":0},{"$f":"3*W90+X90","v":0}]
[null,{"$f":"IF(ROWS($1:2)<=COUNTIF($T$27:$T$30,1),INDEX($U$27:$U$30,SMALL(IF($T$27:$T$30=1,ROW(INDIRECT(\"1:\"&ROWS($T$27:$T$30)))),ROWS($1:2))),\"\")","v":"Islande"},null,null,null,null,null,null,null,null,null,null,null,null,null,null,"F_2",{"$f":"TEXT(S91,\"00000\")&U91","v":"00000Mexique"},{"$f":"AC91*1000+AB91*100+Z91*10","v":0},{"$f":"RANK(S91,$S90:$S94,0)","v":1},{"$f":"VLOOKUP(Q91,TABLEAU_TEAMS[#All],2,FALSE)","v":"Mexique"},{"$f":"SUMPRODUCT((Teams1=U91)*(Teams1_Score<>\"\"))+SUMPRODUCT((Teams2=U91)*(Teams2_Score<>\"\"))","v":0},{"$f":"SUMPRODUCT((Teams1=U91)*(Teams1_Score>Teams2_Score))+SUMPRODUCT((Teams2=U91)*(Teams2_Score>Teams1_Score))","v":0},{"$f":"SUMPRODUCT((Teams1=U91)*(Teams1_Score=Teams2_Score)*(Teams1_Score<>\"\"))+SUMPRODUCT((Teams2=U91)*(Teams2_Score=Teams1_Score)*(Teams2_Score<>\"\"))","v":0},{"$f":"SUMPRODUCT((Teams1=U91)*(Teams1_Score<Teams2_Score))+SUMPRODUCT((Teams2=U91)*(Teams2_Score<Teams1_Score))","v":0},{"$f":"SUMPRODUCT((Teams1=U91)*(Teams1_Score))+SUMPRODUCT((Teams2=U91)*(Teams2_Score))","v":0},{"$f":"SUMPRODUCT((Teams1=U91)*(Teams2_Score))+SUMPRODUCT((Teams2=U91)*(Teams1_Score))","v":0},0,0]
[null,{"$f":"IF(ROWS($1:3)<=COUNTIF($T$27:$T$30,1),INDEX($U$27:$U$30,SMALL(IF($T$27:$T$30=1,ROW(INDIRECT(\"1:\"&ROWS($T$27:$T$30)))),ROWS($1:3))),\"\")","v":"Croatie"},null,null,null,null,null,null,null,null,null,null,null,null,null,null,"F_3",{"$f":"TEXT(S92,\"00000\")&U92","v":"00000Suède"},{"$f":"AC92*1000+AB92*100+Z92*10","v":0},{"$f":"RANK(S92,$S90:$S94,0)","v":1},{"$f":"VLOOKUP(Q92,TABLEAU_TEAMS[#All],2,FALSE)","v":"Suède"},{"$f":"SUMPRODUCT((Teams1=U92)*(Teams1_Score<>\"\"))+SUMPRODUCT((Teams2=U92)*(Teams2_Score<>\"\"))","v":0},{"$f":"SUMPRODUCT((Teams1=U92)*(Teams1_Score>Teams2_Score))+SUMPRODUCT((Teams2=U92)*(Teams2_Score>Teams1_Score))","v":0},{"$f":"SUMPRODUCT((Teams1=U92)*(Teams1_Score=Teams2_Score)*(Teams1_Score<>\"\"))+SUMPRODUCT((Teams2=U92)*(Teams2_Score=Teams1_Score)*(Teams2_Score<>\"\"))","v":0},{"$f":"SUMPRODUCT((Teams1=U92)*(Teams1_Score<Teams2_Score))+SUMPRODUCT((Teams2=U92)*(Teams2_Score<Teams1_Score))","v":0},{"$f":"SUMPRODUCT((Teams1=U92)*(Teams1_Score))+SUMPRODUCT((Teams2=U92)*(Teams2_Score))","v":0},{"$f":"SUMPRODUCT((Teams1=U92)*(Teams2_Score))+SUMPRODUCT((Teams2=U92)*(Teams1_Score))","v":0},0,0]
[null,{"$f":"IF(ROWS($1:4)<=COUNTIF($T$27:$T$30,1),INDEX($U$27:$U$30,SMALL(IF($T$27:$T$30=1,ROW(INDIRECT(\"1:\"&ROWS($T$27:$T$30)))),ROWS($1:4))),\"\")","v":"Argentine"},null,null,null,null,null,null,null,null,null,null,null,null,null,null,"F_4",{"$f":"TEXT(S93,\"00000\")&U93","v":"00000République de Corée"},{"$f":"AC93*1000+AB93*100+Z93*10","v":0},{"$f":"RANK(S93,$S90:$S94,0)","v":1},{"$f":"VLOOKUP(Q93,TABLEAU_TEAMS[#All],2,FALSE)","v":"République de Corée"},{"$f":"SUMPRODUCT((Teams1=U93)*(Teams1_Score<>\"\"))+SUMPRODUCT((Teams2=U93)*(Teams2_Score<>\"\"))","v":0},{"$f":"SUMPRODUCT((Teams1=U93)*(Teams1_Score>Teams2_Score))+SUMPRODUCT((Teams2=U93)*(Teams2_Score>Teams1_Score))","v":0},{"$f":"SUMPRODUCT((Teams1=U93)*(Teams1_Score=Teams2_Score)*(Teams1_Score<>\"\"))+SUMPRODUCT((Teams2=U93)*(Teams2_Score=Teams1_Score)*(Teams2_Score<>\"\"))","v":0},{"$f":"SUMPRODUCT((Teams1=U93)*(Teams1_Score<Teams2_Score))+SUMPRODUCT((Teams2=U93)*(Teams2_Score<Teams1_Score))","v":0},{"$f":"SUMPRODUCT((Teams1=U93)*(Teams1_Score))+SUMPRODUCT((Teams2=U93)*(Teams2_Score))","v":0},{"$f":"SUMPRODUCT((Teams1=U93)*(Teams2_Score))+SUMPRODUCT((Teams2=U93)*(Teams1_Score))","v":0},0,0]
[null,"Tirage au sort D2"]
[null,{"$f":"IF(COUNTIF($T$27:$T$30,1)>1,IF(ROWS($1:1)<=COUNTIF($T$27:$T$30,1),INDEX($U$27:$U$30,SMALL(IF($T$27:$T$30=1,ROW(INDIRECT(\"1:\"&ROWS($T$27:$T$30)))),ROWS($1:1))),\"\"),IF(COUNTIF($T$27:$T$30,2)>1,IF(ROWS($1:1)<=COUNTIF($T$27:$T$30,2),INDEX($U$27:$U$30,SMALL(IF($T$27:$T$30=2,ROW(INDIRECT(\"1:\"&ROWS($T$27:$T$30)))),ROWS($1:1))),\"\")))","v":"Nigeria"},null,null,null,null,null,null,null,null,null,null,null,null,null,null,null,null,null,"Rg","Groupe G","MJ","G","N","P","BP","BC","Pts","Pts"]
[null,{"$f":"IF(COUNTIF($T$27:$T$30,1)>1,IF(ROWS($1:2)<=COUNTIF($T$27:$T$30,1),INDEX($U$27:$U$30,SMALL(IF($T$27:$T$30=1,ROW(INDIRECT(\"1:\"&ROWS($T$27:$T$30)))),ROWS($1:2))),\"\"),IF(COUNTIF($T$27:$T$30,2)>1,IF(ROWS($1:2)<=COUNTIF($T$27:$T$30,2),INDEX($U$27:$U$30,SMALL(IF($T$27:$T$30=2,ROW(INDIRECT(\"1:\"&ROWS($T$27:$T$30)))),ROWS($1:2))),\"\")))","v":"Islande"},null,null,null,null,null,null,null,null,null,null,null,null,null,null,"G_1",{"$f":"TEXT(S96,\"00000\")&U96","v":"00000Belgique"},{"$f":"AC96*1000+AB96*100+Z96*10","v":0},{"$f":"RANK(S96,$S96:$S100,0)","v":1},{"$f":"VLOOKUP(Q96,TABLEAU_TEAMS[#All],2,FALSE)","v":"Belgique"},{"$f":"SUMPRODUCT((Teams1=U96)*(Teams1_Score<>\"\"))+SUMPRODUCT((Teams2=U96)*(Teams2_Score<>\"\"))","v":0},{"$f":"SUMPRODUCT((Teams1=U96)*(Teams1_Score>Teams2_Score))+SUMPRODUCT((Teams2=U96)*(Teams2_Score>Teams1_Score))","v":0},{"$f":"SUMPRODUCT((Teams1=U96)*(Teams1_Score=Teams2_Score)*(Teams1_Score<>\"\"))+SUMPRODUCT((Teams2=U96)*(Teams2_Score=Teams1_Score)*(Teams2_Score<>\"\"))","v":0},{"$f":"SUMPRODUCT((Teams1=U96)*(Teams1_Score<Teams2_Score))+SUMPRODUCT((Teams2=U96)*(Teams2_Score<Teams1_Score))","v":0},{"$f":"SUMPRODUCT((Teams1=U96)*(Teams1_Score))+SUMPRODUCT((Teams2=U96)*(Teams2_Score))","v":0},{"$f":"SUMPRODUCT((Teams1=U96)*(Teams2_Score))+SUMPRODUCT((Teams2=U96)*(Teams1_Score))","v":0},{"$f":"Z96-AA96","v":0},{"$f":"3*W96+X96","v":0}]
[null,{"$f":"IF(COUNTIF($T$27:$T$30,1)>1,IF(ROWS($1:3)<=COUNTIF($T$27:$T$30,1),INDEX($U$27:$U$30,SMALL(IF($T$27:$T$30=1,ROW(INDIRECT(\"1:\"&ROWS($T$27:$T$30)))),ROWS($1:3))),\"\"),IF(COUNTIF($T$27:$T$30,2)>1,IF(ROWS($1:3)<=COUNTIF($T$27:$T$30,2),INDEX($U$27:$U$30,SMALL(IF($T$27:$T$30=2,ROW(INDIRECT(\"1:\"&ROWS($T$27:$T$30)))),ROWS($1:3))),\"\")))","v":"Croatie"},null,null,null,null,null,null,null,null,null,null,null,null,null,null,"G_2",{"$f":"TEXT(S97,\"00000\")&U97","v":"00000Panama"},{"$f":"AC97*1000+AB97*100+Z97*10","v":0},{"$f":"RANK(S97,$S96:$S100,0)","v":1},{"$f":"VLOOKUP(Q97,TABLEAU_TEAMS[#All],2,FALSE)","v":"Panama"},{"$f":"SUMPRODUCT((Teams1=U97)*(Teams1_Score<>\"\"))+SUMPRODUCT((Teams2=U97)*(Teams2_Score<>\"\"))","v":0},{"$f":"SUMPRODUCT((Teams1=U97)*(Teams1_Score>Teams2_Score))+SUMPRODUCT((Teams2=U97)*(Teams2_Score>Teams1_Score))","v":0},{"$f":"SUMPRODUCT((Teams1=U97)*(Teams1_Score=Teams2_Score)*(Teams1_Score<>\"\"))+SUMPRODUCT((Teams2=U97)*(Teams2_Score=Teams1_Score)*(Teams2_Score<>\"\"))","v":0},{"$f":"SUMPRODUCT((Teams1=U97)*(Teams1_Score<Teams2_Score))+SUMPRODUCT((Teams2=U97)*(Teams2_Score<Teams1_Score))","v":0},{"$f":"SUMPRODUCT((Teams1=U97)*(Teams1_Score))+SUMPRODUCT((Teams2=U97)*(Teams2_Score))","v":0},{"$f":"SUMPRODUCT((Teams1=U97)*(Teams2_Score))+SUMPRODUCT((Teams2=U97)*(Teams1_Score))","v":0},0,0]
[null,{"$f":"IF(COUNTIF($T$27:$T$30,1)>1,IF(ROWS($1:4)<=COUNTIF($T$27:$T$30,1),INDEX($U$27:$U$30,SMALL(IF($T$27:$T$30=1,ROW(INDIRECT(\"1:\"&ROWS($T$27:$T$30)))),ROWS($1:4))),\"\"),IF(COUNTIF($T$27:$T$30,2)>1,IF(ROWS($1:4)<=COUNTIF($T$27:$T$30,2),INDEX($U$27:$U$30,SMALL(IF($T$27:$T$30=2,ROW(INDIRECT(\"1:\"&ROWS($T$27:$T$30)))),ROWS($1:4))),\"\")))","v":"Argentine"},null,null,null,null,null,null,null,null,null,null,null,null,null,null,"G_3",{"$f":"TEXT(S98,\"00000\")&U98","v":"00000Tunisie"},{"$f":"AC98*1000+AB98*100+Z98*10","v":0},{"$f":"RANK(S98,$S96:$S100,0)","v":1},{"$f":"VLOOKUP(Q98,TABLEAU_TEAMS[#All],2,FALSE)","v":"Tunisie"},{"$f":"SUMPRODUCT((Teams1=U98)*(Teams1_Score<>\"\"))+SUMPRODUCT((Teams2=U98)*(Teams2_Score<>\"\"))","v":0},{"$f":"SUMPRODUCT((Teams1=U98)*(Teams1_Score>Teams2_Score))+SUMPRODUCT((Teams2=U98)*(Teams2_Score>Teams1_Score))","v":0},{"$f":"SUMPRODUCT((Teams1=U98)*(Teams1_Score=Teams2_Score)*(Teams1_Score<>\"\"))+SUMPRODUCT((Teams2=U98)*(Teams2_Score=Teams1_Score)*(Teams2_Score<>\"\"))","v":0},{"$f":"SUMPRODUCT((Teams1=U98)*(Teams1_Score<Teams2_Score))+SUMPRODUCT((Teams2=U98)*(Teams2_Score<Teams1_Score))","v":0},{"$f":"SUMPRODUCT((Teams1=U98)*(Teams1_Score))+SUMPRODUCT((Teams2=U98)*(Teams2_Score))","v":0},{"$f":"SUMPRODUCT((Teams1=U98)*(Teams2_Score))+SUMPRODUCT((Teams2=U98)*(Teams1_Score))","v":0},0,0]
[null,"Tirage au sort E1",null,null,null,null,null,null,null,null,null,null,null,null,null,null,"G_4",{"$f":"TEXT(S99,\"00000\")&U99","v":"00000Angleterre"},{"$f":"AC99*1000+AB99*100+Z99*10","v":0},{"$f":"RANK(S99,$S96:$S100,0)","v":1},{"$f":"VLOOKUP(Q99,TABLEAU_TEAMS[#All],2,FALSE)","v":"Angleterre"},{"$f":"SUMPRODUCT((Teams1=U99)*(Teams1_Score<>\"\"))+SUMPRODUCT((Teams2=U99)*(Teams2_Score<>\"\"))","v":0},{"$f":"SUMPRODUCT((Teams1=U99)*(Teams1_Score>Teams2_Score))+SUMPRODUCT((Teams2=U99)*(Teams2_Score>Teams1_Score))","v":0},{"$f":"SUMPRODUCT((Teams1=U99)*(Teams1_Score=Teams2_Score)*(Teams1_Score<>\"\"))+SUMPRODUCT((Teams2=U99)*(Teams2_Score=Teams1_Score)*(Teams2_Score<>\"\"))","v":0},{"$f":"SUMPRODUCT((Teams1=U99)*(Teams1_Score<Teams2_Score))+SUMPRODUCT((Teams2=U99)*(Teams2_Score<Teams1_Score))","v":0},{"$f":"SUMPRODUCT((Teams1=U99)*(Teams1_Score))+SUMPRODUCT((Teams2=U99)*(Teams2_Score))","v":0},{"$f":"SUMPRODUCT((Teams1=U99)*(Teams2_Score))+SUMPRODUCT((Teams2=U99)*(Teams1_Score))","v":0},0,0]
[null,{"$f":"IF(ROWS($1:1)<=COUNTIF($T$33:$T$36,1),INDEX($U$33:$U$36,SMALL(IF($T$33:$T$36=1,ROW(INDIRECT(\"1:\"&ROWS($T$33:$T$36)))),ROWS($1:1))),\"\")","v":"Suisse"}]
[null,{"$f":"IF(ROWS($1:2)<=COUNTIF($T$33:$T$36,1),INDEX($U$33:$U$36,SMALL(IF($T$33:$T$36=1,ROW(INDIRECT(\"1:\"&ROWS($T$33:$T$36)))),ROWS($1:2))),\"\")","v":"Serbie"},null,null,null,null,null,null,null,null,null,null,null,null,null,null,null,null,null,"Rg","Groupe H","MJ","G","N","P","BP","BC","Pts","Pts"]
[null,{"$f":"IF(ROWS($1:3)<=COUNTIF($T$33:$T$36,1),INDEX($U$33:$U$36,SMALL(IF($T$33:$T$36=1,ROW(INDIRECT(\"1:\"&ROWS($T$33:$T$36)))),ROWS($1:3))),\"\")","v":"Costa Rica"},null,null,null,null,null,null,null,null,null,null,null,null,null,null,"H_1",{"$f":"TEXT(S102,\"00000\")&U102","v":"00000Colombie"},{"$f":"AC102*1000+AB102*100+Z102*10","v":0},{"$f":"RANK(S102,$S102:$S106,0)","v":1},{"$f":"VLOOKUP(Q102,TABLEAU_TEAMS[#All],2,FALSE)","v":"Colombie"},{"$f":"SUMPRODUCT((Teams1=U102)*(Teams1_Score<>\"\"))+SUMPRODUCT((Teams2=U102)*(Teams2_Score<>\"\"))","v":0},{"$f":"SUMPRODUCT((Teams1=U102)*(Teams1_Score>Teams2_Score))+SUMPRODUCT((Teams2=U102)*(Teams2_Score>Teams1_Score))","v":0},{"$f":"SUMPRODUCT((Teams1=U102)*(Teams1_Score=Teams2_Score)*(Teams1_Score<>\"\"))+SUMPRODUCT((Teams2=U102)*(Teams2_Score=Teams1_Score)*(Teams2_Score<>\"\"))","v":0},{"$f":"SUMPRODUCT((Teams1=U102)*(Teams1_Score<Teams2_Score))+SUMPRODUCT((Teams2=U102)*(Teams2_Score<Teams1_Score))","v":0},{"$f":"SUMPRODUCT((Teams1=U102)*(Teams1_Score))+SUMPRODUCT((Teams2=U102)*(Teams2_Score))","v":0},{"$f":"SUMPRODUCT((Teams1=U102)*(Teams2_Score))+SUMPRODUCT((Teams2=U102)*(Teams1_Score))","v":0},{"$f":"Z102-AA102","v":0},{"$f":"3*W102+X102","v":0}]
[null,{"$f":"IF(ROWS($1:4)<=COUNTIF($T$33:$T$36,1),INDEX($U$33:$U$36,SMALL(IF($T$33:$T$36=1,ROW(INDIRECT(\"1:\"&ROWS($T$33:$T$36)))),ROWS($1:4))),\"\")","v":"Brésil"},null,null,null,null,null,null,null,null,null,null,null,null,null,null,"H_2",{"$f":"TEXT(S103,\"00000\")&U103","v":"00000Japon"},{"$f":"AC103*1000+AB103*100+Z103*10","v":0},{"$f":"RANK(S103,$S102:$S106,0)","v":1},{"$f":"VLOOKUP(Q103,TABLEAU_TEAMS[#All],2,FALSE)","v":"Japon"},{"$f":"SUMPRODUCT((Teams1=U103)*(Teams1_Score<>\"\"))+SUMPRODUCT((Teams2=U103)*(Teams2_Score<>\"\"))","v":0},{"$f":"SUMPRODUCT((Teams1=U103)*(Teams1_Score>Teams2_Score))+SUMPRODUCT((Teams2=U103)*(Teams2_Score>Teams1_Score))","v":0},{"$f":"SUMPRODUCT((Teams1=U103)*(Teams1_Score=Teams2_Score)*(Teams1_Score<>\"\"))+SUMPRODUCT((Teams2=U103)*(Teams2_Score=Teams1_Score)*(Teams2_Score<>\"\"))","v":0},{"$f":"SUMPRODUCT((Teams1=U103)*(Teams1_Score<Teams2_Score))+SUMPRODUCT((Teams2=U103)*(Teams2_Score<Teams1_Score))","v":0},{"$f":"SUMPRODUCT((Teams1=U103)*(Teams1_Score))+SUMPRODUCT((Teams2=U103)*(Teams2_Score))","v":0},{"$f":"SUMPRODUCT((Teams1=U103)*(Teams2_Score))+SUMPRODUCT((Teams2=U103)*(Teams1_Score))","v":0},0,0]
[null,"Tirage au sort E2",null,null,null,null,null,null,null,null,null,null,null,null,null,null,"H_3",{"$f":"TEXT(S104,\"00000\")&U104","v":"00000Pologne"},{"$f":"AC104*1000+AB104*100+Z104*10","v":0},{"$f":"RANK(S104,$S102:$S106,0)","v":1},{"$f":"VLOOKUP(Q104,TABLEAU_TEAMS[#All],2,FALSE)","v":"Pologne"},{"$f":"SUMPRODUCT((Teams1=U104)*(Teams1_Score<>\"\"))+SUMPRODUCT((Teams2=U104)*(Teams2_Score<>\"\"))","v":0},{"$f":"SUMPRODUCT((Teams1=U104)*(Teams1_Score>Teams2_Score))+SUMPRODUCT((Teams2=U104)*(Teams2_Score>Teams1_Score))","v":0},{"$f":"SUMPRODUCT((Teams1=U104)*(Teams1_Score=Teams2_Score)*(Teams1_Score<>\"\"))+SUMPRODUCT((Teams2=U104)*(Teams2_Score=Teams1_Score)*(Teams2_Score<>\"\"))","v":0},{"$f":"SUMPRODUCT((Teams1=U104)*(Teams1_Score<Teams2_Score))+SUMPRODUCT((Teams2=U104)*(Teams2_Score<Teams1_Score))","v":0},{"$f":"SUMPRODUCT((Teams1=U104)*(Teams1_Score))+SUMPRODUCT((Teams2=U104)*(Teams2_Score))","v":0},{"$f":"SUMPRODUCT((Teams1=U104)*(Teams2_Score))+SUMPRODUCT((Teams2=U104)*(Teams1_Score))","v":0},0,0]
[null,{"$f":"IF(COUNTIF($T$33:$T$36,1)>1,IF(ROWS($1:1)<=COUNTIF($T$33:$T$36,1),INDEX($U$33:$U$36,SMALL(IF($T$33:$T$36=1,ROW(INDIRECT(\"1:\"&ROWS($T$33:$T$36)))),ROWS($1:1))),\"\"),IF(COUNTIF($T$33:$T$36,2)>1,IF(ROWS($1:1)<=COUNTIF($T$33:$T$36,2),INDEX($U$33:$U$36,SMALL(IF($T$33:$T$36=2,ROW(INDIRECT(\"1:\"&ROWS($T$33:$T$36)))),ROWS($1:1))),\"\")))","v":"Suisse"},null,null,null,null,null,null,null,null,null,null,null,null,null,null,"H_4",{"$f":"TEXT(S105,\"00000\")&U105","v":"00000Sénégal"},{"$f":"AC105*1000+AB105*100+Z105*10","v":0},{"$f":"RANK(S105,$S102:$S106,0)","v":1},{"$f":"VLOOKUP(Q105,TABLEAU_TEAMS[#All],2,FALSE)","v":"Sénégal"},{"$f":"SUMPRODUCT((Teams1=U105)*(Teams1_Score<>\"\"))+SUMPRODUCT((Teams2=U105)*(Teams2_Score<>\"\"))","v":0},{"$f":"SUMPRODUCT((Teams1=U105)*(Teams1_Score>Teams2_Score))+SUMPRODUCT((Teams2=U105)*(Teams2_Score>Teams1_Score))","v":0},{"$f":"SUMPRODUCT((Teams1=U105)*(Teams1_Score=Teams2_Score)*(Teams1_Score<>\"\"))+SUMPRODUCT((Teams2=U105)*(Teams2_Score=Teams1_Score)*(Teams2_Score<>\"\"))","v":0},{"$f":"SUMPRODUCT((Teams1=U105)*(Teams1_Score<Teams2_Score))+SUMPRODUCT((Teams2=U105)*(Teams2_Score<Teams1_Score))","v":0},{"$f":"SUMPRODUCT((Teams1=U105)*(Teams1_Score))+SUMPRODUCT((Teams2=U105)*(Teams2_Score))","v":0},{"$f":"SUMPRODUCT((Teams1=U105)*(Teams2_Score))+SUMPRODUCT((Teams2=U105)*(Teams1_Score))","v":0},0,0]
[null,{"$f":"IF(COUNTIF($T$33:$T$36,1)>1,IF(ROWS($1:2)<=COUNTIF($T$33:$T$36,1),INDEX($U$33:$U$36,SMALL(IF($T$33:$T$36=1,ROW(INDIRECT(\"1:\"&ROWS($T$33:$T$36)))),ROWS($1:2))),\"\"),IF(COUNTIF($T$33:$T$36,2)>1,IF(ROWS($1:2)<=COUNTIF($T$33:$T$36,2),INDEX($U$33:$U$36,SMALL(IF($T$33:$T$36=2,ROW(INDIRECT(\"1:\"&ROWS($T$33:$T$36)))),ROWS($1:2))),\"\")))","v":"Serbie"}]
[null,{"$f":"IF(COUNTIF($T$33:$T$36,1)>1,IF(ROWS($1:3)<=COUNTIF($T$33:$T$36,1),INDEX($U$33:$U$36,SMALL(IF($T$33:$T$36=1,ROW(INDIRECT(\"1:\"&ROWS($T$33:$T$36)))),ROWS($1:3))),\"\"),IF(COUNTIF($T$33:$T$36,2)>1,IF(ROWS($1:3)<=COUNTIF($T$33:$T$36,2),INDEX($U$33:$U$36,SMALL(IF($T$33:$T$36=2,ROW(INDIRECT(\"1:\"&ROWS($T$33:$T$36)))),ROWS($1:3))),\"\")))","v":"Costa Rica"}]
[null,{"$f":"IF(COUNTIF($T$33:$T$36,1)>1,IF(ROWS($1:4)<=COUNTIF($T$33:$T$36,1),INDEX($U$33:$U$36,SMALL(IF($T$33:$T$36=1,ROW(INDIRECT(\"1:\"&ROWS($T$33:$T$36)))),ROWS($1:4))),\"\"),IF(COUNTIF($T$33:$T$36,2)>1,IF(ROWS($1:4)<=COUNTIF($T$33:$T$36,2),INDEX($U$33:$U$36,SMALL(IF($T$33:$T$36=2,ROW(INDIRECT(\"1:\"&ROWS($T$33:$T$36)))),ROWS($1:4))),\"\")))","v":"Brésil"}]
[null,"Tirage au sort F1"]
[null,{"$f":"IF(ROWS($1:1)<=COUNTIF($T$39:$T$42,1),INDEX($U$39:$U$42,SMALL(IF($T$39:$T$42=1,ROW(INDIRECT(\"1:\"&ROWS($T$39:$T$42)))),ROWS($1:1))),\"\")","v":"Suède"}]
[null,{"$f":"IF(ROWS($1:2)<=COUNTIF($T$39:$T$42,1),INDEX($U$39:$U$42,SMALL(IF($T$39:$T$42=1,ROW(INDIRECT(\"1:\"&ROWS($T$39:$T$42)))),ROWS($1:2))),\"\")","v":"République de Corée"}]
[null,{"$f":"IF(ROWS($1:3)<=COUNTIF($T$39:$T$42,1),INDEX($U$39:$U$42,SMALL(IF($T$39:$T$42=1,ROW(INDIRECT(\"1:\"&ROWS($T$39:$T$42)))),ROWS($1:3))),\"\")","v":"Mexique"}]
[null,{"$f":"IF(ROWS($1:4)<=COUNTIF($T$39:$T$42,1),INDEX($U$39:$U$42,SMALL(IF($T$39:$T$42=1,ROW(INDIRECT(\"1:\"&ROWS($T$39:$T$42)))),ROWS($1:4))),\"\")","v":"Allemagne"}]
[null,"Tirage au sort F2"]
[null,{"$f":"IF(COUNTIF($T$39:$T$42,1)>1,IF(ROWS($1:1)<=COUNTIF($T$39:$T$42,1),INDEX($U$39:$U$42,SMALL(IF($T$39:$T$42=1,ROW(INDIRECT(\"1:\"&ROWS($T$39:$T$42)))),ROWS($1:1))),\"\"),IF(COUNTIF($T$39:$T$42,2)>1,IF(ROWS($1:1)<=COUNTIF($T$39:$T$42,2),INDEX($U$39:$U$42,SMALL(IF($T$39:$T$42=2,ROW(INDIRECT(\"1:\"&ROWS($T$39:$T$42)))),ROWS($1:1))),\"\")))","v":"Suède"}]
[null,{"$f":"IF(COUNTIF($T$39:$T$42,1)>1,IF(ROWS($1:2)<=COUNTIF($T$39:$T$42,1),INDEX($U$39:$U$42,SMALL(IF($T$39:$T$42=1,ROW(INDIRECT(\"1:\"&ROWS($T$39:$T$42)))),ROWS($1:2))),\"\"),IF(COUNTIF($T$39:$T$42,2)>1,IF(ROWS($1:2)<=COUNTIF($T$39:$T$42,2),INDEX($U$39:$U$42,SMALL(IF($T$39:$T$42=2,ROW(INDIRECT(\"1:\"&ROWS($T$39:$T$42)))),ROWS($1:2))),\"\")))","v":"République de Corée"}]
[null,{"$f":"IF(COUNTIF($T$39:$T$42,1)>1,IF(ROWS($1:3)<=COUNTIF($T$39:$T$42,1),INDEX($U$39:$U$42,SMALL(IF($T$39:$T$42=1,ROW(INDIRECT(\"1:\"&ROWS($T$39:$T$42)))),ROWS($1:3))),\"\"),IF(COUNTIF($T$39:$T$42,2)>1,IF(ROWS($1:3)<=COUNTIF($T$39:$T$42,2),INDEX($U$39:$U$42,SMALL(IF($T$39:$T$42=2,ROW(INDIRECT(\"1:\"&ROWS($T$39:$T$42)))),ROWS($1:3))),\"\")))","v":"Mexique"}]
[null,{"$f":"IF(COUNTIF($T$39:$T$42,1)>1,IF(ROWS($1:4)<=COUNTIF($T$39:$T$42,1),INDEX($U$39:$U$42,SMALL(IF($T$39:$T$42=1,ROW(INDIRECT(\"1:\"&ROWS($T$39:$T$42)))),ROWS($1:4))),\"\"),IF(COUNTIF($T$39:$T$42,2)>1,IF(ROWS($1:4)<=COUNTIF($T$39:$T$42,2),INDEX($U$39:$U$42,SMALL(IF($T$39:$T$42=2,ROW(INDIRECT(\"1:\"&ROWS($T$39:$T$42)))),ROWS($1:4))),\"\")))","v":"Allemagne"}]
[null,"Tirage au sort G1"]
[null,{"$f":"IF(ROWS($1:1)<=COUNTIF($T$45:$T$48,1),INDEX($U$45:$U$48,SMALL(IF($T$45:$T$48=1,ROW(INDIRECT(\"1:\"&ROWS($T$45:$T$48)))),ROWS($1:1))),\"\")","v":"Tunisie"}]
[null,{"$f":"IF(ROWS($1:2)<=COUNTIF($T$45:$T$48,1),INDEX($U$45:$U$48,SMALL(IF($T$45:$T$48=1,ROW(INDIRECT(\"1:\"&ROWS($T$45:$T$48)))),ROWS($1:2))),\"\")","v":"Panama"}]
[null,{"$f":"IF(ROWS($1:3)<=COUNTIF($T$45:$T$48,1),INDEX($U$45:$U$48,SMALL(IF($T$45:$T$48=1,ROW(INDIRECT(\"1:\"&ROWS($T$45:$T$48)))),ROWS($1:3))),\"\")","v":"Belgique"}]
[null,{"$f":"IF(ROWS($1:4)<=COUNTIF($T$45:$T$48,1),INDEX($U$45:$U$48,SMALL(IF($T$45:$T$48=1,ROW(INDIRECT(\"1:\"&ROWS($T$45:$T$48)))),ROWS($1:4))),\"\")","v":"Angleterre"}]
[null,"Tirage au sort G2"]
[null,{"$f":"IF(COUNTIF($T$45:$T$48,1)>1,IF(ROWS($1:1)<=COUNTIF($T$45:$T$48,1),INDEX($U$45:$U$48,SMALL(IF($T$45:$T$48=1,ROW(INDIRECT(\"1:\"&ROWS($T$45:$T$48)))),ROWS($1:1))),\"\"),IF(COUNTIF($T$45:$T$48,2)>1,IF(ROWS($1:1)<=COUNTIF($T$45:$T$48,2),INDEX($U$45:$U$48,SMALL(IF($T$45:$T$48=2,ROW(INDIRECT(\"1:\"&ROWS($T$45:$T$48)))),ROWS($1:1))),\"\")))","v":"Tunisie"}]
[null,{"$f":"IF(COUNTIF($T$45:$T$48,1)>1,IF(ROWS($1:2)<=COUNTIF($T$45:$T$48,1),INDEX($U$45:$U$48,SMALL(IF($T$45:$T$48=1,ROW(INDIRECT(\"1:\"&ROWS($T$45:$T$48)))),ROWS($1:2))),\"\"),IF(COUNTIF($T$45:$T$48,2)>1,IF(ROWS($1:2)<=COUNTIF($T$45:$T$48,2),INDEX($U$45:$U$48,SMALL(IF($T$45:$T$48=2,ROW(INDIRECT(\"1:\"&ROWS($T$45:$T$48)))),ROWS($1:2))),\"\")))","v":"Panama"}]
[null,{"$f":"IF(COUNTIF($T$45:$T$48,1)>1,IF(ROWS($1:3)<=COUNTIF($T$45:$T$48,1),INDEX($U$45:$U$48,SMALL(IF($T$45:$T$48=1,ROW(INDIRECT(\"1:\"&ROWS($T$45:$T$48)))),ROWS($1:3))),\"\"),IF(COUNTIF($T$45:$T$48,2)>1,IF(ROWS($1:3)<=COUNTIF($T$45:$T$48,2),INDEX($U$45:$U$48,SMALL(IF($T$45:$T$48=2,ROW(INDIRECT(\"1:\"&ROWS($T$45:$T$48)))),ROWS($1:3))),\"\")))","v":"Belgique"}]
[null,{"$f":"IF(COUNTIF($T$45:$T$48,1)>1,IF(ROWS($1:4)<=COUNTIF($T$45:$T$48,1),INDEX($U$45:$U$48,SMALL(IF($T$45:$T$48=1,ROW(INDIRECT(\"1:\"&ROWS($T$45:$T$48)))),ROWS($1:4))),\"\"),IF(COUNTIF($T$45:$T$48,2)>1,IF(ROWS($1:4)<=COUNTIF($T$45:$T$48,2),INDEX($U$45:$U$48,SMALL(IF($T$45:$T$48=2,ROW(INDIRECT(\"1:\"&ROWS($T$45:$T$48)))),ROWS($1:4))),\"\")))","v":"Angleterre"}]
[null,"Tirage au sort H1"]
[null,{"$f":"IF(ROWS($1:1)<=COUNTIF($T$51:$T$54,1),INDEX($U$51:$U$54,SMALL(IF($T$51:$T$54=1,ROW(INDIRECT(\"1:\"&ROWS($T$51:$T$54)))),ROWS($1:1))),\"\")","v":"Sénégal"}]
[null,{"$f":"IF(ROWS($1:2)<=COUNTIF($T$51:$T$54,1),INDEX($U$51:$U$54,SMALL(IF($T$51:$T$54=1,ROW(INDIRECT(\"1:\"&ROWS($T$51:$T$54)))),ROWS($1:2))),\"\")","v":"Pologne"}]
[null,{"$f":"IF(ROWS($1:3)<=COUNTIF($T$51:$T$54,1),INDEX($U$51:$U$54,SMALL(IF($T$51:$T$54=1,ROW(INDIRECT(\"1:\"&ROWS($T$51:$T$54)))),ROWS($1:3))),\"\")","v":"Japon"}]
[null,{"$f":"IF(ROWS($1:4)<=COUNTIF($T$51:$T$54,1),INDEX($U$51:$U$54,SMALL(IF($T$51:$T$54=1,ROW(INDIRECT(\"1:\"&ROWS($T$51:$T$54)))),ROWS($1:4))),\"\")","v":"Colombie"}]
[null,"Tirage au sort H2"]
[null,{"$f":"IF(COUNTIF($T$51:$T$54,1)>1,IF(ROWS($1:1)<=COUNTIF($T$51:$T$54,1),INDEX($U$51:$U$54,SMALL(IF($T$51:$T$54=1,ROW(INDIRECT(\"1:\"&ROWS($T$51:$T$54)))),ROWS($1:1))),\"\"),IF(COUNTIF($T$51:$T$54,2)>1,IF(ROWS($1:1)<=COUNTIF($T$51:$T$54,2),INDEX($U$51:$U$54,SMALL(IF($T$51:$T$54=2,ROW(INDIRECT(\"1:\"&ROWS($T$51:$T$54)))),ROWS($1:1))),\"\")))","v":"Sénégal"}]
[null,{"$f":"IF(COUNTIF($T$51:$T$54,1)>1,IF(ROWS($1:2)<=COUNTIF($T$51:$T$54,1),INDEX($U$51:$U$54,SMALL(IF($T$51:$T$54=1,ROW(INDIRECT(\"1:\"&ROWS($T$51:$T$54)))),ROWS($1:2))),\"\"),IF(COUNTIF($T$51:$T$54,2)>1,IF(ROWS($1:2)<=COUNTIF($T$51:$T$54,2),INDEX($U$51:$U$54,SMALL(IF($T$51:$T$54=2,ROW(INDIRECT(\"1:\"&ROWS($T$51:$T$54)))),ROWS($1:2))),\"\")))","v":"Pologne"}]
[null,{"$f":"IF(COUNTIF($T$51:$T$54,1)>1,IF(ROWS($1:3)<=COUNTIF($T$51:$T$54,1),INDEX($U$51:$U$54,SMALL(IF($T$51:$T$54=1,ROW(INDIRECT(\"1:\"&ROWS($T$51:$T$54)))),ROWS($1:3))),\"\"),IF(COUNTIF($T$51:$T$54,2)>1,IF(ROWS($1:3)<=COUNTIF($T$51:$T$54,2),INDEX($U$51:$U$54,SMALL(IF($T$51:$T$54=2,ROW(INDIRECT(\"1:\"&ROWS($T$51:$T$54)))),ROWS($1:3))),\"\")))","v":"Japon"}]
[null,{"$f":"IF(COUNTIF($T$51:$T$54,1)>1,IF(ROWS($1:4)<=COUNTIF($T$51:$T$54,1),INDEX($U$51:$U$54,SMALL(IF($T$51:$T$54=1,ROW(INDIRECT(\"1:\"&ROWS($T$51:$T$54)))),ROWS($1:4))),\"\"),IF(COUNTIF($T$51:$T$54,2)>1,IF(ROWS($1:4)<=COUNTIF($T$51:$T$54,2),INDEX($U$51:$U$54,SMALL(IF($T$51:$T$54=2,ROW(INDIRECT(\"1:\"&ROWS($T$51:$T$54)))),ROWS($1:4))),\"\")))","v":"Colombie"}]

{"sheet":"Pronostiqueur 3","index":7,"n_rows":138,"n_cols":46,"rows_kept":138,"cut":false,"hidden":false,"merged":[[2,1,2,8],[3,1,3,8],[3,9,3,12]]}
[]
[null,"Pronostics de :"]
[]
[null,{"$f":"MID(CELL(\"filename\",A1),FIND(\"]\",CELL(\"filename\",A1))+1,32)","v":"Pronostiqueur 3"}]
[]
[null,"SAISIE DES PRONOSTICS",null,null,null,null,null,null,null,null,null,null,null,null,null,null,null,null,null,"GROUPES",null,null,null,null,null,null,null,null,null,null,null,null,"SCORE PRONOSTIQUEUR",null,null,null,null,null,null,null,null,{"$f":"AN8+AN12","v":0}]
[null,"Date","Heure","Match","Groupe",1,"N",2,null,"Buts",null,null,"Buts"]
[null,{"$f":"VLOOKUP($D8,TABLEAU_MATCHS[#All],2,FALSE)","v":"2018-06-14"},{"$f":"VLOOKUP($D8,TABLEAU_MATCHS[#All],3,FALSE)","v":"18:00:00"},1,{"$f":"\"Groupe \"&VLOOKUP($I8,TABLEAU_TEAMS[[#All],[TEAM]:[GROUP_INITIAL_RANK]],2,FALSE)","v":"Groupe A"},1.3,4.3,10,{"$f":"VLOOKUP($D8,TABLEAU_MATCHS[#All],4,FALSE)","v":"Russie"},null,null,{"$f":"VLOOKUP($D8,TABLEAU_MATCHS[#All],5,FALSE)","v":"Arabie Saoudite"},null,{"$f":"IF(OR(ISBLANK(RESULTATS!J8),ISBLANK(J8)),\"\",IF(AND('Pronostiqueur 3'!J8=RESULTATS!J8,'Pronostiqueur 3'!M8=RESULTATS!M8),3,IF(OR(AND('Pronostiqueur 3'!J8>'Pronostiqueur 3'!M8,RESULTATS!J8>RESULTATS!M8),AND('Pronostiqueur 3'!J8<'Pronostiqueur 3'!M8,RESULTATS!J8<RESULTATS!M8),AND('Pronostiqueur 3'!J8='Pronostiqueur 3'!M8,RESULTATS!J8=RESULTATS!M8)),1,0)))","v":""},null,null,null,null,null,"Rg","Groupe A","MJ","G","N","P","BP","BC","+/-","Pts",null,null,null,"Phases de groupes",null,null,null,null,null,null,{"$f":"N56","v":0},null,"points"]
[null,{"$f":"VLOOKUP($D9,TABLEAU_MATCHS[#All],2,FALSE)","v":"2018-06-15"},{"$f":"VLOOKUP($D9,TABLEAU_MATCHS[#All],3,FALSE)","v":"17:00:00"},2,{"$f":"\"Groupe \"&VLOOKUP($I9,TABLEAU_TEAMS[[#All],[TEAM]:[GROUP_INITIAL_RANK]],2,FALSE)","v":"Groupe A"},2.2000000000000002,2.9,3.25,{"$f":"VLOOKUP($D9,TABLEAU_MATCHS[#All],4,FALSE)","v":"Egypte"},null,null,{"$f":"VLOOKUP($D9,TABLEAU_MATCHS[#All],5,FALSE)","v":"Uruguay"},null,{"$f":"IF(OR(ISBLANK(RESULTATS!J9),ISBLANK(J9)),\"\",IF(AND('Pronostiqueur 3'!J9=RESULTATS!J9,'Pronostiqueur 3'!M9=RESULTATS!M9),3,IF(OR(AND('Pronostiqueur 3'!J9>'Pronostiqueur 3'!M9,RESULTATS!J9>RESULTATS!M9),AND('Pronostiqueur 3'!J9<'Pronostiqueur 3'!M9,RESULTATS!J9<RESULTATS!M9),AND('Pronostiqueur 3'!J9='Pronostiqueur 3'!M9,RESULTATS!J9=RESULTATS!M9)),1,0)))","v":""},null,null,null,{"$f":"INDEX($R60:$R63,MATCH(SMALL(COUNTIF($R60:$R63,\">=\"&$R60:$R63),ROW(INDIRECT(\"1:\"&ROWS($R60:$R63)))),COUNTIF($R60:$R63,\">=\"&$R60:$R63),0))","v":"00000Uruguay"},{"$f":"INDEX($S60:$S63,MATCH(SMALL(COUNTIF($R60:$R63,\">=\"&$R60:$R63),ROW(INDIRECT(\"1:\"&ROWS($R60:$R63)))),COUNTIF($R60:$R63,\">=\"&$R60:$R63),0))","v":0},{"$f":"INDEX($T60:$T63,MATCH(SMALL(COUNTIF($R60:$R63,\">=\"&$R60:$R63),ROW(INDIRECT(\"1:\"&ROWS($R60:$R63)))),COUNTIF($R60:$R63,\">=\"&$R60:$R63),0))","v":1},{"$f":"INDEX($U60:$U63,MATCH(SMALL(COUNTIF($R60:$R63,\">=\"&$R60:$R63),ROW(INDIRECT(\"1:\"&ROWS($R60:$R63)))),COUNTIF($R60:$R63,\">=\"&$R60:$R63),0))","v":"Uruguay"},{"$f":"SUMPRODUCT((Teams1=U9)*(Teams1_Score<>\"\"))+SUMPRODUCT((Teams2=U9)*(Teams2_Score<>\"\"))","v":0},{"$f":"SUMPRODUCT((Teams1=U9)*(Teams1_Score>Teams2_Score))+SUMPRODUCT((Teams2=U9)*(Teams2_Score>Teams1_Score))","v":0},{"$f":"SUMPRODUCT((Teams1=U9)*(Teams1_Score=Teams2_Score)*(Teams1_Score<>\"\"))+SUMPRODUCT((Teams2=U9)*(Teams2_Score=Teams1_Score)*(Teams2_Score<>\"\"))","v":0},{"$f":"SUMPRODUCT((Teams1=U9)*(Teams1_Score<Teams2_Score))+SUMPRODUCT((Teams2=U9)*(Teams2_Score<Teams1_Score))","v":0},{"$f":"SUMPRODUCT((Teams1=U9)*(Teams1_Score))+SUMPRODUCT((Teams2=U9)*(Teams2_Score))","v":0},{"$f":"SUMPRODUCT((Teams1=U9)*(Teams2_Score))+SUMPRODUCT((Teams2=U9)*(Teams1_Score))","v":0},{"$f":"Z9-AA9","v":0},{"$f":"3*W9+X9","v":0},null,null,null,"Vainqueur ou nul trouvé (1 pt)",null,null,{"$f":"COUNTIF($N$8:$N$55,1)+COUNTIF($N$8:$N$55,3)","v":0},"matchs",null,null,{"$f":"AJ9","v":0},null,"points"]
[null,{"$f":"VLOOKUP($D10,TABLEAU_MATCHS[#All],2,FALSE)","v":"2018-06-15"},{"$f":"VLOOKUP($D10,TABLEAU_MATCHS[#All],3,FALSE)","v":"18:00:00"},3,{"$f":"\"Groupe \"&VLOOKUP($I10,TABLEAU_TEAMS[[#All],[TEAM]:[GROUP_INITIAL_RANK]],2,FALSE)","v":"Groupe B"},1.8,3.05,4.5,{"$f":"VLOOKUP($D10,TABLEAU_MATCHS[#All],4,FALSE)","v":"Maroc"},null,null,{"$f":"VLOOKUP($D10,TABLEAU_MATCHS[#All],5,FALSE)","v":"RI Iran"},null,{"$f":"IF(OR(ISBLANK(RESULTATS!J10),ISBLANK(J10)),\"\",IF(AND('Pronostiqueur 3'!J10=RESULTATS!J10,'Pronostiqueur 3'!M10=RESULTATS!M10),3,IF(OR(AND('Pronostiqueur 3'!J10>'Pronostiqueur 3'!M10,RESULTATS!J10>RESULTATS!M10),AND('Pronostiqueur 3'!J10<'Pronostiqueur 3'!M10,RESULTATS!J10<RESULTATS!M10),AND('Pronostiqueur 3'!J10='Pronostiqueur 3'!M10,RESULTATS!J10=RESULTATS!M10)),1,0)))","v":""},null,null,null,"00000Russie",0,1,"Russie",{"$f":"SUMPRODUCT((Teams1=U10)*(Teams1_Score<>\"\"))+SUMPRODUCT((Teams2=U10)*(Teams2_Score<>\"\"))","v":0},{"$f":"SUMPRODUCT((Teams1=U10)*(Teams1_Score>Teams2_Score))+SUMPRODUCT((Teams2=U10)*(Teams2_Score>Teams1_Score))","v":0},{"$f":"SUMPRODUCT((Teams1=U10)*(Teams1_Score=Teams2_Score)*(Teams1_Score<>\"\"))+SUMPRODUCT((Teams2=U10)*(Teams2_Score=Teams1_Score)*(Teams2_Score<>\"\"))","v":0},{"$f":"SUMPRODUCT((Teams1=U10)*(Teams1_Score<Teams2_Score))+SUMPRODUCT((Teams2=U10)*(Teams2_Score<Teams1_Score))","v":0},{"$f":"SUMPRODUCT((Teams1=U10)*(Teams1_Score))+SUMPRODUCT((Teams2=U10)*(Teams2_Score))","v":0},{"$f":"SUMPRODUCT((Teams1=U10)*(Teams2_Score))+SUMPRODUCT((Teams2=U10)*(Teams1_Score))","v":0},{"$f":"Z10-AA10","v":0},{"$f":"3*W10+X10","v":0},null,null,null,"Bonus score exact (2 pts)",null,null,{"$f":"+COUNTIF($N$8:$N$55,3)","v":0},"matchs",null,null,{"$f":"AJ10*2","v":0},null,"points"]
[null,{"$f":"VLOOKUP($D11,TABLEAU_MATCHS[#All],2,FALSE)","v":"2018-06-15"},{"$f":"VLOOKUP($D11,TABLEAU_MATCHS[#All],3,FALSE)","v":"21:00:00"},4,{"$f":"\"Groupe \"&VLOOKUP($I11,TABLEAU_TEAMS[[#All],[TEAM]:[GROUP_INITIAL_RANK]],2,FALSE)","v":"Groupe B"},1.42,3.9,7,{"$f":"VLOOKUP($D11,TABLEAU_MATCHS[#All],4,FALSE)","v":"Portugal"},null,null,{"$f":"VLOOKUP($D11,TABLEAU_MATCHS[#All],5,FALSE)","v":"Espagne"},null,{"$f":"IF(OR(ISBLANK(RESULTATS!J11),ISBLANK(J11)),\"\",IF(AND('Pronostiqueur 3'!J11=RESULTATS!J11,'Pronostiqueur 3'!M11=RESULTATS!M11),3,IF(OR(AND('Pronostiqueur 3'!J11>'Pronostiqueur 3'!M11,RESULTATS!J11>RESULTATS!M11),AND('Pronostiqueur 3'!J11<'Pronostiqueur 3'!M11,RESULTATS!J11<RESULTATS!M11),AND('Pronostiqueur 3'!J11='Pronostiqueur 3'!M11,RESULTATS!J11=RESULTATS!M11)),1,0)))","v":""},null,null,null,"00000Egypte",0,1,"Egypte",{"$f":"SUMPRODUCT((Teams1=U11)*(Teams1_Score<>\"\"))+SUMPRODUCT((Teams2=U11)*(Teams2_Score<>\"\"))","v":0},{"$f":"SUMPRODUCT((Teams1=U11)*(Teams1_Score>Teams2_Score))+SUMPRODUCT((Teams2=U11)*(Teams2_Score>Teams1_Score))","v":0},{"$f":"SUMPRODUCT((Teams1=U11)*(Teams1_Score=Teams2_Score)*(Teams1_Score<>\"\"))+SUMPRODUCT((Teams2=U11)*(Teams2_Score=Teams1_Score)*(Teams2_Score<>\"\"))","v":0},{"$f":"SUMPRODUCT((Teams1=U11)*(Teams1_Score<Teams2_Score))+SUMPRODUCT((Teams2=U11)*(Teams2_Score<Teams1_Score))","v":0},{"$f":"SUMPRODUCT((Teams1=U11)*(Teams1_Score))+SUMPRODUCT((Teams2=U11)*(Teams2_Score))","v":0},{"$f":"SUMPRODUCT((Teams1=U11)*(Teams2_Score))+SUMPRODUCT((Teams2=U11)*(Teams1_Score))","v":0},0,0]
[null,{"$f":"VLOOKUP($D12,TABLEAU_MATCHS[#All],2,FALSE)","v":"2018-06-16"},{"$f":"VLOOKUP($D12,TABLEAU_MATCHS[#All],3,FALSE)","v":"13:00:00"},5,{"$f":"\"Groupe \"&VLOOKUP($I12,TABLEAU_TEAMS[[#All],[TEAM]:[GROUP_INITIAL_RANK]],2,FALSE)","v":"Groupe C"},1.7,3.1,5,{"$f":"VLOOKUP($D12,TABLEAU_MATCHS[#All],4,FALSE)","v":"France"},null,null,{"$f":"VLOOKUP($D12,TABLEAU_MATCHS[#All],5,FALSE)","v":"Australie"},null,{"$f":"IF(OR(ISBLANK(RESULTATS!J12),ISBLANK(J12)),\"\",IF(AND('Pronostiqueur 3'!J12=RESULTATS!J12,'Pronostiqueur 3'!M12=RESULTATS!M12),3,IF(OR(AND('Pronostiqueur 3'!J12>'Pronostiqueur 3'!M12,RESULTATS!J12>RESULTATS!M12),AND('Pronostiqueur 3'!J12<'Pronostiqueur 3'!M12,RESULTATS!J12<RESULTATS!M12),AND('Pronostiqueur 3'!J12='Pronostiqueur 3'!M12,RESULTATS!J12=RESULTATS!M12)),1,0)))","v":""},null,null,null,"00000Arabie Saoudite",0,1,"Arabie Saoudite",{"$f":"SUMPRODUCT((Teams1=U12)*(Teams1_Score<>\"\"))+SUMPRODUCT((Teams2=U12)*(Teams2_Score<>\"\"))","v":0},{"$f":"SUMPRODUCT((Teams1=U12)*(Teams1_Score>Teams2_Score))+SUMPRODUCT((Teams2=U12)*(Teams2_Score>Teams1_Score))","v":0},{"$f":"SUMPRODUCT((Teams1=U12)*(Teams1_Score=Teams2_Score)*(Teams1_Score<>\"\"))+SUMPRODUCT((Teams2=U12)*(Teams2_Score=Teams1_Score)*(Teams2_Score<>\"\"))","v":0},{"$f":"SUMPRODUCT((Teams1=U12)*(Teams1_Score<Teams2_Score))+SUMPRODUCT((Teams2=U12)*(Teams2_Score<Teams1_Score))","v":0},{"$f":"SUMPRODUCT((Teams1=U12)*(Teams1_Score))+SUMPRODUCT((Teams2=U12)*(Teams2_Score))","v":0},{"$f":"SUMPRODUCT((Teams1=U12)*(Teams2_Score))+SUMPRODUCT((Teams2=U12)*(Teams1_Score))","v":0},0,0,null,null,null,"Phases finales",null,null,null,null,null,null,{"$f":"SUM(AN13:AN17)","v":0},null,"points"]
[null,{"$f":"VLOOKUP($D13,TABLEAU_MATCHS[#All],2,FALSE)","v":"2018-06-16"},{"$f":"VLOOKUP($D13,TABLEAU_MATCHS[#All],3,FALSE)","v":"19:00:00"},6,{"$f":"\"Groupe \"&VLOOKUP($I13,TABLEAU_TEAMS[[#All],[TEAM]:[GROUP_INITIAL_RANK]],2,FALSE)","v":"Groupe C"},2.5499999999999998,2.9,2.7,{"$f":"VLOOKUP($D13,TABLEAU_MATCHS[#All],4,FALSE)","v":"Pérou"},null,null,{"$f":"VLOOKUP($D13,TABLEAU_MATCHS[#All],5,FALSE)","v":"Danemark"},null,{"$f":"IF(OR(ISBLANK(RESULTATS!J13),ISBLANK(J13)),\"\",IF(AND('Pronostiqueur 3'!J13=RESULTATS!J13,'Pronostiqueur 3'!M13=RESULTATS!M13),3,IF(OR(AND('Pronostiqueur 3'!J13>'Pronostiqueur 3'!M13,RESULTATS!J13>RESULTATS!M13),AND('Pronostiqueur 3'!J13<'Pronostiqueur 3'!M13,RESULTATS!J13<RESULTATS!M13),AND('Pronostiqueur 3'!J13='Pronostiqueur 3'!M13,RESULTATS!J13=RESULTATS!M13)),1,0)))","v":""},null,null,null,null,null,null,null,null,null,null,null,null,null,null,null,null,null,null,"Huitièmes de finaliste trouvés (2 pts)",null,null,{"$f":"IF(CLASSEMENT!PHASES_FINALES=\"OUI\",$AK$53+$AQ$53)","v":false},"équipe(s) ",null,null,{"$f":"AJ13*2","v":0},null,"points"]
[null,{"$f":"VLOOKUP($D14,TABLEAU_MATCHS[#All],2,FALSE)","v":"2018-06-16"},{"$f":"VLOOKUP($D14,TABLEAU_MATCHS[#All],3,FALSE)","v":"16:00:00"},7,{"$f":"\"Groupe \"&VLOOKUP($I14,TABLEAU_TEAMS[[#All],[TEAM]:[GROUP_INITIAL_RANK]],2,FALSE)","v":"Groupe D"},1.4,4,7.25,{"$f":"VLOOKUP($D14,TABLEAU_MATCHS[#All],4,FALSE)","v":"Argentine"},null,null,{"$f":"VLOOKUP($D14,TABLEAU_MATCHS[#All],5,FALSE)","v":"Islande"},null,{"$f":"IF(OR(ISBLANK(RESULTATS!J14),ISBLANK(J14)),\"\",IF(AND('Pronostiqueur 3'!J14=RESULTATS!J14,'Pronostiqueur 3'!M14=RESULTATS!M14),3,IF(OR(AND('Pronostiqueur 3'!J14>'Pronostiqueur 3'!M14,RESULTATS!J14>RESULTATS!M14),AND('Pronostiqueur 3'!J14<'Pronostiqueur 3'!M14,RESULTATS!J14<RESULTATS!M14),AND('Pronostiqueur 3'!J14='Pronostiqueur 3'!M14,RESULTATS!J14=RESULTATS!M14)),1,0)))","v":""},null,null,null,null,null,"Rg","Groupe B","MJ","G","N","P","BP","BC","+/-","Pts",null,null,null,"Quarts de finalistes trouvés (4 pts)",null,null,{"$f":"IF(CLASSEMENT!PHASES_FINALES=\"OUI\",$AK$42+$AQ$42)","v":false},"équipe(s) ",null,null,{"$f":"AJ14*4","v":0},null,"points"]
[null,{"$f":"VLOOKUP($D15,TABLEAU_MATCHS[#All],2,FALSE)","v":"2018-06-16"},{"$f":"VLOOKUP($D15,TABLEAU_MATCHS[#All],3,FALSE)","v":"21:00:00"},8,{"$f":"\"Groupe \"&VLOOKUP($I15,TABLEAU_TEAMS[[#All],[TEAM]:[GROUP_INITIAL_RANK]],2,FALSE)","v":"Groupe D"},2.95,2.7,2.5499999999999998,{"$f":"VLOOKUP($D15,TABLEAU_MATCHS[#All],4,FALSE)","v":"Croatie"},null,null,{"$f":"VLOOKUP($D15,TABLEAU_MATCHS[#All],5,FALSE)","v":"Nigeria"},null,{"$f":"IF(OR(ISBLANK(RESULTATS!J15),ISBLANK(J15)),\"\",IF(AND('Pronostiqueur 3'!J15=RESULTATS!J15,'Pronostiqueur 3'!M15=RESULTATS!M15),3,IF(OR(AND('Pronostiqueur 3'!J15>'Pronostiqueur 3'!M15,RESULTATS!J15>RESULTATS!M15),AND('Pronostiqueur 3'!J15<'Pronostiqueur 3'!M15,RESULTATS!J15<RESULTATS!M15),AND('Pronostiqueur 3'!J15='Pronostiqueur 3'!M15,RESULTATS!J15=RESULTATS!M15)),1,0)))","v":""},null,null,null,{"$f":"INDEX($R66:$R69,MATCH(SMALL(COUNTIF($R66:$R69,\">=\"&$R66:$R69),ROW(INDIRECT(\"1:\"&ROWS($R66:$R69)))),COUNTIF($R66:$R69,\">=\"&$R66:$R69),0))","v":"00000RI Iran"},{"$f":"INDEX($S66:$S69,MATCH(SMALL(COUNTIF($R66:$R69,\">=\"&$R66:$R69),ROW(INDIRECT(\"1:\"&ROWS($R66:$R69)))),COUNTIF($R66:$R69,\">=\"&$R66:$R69),0))","v":0},{"$f":"INDEX($T66:$T69,MATCH(SMALL(COUNTIF($R66:$R69,\">=\"&$R66:$R69),ROW(INDIRECT(\"1:\"&ROWS($R66:$R69)))),COUNTIF($R66:$R69,\">=\"&$R66:$R69),0))","v":1},{"$f":"INDEX($U66:$U69,MATCH(SMALL(COUNTIF($R66:$R69,\">=\"&$R66:$R69),ROW(INDIRECT(\"1:\"&ROWS($R66:$R69)))),COUNTIF($R66:$R69,\">=\"&$R66:$R69),0))","v":"RI Iran"},{"$f":"SUMPRODUCT((Teams1=U15)*(Teams1_Score<>\"\"))+SUMPRODUCT((Teams2=U15)*(Teams2_Score<>\"\"))","v":0},{"$f":"SUMPRODUCT((Teams1=U15)*(Teams1_Score>Teams2_Score))+SUMPRODUCT((Teams2=U15)*(Teams2_Score>Teams1_Score))","v":0},{"$f":"SUMPRODUCT((Teams1=U15)*(Teams1_Score=Teams2_Score)*(Teams1_Score<>\"\"))+SUMPRODUCT((Teams2=U15)*(Teams2_Score=Teams1_Score)*(Teams2_Score<>\"\"))","v":0},{"$f":"SUMPRODUCT((Teams1=U15)*(Teams1_Score<Teams2_Score))+SUMPRODUCT((Teams2=U15)*(Teams2_Score<Teams1_Score))","v":0},{"$f":"SUMPRODUCT((Teams1=U15)*(Teams1_Score))+SUMPRODUCT((Teams2=U15)*(Teams2_Score))","v":0},{"$f":"SUMPRODUCT((Teams1=U15)*(Teams2_Score))+SUMPRODUCT((Teams2=U15)*(Teams1_Score))","v":0},{"$f":"Z15-AA15","v":0},{"$f":"3*W15+X15","v":0},null,null,null,"Demi finalistes trouvés (5 pts)",null,null,{"$f":"IF(CLASSEMENT!PHASES_FINALES=\"OUI\",$AK$35+$AQ$35)","v":false},"équipe(s) ",null,null,{"$f":"AJ15*5","v":0},null,"points"]
[null,{"$f":"VLOOKUP($D16,TABLEAU_MATCHS[#All],2,FALSE)","v":"2018-06-17"},{"$f":"VLOOKUP($D16,TABLEAU_MATCHS[#All],3,FALSE)","v":"16:00:00"},9,{"$f":"\"Groupe \"&VLOOKUP($I16,TABLEAU_TEAMS[[#All],[TEAM]:[GROUP_INITIAL_RANK]],2,FALSE)","v":"Groupe E"},2.35,2.9,2.95,{"$f":"VLOOKUP($D16,TABLEAU_MATCHS[#All],4,FALSE)","v":"Costa Rica"},null,null,{"$f":"VLOOKUP($D16,TABLEAU_MATCHS[#All],5,FALSE)","v":"Serbie"},null,{"$f":"IF(OR(ISBLANK(RESULTATS!J16),ISBLANK(J16)),\"\",IF(AND('Pronostiqueur 3'!J16=RESULTATS!J16,'Pronostiqueur 3'!M16=RESULTATS!M16),3,IF(OR(AND('Pronostiqueur 3'!J16>'Pronostiqueur 3'!M16,RESULTATS!J16>RESULTATS!M16),AND('Pronostiqueur 3'!J16<'Pronostiqueur 3'!M16,RESULTATS!J16<RESULTATS!M16),AND('Pronostiqueur 3'!J16='Pronostiqueur 3'!M16,RESULTATS!J16=RESULTATS!M16)),1,0)))","v":""},null,null,null,"00000Portugal",0,1,"Portugal",{"$f":"SUMPRODUCT((Teams1=U16)*(Teams1_Score<>\"\"))+SUMPRODUCT((Teams2=U16)*(Teams2_Score<>\"\"))","v":0},{"$f":"SUMPRODUCT((Teams1=U16)*(Teams1_Score>Teams2_Score))+SUMPRODUCT((Teams2=U16)*(Teams2_Score>Teams1_Score))","v":0},{"$f":"SUMPRODUCT((Teams1=U16)*(Teams1_Score=Teams2_Score)*(Teams1_Score<>\"\"))+SUMPRODUCT((Teams2=U16)*(Teams2_Score=Teams1_Score)*(Teams2_Score<>\"\"))","v":0},{"$f":"SUMPRODUCT((Teams1=U16)*(Teams1_Score<Teams2_Score))+SUMPRODUCT((Teams2=U16)*(Teams2_Score<Teams1_Score))","v":0},{"$f":"SUMPRODUCT((Teams1=U16)*(Teams1_Score))+SUMPRODUCT((Teams2=U16)*(Teams2_Score))","v":0},{"$f":"SUMPRODUCT((Teams1=U16)*(Teams2_Score))+SUMPRODUCT((Teams2=U16)*(Teams1_Score))","v":0},0,0,null,null,null,"Finalistes trouvés (6 pts)",null,null,{"$f":"IF(CLASSEMENT!PHASES_FINALES=\"OUI\",$AK$25+$AQ$25)","v":false},"équipe(s) ",null,null,{"$f":"AJ16*6","v":0},null,"points"]
[null,{"$f":"VLOOKUP($D17,TABLEAU_MATCHS[#All],2,FALSE)","v":"2018-06-17"},{"$f":"VLOOKUP($D17,TABLEAU_MATCHS[#All],3,FALSE)","v":"21:00:00"},10,{"$f":"\"Groupe \"&VLOOKUP($I17,TABLEAU_TEAMS[[#All],[TEAM]:[GROUP_INITIAL_RANK]],2,FALSE)","v":"Groupe E"},1.28,4.7,9.5,{"$f":"VLOOKUP($D17,TABLEAU_MATCHS[#All],4,FALSE)","v":"Brésil"},null,null,{"$f":"VLOOKUP($D17,TABLEAU_MATCHS[#All],5,FALSE)","v":"Suisse"},null,{"$f":"IF(OR(ISBLANK(RESULTATS!J17),ISBLANK(J17)),\"\",IF(AND('Pronostiqueur 3'!J17=RESULTATS!J17,'Pronostiqueur 3'!M17=RESULTATS!M17),3,IF(OR(AND('Pronostiqueur 3'!J17>'Pronostiqueur 3'!M17,RESULTATS!J17>RESULTATS!M17),AND('Pronostiqueur 3'!J17<'Pronostiqueur 3'!M17,RESULTATS!J17<RESULTATS!M17),AND('Pronostiqueur 3'!J17='Pronostiqueur 3'!M17,RESULTATS!J17=RESULTATS!M17)),1,0)))","v":""},null,null,null,"00000Maroc",0,1,"Maroc",{"$f":"SUMPRODUCT((Teams1=U17)*(Teams1_Score<>\"\"))+SUMPRODUCT((Teams2=U17)*(Teams2_Score<>\"\"))","v":0},{"$f":"SUMPRODUCT((Teams1=U17)*(Teams1_Score>Teams2_Score))+SUMPRODUCT((Teams2=U17)*(Teams2_Score>Teams1_Score))","v":0},{"$f":"SUMPRODUCT((Teams1=U17)*(Teams1_Score=Teams2_Score)*(Teams1_Score<>\"\"))+SUMPRODUCT((Teams2=U17)*(Teams2_Score=Teams1_Score)*(Teams2_Score<>\"\"))","v":0},{"$f":"SUMPRODUCT((Teams1=U17)*(Teams1_Score<Teams2_Score))+SUMPRODUCT((Teams2=U17)*(Teams2_Score<Teams1_Score))","v":0},{"$f":"SUMPRODUCT((Teams1=U17)*(Teams1_Score))+SUMPRODUCT((Teams2=U17)*(Teams2_Score))","v":0},{"$f":"SUMPRODUCT((Teams1=U17)*(Teams2_Score))+SUMPRODUCT((Teams2=U17)*(Teams1_Score))","v":0},0,0,null,null,null,"Champion du monde trouvé (7 pts)",null,null,{"$f":"IF(CLASSEMENT!PHASES_FINALES=\"OUI\",IF(AJ25<>\"\",IF($AT$25=RESULTATS!AS10,1,0),0))","v":false},"équipe",null,null,{"$f":"AJ17*7","v":0},null,"points"]
[null,{"$f":"VLOOKUP($D18,TABLEAU_MATCHS[#All],2,FALSE)","v":"2018-06-17"},{"$f":"VLOOKUP($D18,TABLEAU_MATCHS[#All],3,FALSE)","v":"18:00:00"},11,{"$f":"\"Groupe \"&VLOOKUP($I18,TABLEAU_TEAMS[[#All],[TEAM]:[GROUP_INITIAL_RANK]],2,FALSE)","v":"Groupe F"},1.34,4.3,7.5,{"$f":"VLOOKUP($D18,TABLEAU_MATCHS[#All],4,FALSE)","v":"Allemagne"},null,null,{"$f":"VLOOKUP($D18,TABLEAU_MATCHS[#All],5,FALSE)","v":"Mexique"},null,{"$f":"IF(OR(ISBLANK(RESULTATS!J18),ISBLANK(J18)),\"\",IF(AND('Pronostiqueur 3'!J18=RESULTATS!J18,'Pronostiqueur 3'!M18=RESULTATS!M18),3,IF(OR(AND('Pronostiqueur 3'!J18>'Pronostiqueur 3'!M18,RESULTATS!J18>RESULTATS!M18),AND('Pronostiqueur 3'!J18<'Pronostiqueur 3'!M18,RESULTATS!J18<RESULTATS!M18),AND('Pronostiqueur 3'!J18='Pronostiqueur 3'!M18,RESULTATS!J18=RESULTATS!M18)),1,0)))","v":""},null,null,null,"00000Espagne",0,1,"Espagne",{"$f":"SUMPRODUCT((Teams1=U18)*(Teams1_Score<>\"\"))+SUMPRODUCT((Teams2=U18)*(Teams2_Score<>\"\"))","v":0},{"$f":"SUMPRODUCT((Teams1=U18)*(Teams1_Score>Teams2_Score))+SUMPRODUCT((Teams2=U18)*(Teams2_Score>Teams1_Score))","v":0},{"$f":"SUMPRODUCT((Teams1=U18)*(Teams1_Score=Teams2_Score)*(Teams1_Score<>\"\"))+SUMPRODUCT((Teams2=U18)*(Teams2_Score=Teams1_Score)*(Teams2_Score<>\"\"))","v":0},{"$f":"SUMPRODUCT((Teams1=U18)*(Teams1_Score<Teams2_Score))+SUMPRODUCT((Teams2=U18)*(Teams2_Score<Teams1_Score))","v":0},{"$f":"SUMPRODUCT((Teams1=U18)*(Teams1_Score))+SUMPRODUCT((Teams2=U18)*(Teams2_Score))","v":0},{"$f":"SUMPRODUCT((Teams1=U18)*(Teams2_Score))+SUMPRODUCT((Teams2=U18)*(Teams1_Score))","v":0},0,0]
[null,{"$f":"VLOOKUP($D19,TABLEAU_MATCHS[#All],2,FALSE)","v":"2018-06-18"},{"$f":"VLOOKUP($D19,TABLEAU_MATCHS[#All],3,FALSE)","v":"15:00:00"},12,{"$f":"\"Groupe \"&VLOOKUP($I19,TABLEAU_TEAMS[[#All],[TEAM]:[GROUP_INITIAL_RANK]],2,FALSE)","v":"Groupe F"},3.3,2.95,2.15,{"$f":"VLOOKUP($D19,TABLEAU_MATCHS[#All],4,FALSE)","v":"Suède"},null,null,{"$f":"VLOOKUP($D19,TABLEAU_MATCHS[#All],5,FALSE)","v":"République de Corée"},null,{"$f":"IF(OR(ISBLANK(RESULTATS!J19),ISBLANK(J19)),\"\",IF(AND('Pronostiqueur 3'!J19=RESULTATS!J19,'Pronostiqueur 3'!M19=RESULTATS!M19),3,IF(OR(AND('Pronostiqueur 3'!J19>'Pronostiqueur 3'!M19,RESULTATS!J19>RESULTATS!M19),AND('Pronostiqueur 3'!J19<'Pronostiqueur 3'!M19,RESULTATS!J19<RESULTATS!M19),AND('Pronostiqueur 3'!J19='Pronostiqueur 3'!M19,RESULTATS!J19=RESULTATS!M19)),1,0)))","v":""}]
[null,{"$f":"VLOOKUP($D20,TABLEAU_MATCHS[#All],2,FALSE)","v":"2018-06-18"},{"$f":"VLOOKUP($D20,TABLEAU_MATCHS[#All],3,FALSE)","v":"18:00:00"},13,{"$f":"\"Groupe \"&VLOOKUP($I20,TABLEAU_TEAMS[[#All],[TEAM]:[GROUP_INITIAL_RANK]],2,FALSE)","v":"Groupe G"},1.95,2.95,4,{"$f":"VLOOKUP($D20,TABLEAU_MATCHS[#All],4,FALSE)","v":"Belgique"},null,null,{"$f":"VLOOKUP($D20,TABLEAU_MATCHS[#All],5,FALSE)","v":"Panama"},null,{"$f":"IF(OR(ISBLANK(RESULTATS!J20),ISBLANK(J20)),\"\",IF(AND('Pronostiqueur 3'!J20=RESULTATS!J20,'Pronostiqueur 3'!M20=RESULTATS!M20),3,IF(OR(AND('Pronostiqueur 3'!J20>'Pronostiqueur 3'!M20,RESULTATS!J20>RESULTATS!M20),AND('Pronostiqueur 3'!J20<'Pronostiqueur 3'!M20,RESULTATS!J20<RESULTATS!M20),AND('Pronostiqueur 3'!J20='Pronostiqueur 3'!M20,RESULTATS!J20=RESULTATS!M20)),1,0)))","v":""},null,null,null,null,null,"Rg","Groupe C","MJ","G","N","P","BP","BC","+/-","Pts"]
[null,{"$f":"VLOOKUP($D21,TABLEAU_MATCHS[#All],2,FALSE)","v":"2018-06-18"},{"$f":"VLOOKUP($D21,TABLEAU_MATCHS[#All],3,FALSE)","v":"21:00:00"},14,{"$f":"\"Groupe \"&VLOOKUP($I21,TABLEAU_TEAMS[[#All],[TEAM]:[GROUP_INITIAL_RANK]],2,FALSE)","v":"Groupe G"},2.5499999999999998,2.9,2.7,{"$f":"VLOOKUP($D21,TABLEAU_MATCHS[#All],4,FALSE)","v":"Tunisie"},null,null,{"$f":"VLOOKUP($D21,TABLEAU_MATCHS[#All],5,FALSE)","v":"Angleterre"},null,{"$f":"IF(OR(ISBLANK(RESULTATS!J21),ISBLANK(J21)),\"\",IF(AND('Pronostiqueur 3'!J21=RESULTATS!J21,'Pronostiqueur 3'!M21=RESULTATS!M21),3,IF(OR(AND('Pronostiqueur 3'!J21>'Pronostiqueur 3'!M21,RESULTATS!J21>RESULTATS!M21),AND('Pronostiqueur 3'!J21<'Pronostiqueur 3'!M21,RESULTATS!J21<RESULTATS!M21),AND('Pronostiqueur 3'!J21='Pronostiqueur 3'!M21,RESULTATS!J21=RESULTATS!M21)),1,0)))","v":""},null,null,null,{"$f":"INDEX($R72:$R75,MATCH(SMALL(COUNTIF($R72:$R75,\">=\"&$R72:$R75),ROW(INDIRECT(\"1:\"&ROWS($R72:$R75)))),COUNTIF($R72:$R75,\">=\"&$R72:$R75),0))","v":"00000Pérou"},{"$f":"INDEX($S72:$S75,MATCH(SMALL(COUNTIF($R72:$R75,\">=\"&$R72:$R75),ROW(INDIRECT(\"1:\"&ROWS($R72:$R75)))),COUNTIF($R72:$R75,\">=\"&$R72:$R75),0))","v":0},{"$f":"INDEX($T72:$T75,MATCH(SMALL(COUNTIF($R72:$R75,\">=\"&$R72:$R75),ROW(INDIRECT(\"1:\"&ROWS($R72:$R75)))),COUNTIF($R72:$R75,\">=\"&$R72:$R75),0))","v":1},{"$f":"INDEX($U72:$U75,MATCH(SMALL(COUNTIF($R72:$R75,\">=\"&$R72:$R75),ROW(INDIRECT(\"1:\"&ROWS($R72:$R75)))),COUNTIF($R72:$R75,\">=\"&$R72:$R75),0))","v":"Pérou"},{"$f":"SUMPRODUCT((Teams1=U21)*(Teams1_Score<>\"\"))+SUMPRODUCT((Teams2=U21)*(Teams2_Score<>\"\"))","v":0},{"$f":"SUMPRODUCT((Teams1=U21)*(Teams1_Score>Teams2_Score))+SUMPRODUCT((Teams2=U21)*(Teams2_Score>Teams1_Score))","v":0},{"$f":"SUMPRODUCT((Teams1=U21)*(Teams1_Score=Teams2_Score)*(Teams1_Score<>\"\"))+SUMPRODUCT((Teams2=U21)*(Teams2_Score=Teams1_Score)*(Teams2_Score<>\"\"))","v":0},{"$f":"SUMPRODUCT((Teams1=U21)*(Teams1_Score<Teams2_Score))+SUMPRODUCT((Teams2=U21)*(Teams2_Score<Teams1_Score))","v":0},{"$f":"SUMPRODUCT((Teams1=U21)*(Teams1_Score))+SUMPRODUCT((Teams2=U21)*(Teams2_Score))","v":0},{"$f":"SUMPRODUCT((Teams1=U21)*(Teams2_Score))+SUMPRODUCT((Teams2=U21)*(Teams1_Score))","v":0},{"$f":"Z21-AA21","v":0},{"$f":"3*W21+X21","v":0},null,null,null,"PHASES FINALES"]
[null,{"$f":"VLOOKUP($D22,TABLEAU_MATCHS[#All],2,FALSE)","v":"2018-06-19"},{"$f":"VLOOKUP($D22,TABLEAU_MATCHS[#All],3,FALSE)","v":"15:00:00"},15,{"$f":"\"Groupe \"&VLOOKUP($I22,TABLEAU_TEAMS[[#All],[TEAM]:[GROUP_INITIAL_RANK]],2,FALSE)","v":"Groupe H"},1.38,3.9,8,{"$f":"VLOOKUP($D22,TABLEAU_MATCHS[#All],4,FALSE)","v":"Colombie"},null,null,{"$f":"VLOOKUP($D22,TABLEAU_MATCHS[#All],5,FALSE)","v":"Japon"},null,{"$f":"IF(OR(ISBLANK(RESULTATS!J22),ISBLANK(J22)),\"\",IF(AND('Pronostiqueur 3'!J22=RESULTATS!J22,'Pronostiqueur 3'!M22=RESULTATS!M22),3,IF(OR(AND('Pronostiqueur 3'!J22>'Pronostiqueur 3'!M22,RESULTATS!J22>RESULTATS!M22),AND('Pronostiqueur 3'!J22<'Pronostiqueur 3'!M22,RESULTATS!J22<RESULTATS!M22),AND('Pronostiqueur 3'!J22='Pronostiqueur 3'!M22,RESULTATS!J22=RESULTATS!M22)),1,0)))","v":""},null,null,null,"00000France",0,1,"France",{"$f":"SUMPRODUCT((Teams1=U22)*(Teams1_Score<>\"\"))+SUMPRODUCT((Teams2=U22)*(Teams2_Score<>\"\"))","v":0},{"$f":"SUMPRODUCT((Teams1=U22)*(Teams1_Score>Teams2_Score))+SUMPRODUCT((Teams2=U22)*(Teams2_Score>Teams1_Score))","v":0},{"$f":"SUMPRODUCT((Teams1=U22)*(Teams1_Score=Teams2_Score)*(Teams1_Score<>\"\"))+SUMPRODUCT((Teams2=U22)*(Teams2_Score=Teams1_Score)*(Teams2_Score<>\"\"))","v":0},{"$f":"SUMPRODUCT((Teams1=U22)*(Teams1_Score<Teams2_Score))+SUMPRODUCT((Teams2=U22)*(Teams2_Score<Teams1_Score))","v":0},{"$f":"SUMPRODUCT((Teams1=U22)*(Teams1_Score))+SUMPRODUCT((Teams2=U22)*(Teams2_Score))","v":0},{"$f":"SUMPRODUCT((Teams1=U22)*(Teams2_Score))+SUMPRODUCT((Teams2=U22)*(Teams1_Score))","v":0},0,0]
[null,{"$f":"VLOOKUP($D23,TABLEAU_MATCHS[#All],2,FALSE)","v":"2018-06-19"},{"$f":"VLOOKUP($D23,TABLEAU_MATCHS[#All],3,FALSE)","v":"18:00:00"},16,{"$f":"\"Groupe \"&VLOOKUP($I23,TABLEAU_TEAMS[[#All],[TEAM]:[GROUP_INITIAL_RANK]],2,FALSE)","v":"Groupe H"},2.0499999999999998,2.9,3.5,{"$f":"VLOOKUP($D23,TABLEAU_MATCHS[#All],4,FALSE)","v":"Pologne"},null,null,{"$f":"VLOOKUP($D23,TABLEAU_MATCHS[#All],5,FALSE)","v":"Sénégal"},null,{"$f":"IF(OR(ISBLANK(RESULTATS!J23),ISBLANK(J23)),\"\",IF(AND('Pronostiqueur 3'!J23=RESULTATS!J23,'Pronostiqueur 3'!M23=RESULTATS!M23),3,IF(OR(AND('Pronostiqueur 3'!J23>'Pronostiqueur 3'!M23,RESULTATS!J23>RESULTATS!M23),AND('Pronostiqueur 3'!J23<'Pronostiqueur 3'!M23,RESULTATS!J23<RESULTATS!M23),AND('Pronostiqueur 3'!J23='Pronostiqueur 3'!M23,RESULTATS!J23=RESULTATS!M23)),1,0)))","v":""},null,null,null,"00000Danemark",0,1,"Danemark",{"$f":"SUMPRODUCT((Teams1=U23)*(Teams1_Score<>\"\"))+SUMPRODUCT((Teams2=U23)*(Teams2_Score<>\"\"))","v":0},{"$f":"SUMPRODUCT((Teams1=U23)*(Teams1_Score>Teams2_Score))+SUMPRODUCT((Teams2=U23)*(Teams2_Score>Teams1_Score))","v":0},{"$f":"SUMPRODUCT((Teams1=U23)*(Teams1_Score=Teams2_Score)*(Teams1_Score<>\"\"))+SUMPRODUCT((Teams2=U23)*(Teams2_Score=Teams1_Score)*(Teams2_Score<>\"\"))","v":0},{"$f":"SUMPRODUCT((Teams1=U23)*(Teams1_Score<Teams2_Score))+SUMPRODUCT((Teams2=U23)*(Teams2_Score<Teams1_Score))","v":0},{"$f":"SUMPRODUCT((Teams1=U23)*(Teams1_Score))+SUMPRODUCT((Teams2=U23)*(Teams2_Score))","v":0},{"$f":"SUMPRODUCT((Teams1=U23)*(Teams2_Score))+SUMPRODUCT((Teams2=U23)*(Teams1_Score))","v":0},0,0,null,null,"Date","Finale",null,null,"Buts",null,"Pen",null,null,null,"Buts",null,"Pen"]
[null,{"$f":"VLOOKUP($D24,TABLEAU_MATCHS[#All],2,FALSE)","v":"2018-06-19"},{"$f":"VLOOKUP($D24,TABLEAU_MATCHS[#All],3,FALSE)","v":"21:00:00"},17,{"$f":"\"Groupe \"&VLOOKUP($I24,TABLEAU_TEAMS[[#All],[TEAM]:[GROUP_INITIAL_RANK]],2,FALSE)","v":"Groupe A"},1.26,4.8,9,{"$f":"VLOOKUP($D24,TABLEAU_MATCHS[#All],4,FALSE)","v":"Russie"},null,null,{"$f":"VLOOKUP($D24,TABLEAU_MATCHS[#All],5,FALSE)","v":"Egypte"},null,{"$f":"IF(OR(ISBLANK(RESULTATS!J24),ISBLANK(J24)),\"\",IF(AND('Pronostiqueur 3'!J24=RESULTATS!J24,'Pronostiqueur 3'!M24=RESULTATS!M24),3,IF(OR(AND('Pronostiqueur 3'!J24>'Pronostiqueur 3'!M24,RESULTATS!J24>RESULTATS!M24),AND('Pronostiqueur 3'!J24<'Pronostiqueur 3'!M24,RESULTATS!J24<RESULTATS!M24),AND('Pronostiqueur 3'!J24='Pronostiqueur 3'!M24,RESULTATS!J24=RESULTATS!M24)),1,0)))","v":""},null,null,null,"00000Australie",0,1,"Australie",{"$f":"SUMPRODUCT((Teams1=U24)*(Teams1_Score<>\"\"))+SUMPRODUCT((Teams2=U24)*(Teams2_Score<>\"\"))","v":0},{"$f":"SUMPRODUCT((Teams1=U24)*(Teams1_Score>Teams2_Score))+SUMPRODUCT((Teams2=U24)*(Teams2_Score>Teams1_Score))","v":0},{"$f":"SUMPRODUCT((Teams1=U24)*(Teams1_Score=Teams2_Score)*(Teams1_Score<>\"\"))+SUMPRODUCT((Teams2=U24)*(Teams2_Score=Teams1_Score)*(Teams2_Score<>\"\"))","v":0},{"$f":"SUMPRODUCT((Teams1=U24)*(Teams1_Score<Teams2_Score))+SUMPRODUCT((Teams2=U24)*(Teams2_Score<Teams1_Score))","v":0},{"$f":"SUMPRODUCT((Teams1=U24)*(Teams1_Score))+SUMPRODUCT((Teams2=U24)*(Teams2_Score))","v":0},{"$f":"SUMPRODUCT((Teams1=U24)*(Teams2_Score))+SUMPRODUCT((Teams2=U24)*(Teams1_Score))","v":0},0,0]
[null,{"$f":"VLOOKUP($D25,TABLEAU_MATCHS[#All],2,FALSE)","v":"2018-06-20"},{"$f":"VLOOKUP($D25,TABLEAU_MATCHS[#All],3,FALSE)","v":"18:00:00"},18,{"$f":"\"Groupe \"&VLOOKUP($I25,TABLEAU_TEAMS[[#All],[TEAM]:[GROUP_INITIAL_RANK]],2,FALSE)","v":"Groupe A"},3.5,3,2,{"$f":"VLOOKUP($D25,TABLEAU_MATCHS[#All],4,FALSE)","v":"Uruguay"},null,null,{"$f":"VLOOKUP($D25,TABLEAU_MATCHS[#All],5,FALSE)","v":"Arabie Saoudite"},null,{"$f":"IF(OR(ISBLANK(RESULTATS!J25),ISBLANK(J25)),\"\",IF(AND('Pronostiqueur 3'!J25=RESULTATS!J25,'Pronostiqueur 3'!M25=RESULTATS!M25),3,IF(OR(AND('Pronostiqueur 3'!J25>'Pronostiqueur 3'!M25,RESULTATS!J25>RESULTATS!M25),AND('Pronostiqueur 3'!J25<'Pronostiqueur 3'!M25,RESULTATS!J25<RESULTATS!M25),AND('Pronostiqueur 3'!J25='Pronostiqueur 3'!M25,RESULTATS!J25=RESULTATS!M25)),1,0)))","v":""},null,null,null,null,null,null,null,null,null,null,null,null,null,null,null,null,null,"2018-07-15",null,{"$f":"+IF(AJ33<>\"\",IF(AI33>AO33,AH33,AN33),\"Vainqueur 1\")","v":"Vainqueur 1"},{"$f":"AJ25*10+AL25","v":0},null,{"$f":"IF(LEFT(AH25,5)<>\"Vainq\",COUNTIF(RESULTATS!$AG$10:$AM$10,AH25),0)","v":0},null,null,{"$f":"+IF(AJ34<>\"\",IF(AI34>AO34,AH34,AN34),\"Vainqueur 2\")","v":"Vainqueur 2"},{"$f":"AP25*10+AR25","v":0},null,{"$f":"IF(LEFT(AN25,5)<>\"Vainq\",COUNTIF(RESULTATS!$AG$10:$AM$10,AN25),0)","v":0},null,null,{"$f":"IF(AJ25<>\"\",IF(AI25>AO25,AH25,AN25),\"\")","v":""}]
[null,{"$f":"VLOOKUP($D26,TABLEAU_MATCHS[#All],2,FALSE)","v":"2018-06-20"},{"$f":"VLOOKUP($D26,TABLEAU_MATCHS[#All],3,FALSE)","v":"15:00:00"},19,{"$f":"\"Groupe \"&VLOOKUP($I26,TABLEAU_TEAMS[[#All],[TEAM]:[GROUP_INITIAL_RANK]],2,FALSE)","v":"Groupe B"},1.66,3.35,4.8,{"$f":"VLOOKUP($D26,TABLEAU_MATCHS[#All],4,FALSE)","v":"Portugal"},null,null,{"$f":"VLOOKUP($D26,TABLEAU_MATCHS[#All],5,FALSE)","v":"Maroc"},null,{"$f":"IF(OR(ISBLANK(RESULTATS!J26),ISBLANK(J26)),\"\",IF(AND('Pronostiqueur 3'!J26=RESULTATS!J26,'Pronostiqueur 3'!M26=RESULTATS!M26),3,IF(OR(AND('Pronostiqueur 3'!J26>'Pronostiqueur 3'!M26,RESULTATS!J26>RESULTATS!M26),AND('Pronostiqueur 3'!J26<'Pronostiqueur 3'!M26,RESULTATS!J26<RESULTATS!M26),AND('Pronostiqueur 3'!J26='Pronostiqueur 3'!M26,RESULTATS!J26=RESULTATS!M26)),1,0)))","v":""},null,null,null,null,null,"Rg","Groupe D","MJ","G","N","P","BP","BC","+/-","Pts"]
[null,{"$f":"VLOOKUP($D27,TABLEAU_MATCHS[#All],2,FALSE)","v":"2018-06-20"},{"$f":"VLOOKUP($D27,TABLEAU_MATCHS[#All],3,FALSE)","v":"21:00:00"},20,{"$f":"\"Groupe \"&VLOOKUP($I27,TABLEAU_TEAMS[[#All],[TEAM]:[GROUP_INITIAL_RANK]],2,FALSE)","v":"Groupe B"},8.5,4.7,1.28,{"$f":"VLOOKUP($D27,TABLEAU_MATCHS[#All],4,FALSE)","v":"RI Iran"},null,null,{"$f":"VLOOKUP($D27,TABLEAU_MATCHS[#All],5,FALSE)","v":"Espagne"},null,{"$f":"IF(OR(ISBLANK(RESULTATS!J27),ISBLANK(J27)),\"\",IF(AND('Pronostiqueur 3'!J27=RESULTATS!J27,'Pronostiqueur 3'!M27=RESULTATS!M27),3,IF(OR(AND('Pronostiqueur 3'!J27>'Pronostiqueur 3'!M27,RESULTATS!J27>RESULTATS!M27),AND('Pronostiqueur 3'!J27<'Pronostiqueur 3'!M27,RESULTATS!J27<RESULTATS!M27),AND('Pronostiqueur 3'!J27='Pronostiqueur 3'!M27,RESULTATS!J27=RESULTATS!M27)),1,0)))","v":""},null,null,null,{"$f":"INDEX($R78:$R81,MATCH(SMALL(COUNTIF($R78:$R81,\">=\"&$R78:$R81),ROW(INDIRECT(\"1:\"&ROWS($R78:$R81)))),COUNTIF($R78:$R81,\">=\"&$R78:$R81),0))","v":"00000Nigeria"},{"$f":"INDEX($S78:$S81,MATCH(SMALL(COUNTIF($R78:$R81,\">=\"&$R78:$R81),ROW(INDIRECT(\"1:\"&ROWS($R78:$R81)))),COUNTIF($R78:$R81,\">=\"&$R78:$R81),0))","v":0},{"$f":"INDEX($T78:$T81,MATCH(SMALL(COUNTIF($R78:$R81,\">=\"&$R78:$R81),ROW(INDIRECT(\"1:\"&ROWS($R78:$R81)))),COUNTIF($R78:$R81,\">=\"&$R78:$R81),0))","v":1},{"$f":"INDEX($U78:$U81,MATCH(SMALL(COUNTIF($R78:$R81,\">=\"&$R78:$R81),ROW(INDIRECT(\"1:\"&ROWS($R78:$R81)))),COUNTIF($R78:$R81,\">=\"&$R78:$R81),0))","v":"Nigeria"},{"$f":"SUMPRODUCT((Teams1=U27)*(Teams1_Score<>\"\"))+SUMPRODUCT((Teams2=U27)*(Teams2_Score<>\"\"))","v":0},{"$f":"SUMPRODUCT((Teams1=U27)*(Teams1_Score>Teams2_Score))+SUMPRODUCT((Teams2=U27)*(Teams2_Score>Teams1_Score))","v":0},{"$f":"SUMPRODUCT((Teams1=U27)*(Teams1_Score=Teams2_Score)*(Teams1_Score<>\"\"))+SUMPRODUCT((Teams2=U27)*(Teams2_Score=Teams1_Score)*(Teams2_Score<>\"\"))","v":0},{"$f":"SUMPRODUCT((Teams1=U27)*(Teams1_Score<Teams2_Score))+SUMPRODUCT((Teams2=U27)*(Teams2_Score<Teams1_Score))","v":0},{"$f":"SUMPRODUCT((Teams1=U27)*(Teams1_Score))+SUMPRODUCT((Teams2=U27)*(Teams2_Score))","v":0},{"$f":"SUMPRODUCT((Teams1=U27)*(Teams2_Score))+SUMPRODUCT((Teams2=U27)*(Teams1_Score))","v":0},{"$f":"Z27-AA27","v":0},{"$f":"3*W27+X27","v":0},null,null,"Date","Petite Finale",null,null,"Buts",null,"Pen",null,null,null,"Buts",null,"Pen"]
[null,{"$f":"VLOOKUP($D28,TABLEAU_MATCHS[#All],2,FALSE)","v":"2018-06-21"},{"$f":"VLOOKUP($D28,TABLEAU_MATCHS[#All],3,FALSE)","v":"16:00:00"},21,{"$f":"\"Groupe \"&VLOOKUP($I28,TABLEAU_TEAMS[[#All],[TEAM]:[GROUP_INITIAL_RANK]],2,FALSE)","v":"Groupe C"},1.85,3,4,{"$f":"VLOOKUP($D28,TABLEAU_MATCHS[#All],4,FALSE)","v":"Danemark"},null,null,{"$f":"VLOOKUP($D28,TABLEAU_MATCHS[#All],5,FALSE)","v":"Australie"},null,{"$f":"IF(OR(ISBLANK(RESULTATS!J28),ISBLANK(J28)),\"\",IF(AND('Pronostiqueur 3'!J28=RESULTATS!J28,'Pronostiqueur 3'!M28=RESULTATS!M28),3,IF(OR(AND('Pronostiqueur 3'!J28>'Pronostiqueur 3'!M28,RESULTATS!J28>RESULTATS!M28),AND('Pronostiqueur 3'!J28<'Pronostiqueur 3'!M28,RESULTATS!J28<RESULTATS!M28),AND('Pronostiqueur 3'!J28='Pronostiqueur 3'!M28,RESULTATS!J28=RESULTATS!M28)),1,0)))","v":""},null,null,null,"00000Islande",0,1,"Islande",{"$f":"SUMPRODUCT((Teams1=U28)*(Teams1_Score<>\"\"))+SUMPRODUCT((Teams2=U28)*(Teams2_Score<>\"\"))","v":0},{"$f":"SUMPRODUCT((Teams1=U28)*(Teams1_Score>Teams2_Score))+SUMPRODUCT((Teams2=U28)*(Teams2_Score>Teams1_Score))","v":0},{"$f":"SUMPRODUCT((Teams1=U28)*(Teams1_Score=Teams2_Score)*(Teams1_Score<>\"\"))+SUMPRODUCT((Teams2=U28)*(Teams2_Score=Teams1_Score)*(Teams2_Score<>\"\"))","v":0},{"$f":"SUMPRODUCT((Teams1=U28)*(Teams1_Score<Teams2_Score))+SUMPRODUCT((Teams2=U28)*(Teams2_Score<Teams1_Score))","v":0},{"$f":"SUMPRODUCT((Teams1=U28)*(Teams1_Score))+SUMPRODUCT((Teams2=U28)*(Teams2_Score))","v":0},{"$f":"SUMPRODUCT((Teams1=U28)*(Teams2_Score))+SUMPRODUCT((Teams2=U28)*(Teams1_Score))","v":0},0,0]
[null,{"$f":"VLOOKUP($D29,TABLEAU_MATCHS[#All],2,FALSE)","v":"2018-06-21"},{"$f":"VLOOKUP($D29,TABLEAU_MATCHS[#All],3,FALSE)","v":"20:00:00"},22,{"$f":"\"Groupe \"&VLOOKUP($I29,TABLEAU_TEAMS[[#All],[TEAM]:[GROUP_INITIAL_RANK]],2,FALSE)","v":"Groupe C"},2.2999999999999998,3,2.9,{"$f":"VLOOKUP($D29,TABLEAU_MATCHS[#All],4,FALSE)","v":"France"},null,null,{"$f":"VLOOKUP($D29,TABLEAU_MATCHS[#All],5,FALSE)","v":"Pérou"},null,{"$f":"IF(OR(ISBLANK(RESULTATS!J29),ISBLANK(J29)),\"\",IF(AND('Pronostiqueur 3'!J29=RESULTATS!J29,'Pronostiqueur 3'!M29=RESULTATS!M29),3,IF(OR(AND('Pronostiqueur 3'!J29>'Pronostiqueur 3'!M29,RESULTATS!J29>RESULTATS!M29),AND('Pronostiqueur 3'!J29<'Pronostiqueur 3'!M29,RESULTATS!J29<RESULTATS!M29),AND('Pronostiqueur 3'!J29='Pronostiqueur 3'!M29,RESULTATS!J29=RESULTATS!M29)),1,0)))","v":""},null,null,null,"00000Croatie",0,1,"Croatie",{"$f":"SUMPRODUCT((Teams1=U29)*(Teams1_Score<>\"\"))+SUMPRODUCT((Teams2=U29)*(Teams2_Score<>\"\"))","v":0},{"$f":"SUMPRODUCT((Teams1=U29)*(Teams1_Score>Teams2_Score))+SUMPRODUCT((Teams2=U29)*(Teams2_Score>Teams1_Score))","v":0},{"$f":"SUMPRODUCT((Teams1=U29)*(Teams1_Score=Teams2_Score)*(Teams1_Score<>\"\"))+SUMPRODUCT((Teams2=U29)*(Teams2_Score=Teams1_Score)*(Teams2_Score<>\"\"))","v":0},{"$f":"SUMPRODUCT((Teams1=U29)*(Teams1_Score<Teams2_Score))+SUMPRODUCT((Teams2=U29)*(Teams2_Score<Teams1_Score))","v":0},{"$f":"SUMPRODUCT((Teams1=U29)*(Teams1_Score))+SUMPRODUCT((Teams2=U29)*(Teams2_Score))","v":0},{"$f":"SUMPRODUCT((Teams1=U29)*(Teams2_Score))+SUMPRODUCT((Teams2=U29)*(Teams1_Score))","v":0},0,0,null,null,"2018-07-14",null,{"$f":"+IF(AJ33<>\"\",IF(AI33>AO33,AN33,AH33),\"Perdant 1\")","v":"Perdant 1"},{"$f":"AJ29*10+AL29","v":0},null,null,null,null,{"$f":"+IF(AJ34<>\"\",IF(AI34>AO34,AN34,AH34),\"Perdant 2\")","v":"Perdant 2"},{"$f":"AP29*10+AR29","v":0}]
[null,{"$f":"VLOOKUP($D30,TABLEAU_MATCHS[#All],2,FALSE)","v":"2018-06-21"},{"$f":"VLOOKUP($D30,TABLEAU_MATCHS[#All],3,FALSE)","v":"21:00:00"},23,{"$f":"\"Groupe \"&VLOOKUP($I30,TABLEAU_TEAMS[[#All],[TEAM]:[GROUP_INITIAL_RANK]],2,FALSE)","v":"Groupe D"},2.4,3,2.8,{"$f":"VLOOKUP($D30,TABLEAU_MATCHS[#All],4,FALSE)","v":"Argentine"},null,null,{"$f":"VLOOKUP($D30,TABLEAU_MATCHS[#All],5,FALSE)","v":"Croatie"},null,{"$f":"IF(OR(ISBLANK(RESULTATS!J30),ISBLANK(J30)),\"\",IF(AND('Pronostiqueur 3'!J30=RESULTATS!J30,'Pronostiqueur 3'!M30=RESULTATS!M30),3,IF(OR(AND('Pronostiqueur 3'!J30>'Pronostiqueur 3'!M30,RESULTATS!J30>RESULTATS!M30),AND('Pronostiqueur 3'!J30<'Pronostiqueur 3'!M30,RESULTATS!J30<RESULTATS!M30),AND('Pronostiqueur 3'!J30='Pronostiqueur 3'!M30,RESULTATS!J30=RESULTATS!M30)),1,0)))","v":""},null,null,null,"00000Argentine",0,1,"Argentine",{"$f":"SUMPRODUCT((Teams1=U30)*(Teams1_Score<>\"\"))+SUMPRODUCT((Teams2=U30)*(Teams2_Score<>\"\"))","v":0},{"$f":"SUMPRODUCT((Teams1=U30)*(Teams1_Score>Teams2_Score))+SUMPRODUCT((Teams2=U30)*(Teams2_Score>Teams1_Score))","v":0},{"$f":"SUMPRODUCT((Teams1=U30)*(Teams1_Score=Teams2_Score)*(Teams1_Score<>\"\"))+SUMPRODUCT((Teams2=U30)*(Teams2_Score=Teams1_Score)*(Teams2_Score<>\"\"))","v":0},{"$f":"SUMPRODUCT((Teams1=U30)*(Teams1_Score<Teams2_Score))+SUMPRODUCT((Teams2=U30)*(Teams2_Score<Teams1_Score))","v":0},{"$f":"SUMPRODUCT((Teams1=U30)*(Teams1_Score))+SUMPRODUCT((Teams2=U30)*(Teams2_Score))","v":0},{"$f":"SUMPRODUCT((Teams1=U30)*(Teams2_Score))+SUMPRODUCT((Teams2=U30)*(Teams1_Score))","v":0},0,0]
[null,{"$f":"VLOOKUP($D31,TABLEAU_MATCHS[#All],2,FALSE)","v":"2018-06-22"},{"$f":"VLOOKUP($D31,TABLEAU_MATCHS[#All],3,FALSE)","v":"18:00:00"},24,{"$f":"\"Groupe \"&VLOOKUP($I31,TABLEAU_TEAMS[[#All],[TEAM]:[GROUP_INITIAL_RANK]],2,FALSE)","v":"Groupe D"},1.26,4.5999999999999996,9.5,{"$f":"VLOOKUP($D31,TABLEAU_MATCHS[#All],4,FALSE)","v":"Nigeria"},null,null,{"$f":"VLOOKUP($D31,TABLEAU_MATCHS[#All],5,FALSE)","v":"Islande"},null,{"$f":"IF(OR(ISBLANK(RESULTATS!J31),ISBLANK(J31)),\"\",IF(AND('Pronostiqueur 3'!J31=RESULTATS!J31,'Pronostiqueur 3'!M31=RESULTATS!M31),3,IF(OR(AND('Pronostiqueur 3'!J31>'Pronostiqueur 3'!M31,RESULTATS!J31>RESULTATS!M31),AND('Pronostiqueur 3'!J31<'Pronostiqueur 3'!M31,RESULTATS!J31<RESULTATS!M31),AND('Pronostiqueur 3'!J31='Pronostiqueur 3'!M31,RESULTATS!J31=RESULTATS!M31)),1,0)))","v":""},null,null,null,null,null,null,null,null,null,null,null,null,null,null,null,null,null,"Date","Demi Finale",null,null,"Buts",null,"Pen",null,null,null,"Buts",null,"Pen"]
[null,{"$f":"VLOOKUP($D32,TABLEAU_MATCHS[#All],2,FALSE)","v":"2018-06-22"},{"$f":"VLOOKUP($D32,TABLEAU_MATCHS[#All],3,FALSE)","v":"15:00:00"},25,{"$f":"\"Groupe \"&VLOOKUP($I32,TABLEAU_TEAMS[[#All],[TEAM]:[GROUP_INITIAL_RANK]],2,FALSE)","v":"Groupe E"},3.5,2.95,2.1,{"$f":"VLOOKUP($D32,TABLEAU_MATCHS[#All],4,FALSE)","v":"Brésil"},null,null,{"$f":"VLOOKUP($D32,TABLEAU_MATCHS[#All],5,FALSE)","v":"Costa Rica"},null,{"$f":"IF(OR(ISBLANK(RESULTATS!J32),ISBLANK(J32)),\"\",IF(AND('Pronostiqueur 3'!J32=RESULTATS!J32,'Pronostiqueur 3'!M32=RESULTATS!M32),3,IF(OR(AND('Pronostiqueur 3'!J32>'Pronostiqueur 3'!M32,RESULTATS!J32>RESULTATS!M32),AND('Pronostiqueur 3'!J32<'Pronostiqueur 3'!M32,RESULTATS!J32<RESULTATS!M32),AND('Pronostiqueur 3'!J32='Pronostiqueur 3'!M32,RESULTATS!J32=RESULTATS!M32)),1,0)))","v":""},null,null,null,null,null,"Rg","Groupe E","MJ","G","N","P","BP","BC","+/-","Pts"]
[null,{"$f":"VLOOKUP($D33,TABLEAU_MATCHS[#All],2,FALSE)","v":"2018-06-22"},{"$f":"VLOOKUP($D33,TABLEAU_MATCHS[#All],3,FALSE)","v":"20:00:00"},26,{"$f":"\"Groupe \"&VLOOKUP($I33,TABLEAU_TEAMS[[#All],[TEAM]:[GROUP_INITIAL_RANK]],2,FALSE)","v":"Groupe E"},4.8,3.25,1.62,{"$f":"VLOOKUP($D33,TABLEAU_MATCHS[#All],4,FALSE)","v":"Serbie"},null,null,{"$f":"VLOOKUP($D33,TABLEAU_MATCHS[#All],5,FALSE)","v":"Suisse"},null,{"$f":"IF(OR(ISBLANK(RESULTATS!J33),ISBLANK(J33)),\"\",IF(AND('Pronostiqueur 3'!J33=RESULTATS!J33,'Pronostiqueur 3'!M33=RESULTATS!M33),3,IF(OR(AND('Pronostiqueur 3'!J33>'Pronostiqueur 3'!M33,RESULTATS!J33>RESULTATS!M33),AND('Pronostiqueur 3'!J33<'Pronostiqueur 3'!M33,RESULTATS!J33<RESULTATS!M33),AND('Pronostiqueur 3'!J33='Pronostiqueur 3'!M33,RESULTATS!J33=RESULTATS!M33)),1,0)))","v":""},null,null,null,{"$f":"INDEX($R84:$R87,MATCH(SMALL(COUNTIF($R84:$R87,\">=\"&$R84:$R87),ROW(INDIRECT(\"1:\"&ROWS($R84:$R87)))),COUNTIF($R84:$R87,\">=\"&$R84:$R87),0))","v":"00000Suisse"},{"$f":"INDEX($S84:$S87,MATCH(SMALL(COUNTIF($R84:$R87,\">=\"&$R84:$R87),ROW(INDIRECT(\"1:\"&ROWS($R84:$R87)))),COUNTIF($R84:$R87,\">=\"&$R84:$R87),0))","v":0},{"$f":"INDEX($T84:$T87,MATCH(SMALL(COUNTIF($R84:$R87,\">=\"&$R84:$R87),ROW(INDIRECT(\"1:\"&ROWS($R84:$R87)))),COUNTIF($R84:$R87,\">=\"&$R84:$R87),0))","v":1},{"$f":"INDEX($U84:$U87,MATCH(SMALL(COUNTIF($R84:$R87,\">=\"&$R84:$R87),ROW(INDIRECT(\"1:\"&ROWS($R84:$R87)))),COUNTIF($R84:$R87,\">=\"&$R84:$R87),0))","v":"Suisse"},{"$f":"SUMPRODUCT((Teams1=U33)*(Teams1_Score<>\"\"))+SUMPRODUCT((Teams2=U33)*(Teams2_Score<>\"\"))","v":0},{"$f":"SUMPRODUCT((Teams1=U33)*(Teams1_Score>Teams2_Score))+SUMPRODUCT((Teams2=U33)*(Teams2_Score>Teams1_Score))","v":0},{"$f":"SUMPRODUCT((Teams1=U33)*(Teams1_Score=Teams2_Score)*(Teams1_Score<>\"\"))+SUMPRODUCT((Teams2=U33)*(Teams2_Score=Teams1_Score)*(Teams2_Score<>\"\"))","v":0},{"$f":"SUMPRODUCT((Teams1=U33)*(Teams1_Score<Teams2_Score))+SUMPRODUCT((Teams2=U33)*(Teams2_Score<Teams1_Score))","v":0},{"$f":"SUMPRODUCT((Teams1=U33)*(Teams1_Score))+SUMPRODUCT((Teams2=U33)*(Teams2_Score))","v":0},{"$f":"SUMPRODUCT((Teams1=U33)*(Teams2_Score))+SUMPRODUCT((Teams2=U33)*(Teams1_Score))","v":0},{"$f":"Z33-AA33","v":0},{"$f":"3*W33+X33","v":0},null,null,"2018-07-10",1,{"$f":"+IF(AJ38<>\"\",IF(AI38>AO38,AH38,AN38),\"Vainqueur A\")","v":"Vainqueur A"},{"$f":"AJ33*10+AL33","v":0},null,{"$f":"IF(LEFT(AH33,5)<>\"Vainq\",COUNTIF(RESULTATS!$AG$18:$AM$19,AH33),0)","v":0},null,null,{"$f":"+IF(AJ40<>\"\",IF(AI40>AO40,AH40,AN40),\"Vainqueur C\")","v":"Vainqueur C"},{"$f":"AP33*10+AR33","v":0},null,{"$f":"IF(LEFT(AN33,5)<>\"Vainq\",COUNTIF(RESULTATS!$AG$18:$AM$19,AN33),0)","v":0}]
[null,{"$f":"VLOOKUP($D34,TABLEAU_MATCHS[#All],2,FALSE)","v":"2018-06-23"},{"$f":"VLOOKUP($D34,TABLEAU_MATCHS[#All],3,FALSE)","v":"18:00:00"},27,{"$f":"\"Groupe \"&VLOOKUP($I34,TABLEAU_TEAMS[[#All],[TEAM]:[GROUP_INITIAL_RANK]],2,FALSE)","v":"Groupe F"},1.1200000000000001,6.5,15,{"$f":"VLOOKUP($D34,TABLEAU_MATCHS[#All],4,FALSE)","v":"République de Corée"},null,null,{"$f":"VLOOKUP($D34,TABLEAU_MATCHS[#All],5,FALSE)","v":"Mexique"},null,{"$f":"IF(OR(ISBLANK(RESULTATS!J34),ISBLANK(J34)),\"\",IF(AND('Pronostiqueur 3'!J34=RESULTATS!J34,'Pronostiqueur 3'!M34=RESULTATS!M34),3,IF(OR(AND('Pronostiqueur 3'!J34>'Pronostiqueur 3'!M34,RESULTATS!J34>RESULTATS!M34),AND('Pronostiqueur 3'!J34<'Pronostiqueur 3'!M34,RESULTATS!J34<RESULTATS!M34),AND('Pronostiqueur 3'!J34='Pronostiqueur 3'!M34,RESULTATS!J34=RESULTATS!M34)),1,0)))","v":""},null,null,null,"00000Serbie",0,1,"Serbie",{"$f":"SUMPRODUCT((Teams1=U34)*(Teams1_Score<>\"\"))+SUMPRODUCT((Teams2=U34)*(Teams2_Score<>\"\"))","v":0},{"$f":"SUMPRODUCT((Teams1=U34)*(Teams1_Score>Teams2_Score))+SUMPRODUCT((Teams2=U34)*(Teams2_Score>Teams1_Score))","v":0},{"$f":"SUMPRODUCT((Teams1=U34)*(Teams1_Score=Teams2_Score)*(Teams1_Score<>\"\"))+SUMPRODUCT((Teams2=U34)*(Teams2_Score=Teams1_Score)*(Teams2_Score<>\"\"))","v":0},{"$f":"SUMPRODUCT((Teams1=U34)*(Teams1_Score<Teams2_Score))+SUMPRODUCT((Teams2=U34)*(Teams2_Score<Teams1_Score))","v":0},{"$f":"SUMPRODUCT((Teams1=U34)*(Teams1_Score))+SUMPRODUCT((Teams2=U34)*(Teams2_Score))","v":0},{"$f":"SUMPRODUCT((Teams1=U34)*(Teams2_Score))+SUMPRODUCT((Teams2=U34)*(Teams1_Score))","v":0},0,0,null,null,"2018-07-11",2,{"$f":"+IF(AJ39<>\"\",IF(AI39>AO39,AH39,AN39),\"Vainqueur B\")","v":"Vainqueur B"},0,null,{"$f":"IF(LEFT(AH34,5)<>\"Vainq\",COUNTIF(RESULTATS!$AG$18:$AM$19,AH34),0)","v":0},null,null,{"$f":"+IF(AJ41<>\"\",IF(AI41>AO41,AH41,AN41),\"Vainqueur D\")","v":"Vainqueur D"},0,null,{"$f":"IF(LEFT(AN34,5)<>\"Vainq\",COUNTIF(RESULTATS!$AG$18:$AM$19,AN34),0)","v":0}]
[null,{"$f":"VLOOKUP($D35,TABLEAU_MATCHS[#All],2,FALSE)","v":"2018-06-23"},{"$f":"VLOOKUP($D35,TABLEAU_MATCHS[#All],3,FALSE)","v":"21:00:00"},28,{"$f":"\"Groupe \"&VLOOKUP($I35,TABLEAU_TEAMS[[#All],[TEAM]:[GROUP_INITIAL_RANK]],2,FALSE)","v":"Groupe F"},2.8,2.95,2.4,{"$f":"VLOOKUP($D35,TABLEAU_MATCHS[#All],4,FALSE)","v":"Allemagne"},null,null,{"$f":"VLOOKUP($D35,TABLEAU_MATCHS[#All],5,FALSE)","v":"Suède"},null,{"$f":"IF(OR(ISBLANK(RESULTATS!J35),ISBLANK(J35)),\"\",IF(AND('Pronostiqueur 3'!J35=RESULTATS!J35,'Pronostiqueur 3'!M35=RESULTATS!M35),3,IF(OR(AND('Pronostiqueur 3'!J35>'Pronostiqueur 3'!M35,RESULTATS!J35>RESULTATS!M35),AND('Pronostiqueur 3'!J35<'Pronostiqueur 3'!M35,RESULTATS!J35<RESULTATS!M35),AND('Pronostiqueur 3'!J35='Pronostiqueur 3'!M35,RESULTATS!J35=RESULTATS!M35)),1,0)))","v":""},null,null,null,"00000Costa Rica",0,1,"Costa Rica",{"$f":"SUMPRODUCT((Teams1=U35)*(Teams1_Score<>\"\"))+SUMPRODUCT((Teams2=U35)*(Teams2_Score<>\"\"))","v":0},{"$f":"SUMPRODUCT((Teams1=U35)*(Teams1_Score>Teams2_Score))+SUMPRODUCT((Teams2=U35)*(Teams2_Score>Teams1_Score))","v":0},{"$f":"SUMPRODUCT((Teams1=U35)*(Teams1_Score=Teams2_Score)*(Teams1_Score<>\"\"))+SUMPRODUCT((Teams2=U35)*(Teams2_Score=Teams1_Score)*(Teams2_Score<>\"\"))","v":0},{"$f":"SUMPRODUCT((Teams1=U35)*(Teams1_Score<Teams2_Score))+SUMPRODUCT((Teams2=U35)*(Teams2_Score<Teams1_Score))","v":0},{"$f":"SUMPRODUCT((Teams1=U35)*(Teams1_Score))+SUMPRODUCT((Teams2=U35)*(Teams2_Score))","v":0},{"$f":"SUMPRODUCT((Teams1=U35)*(Teams2_Score))+SUMPRODUCT((Teams2=U35)*(Teams1_Score))","v":0},0,0,null,null,null,null,null,null,null,{"$f":"SUM(AK33:AK34)","v":0},null,null,null,null,null,{"$f":"SUM(AQ33:AQ34)","v":0}]
[null,{"$f":"VLOOKUP($D36,TABLEAU_MATCHS[#All],2,FALSE)","v":"2018-06-23"},{"$f":"VLOOKUP($D36,TABLEAU_MATCHS[#All],3,FALSE)","v":"15:00:00"},29,{"$f":"\"Groupe \"&VLOOKUP($I36,TABLEAU_TEAMS[[#All],[TEAM]:[GROUP_INITIAL_RANK]],2,FALSE)","v":"Groupe G"},1.36,4,7.5,{"$f":"VLOOKUP($D36,TABLEAU_MATCHS[#All],4,FALSE)","v":"Belgique"},null,null,{"$f":"VLOOKUP($D36,TABLEAU_MATCHS[#All],5,FALSE)","v":"Tunisie"},null,{"$f":"IF(OR(ISBLANK(RESULTATS!J36),ISBLANK(J36)),\"\",IF(AND('Pronostiqueur 3'!J36=RESULTATS!J36,'Pronostiqueur 3'!M36=RESULTATS!M36),3,IF(OR(AND('Pronostiqueur 3'!J36>'Pronostiqueur 3'!M36,RESULTATS!J36>RESULTATS!M36),AND('Pronostiqueur 3'!J36<'Pronostiqueur 3'!M36,RESULTATS!J36<RESULTATS!M36),AND('Pronostiqueur 3'!J36='Pronostiqueur 3'!M36,RESULTATS!J36=RESULTATS!M36)),1,0)))","v":""},null,null,null,"00000Brésil",0,1,"Brésil",{"$f":"SUMPRODUCT((Teams1=U36)*(Teams1_Score<>\"\"))+SUMPRODUCT((Teams2=U36)*(Teams2_Score<>\"\"))","v":0},{"$f":"SUMPRODUCT((Teams1=U36)*(Teams1_Score>Teams2_Score))+SUMPRODUCT((Teams2=U36)*(Teams2_Score>Teams1_Score))","v":0},{"$f":"SUMPRODUCT((Teams1=U36)*(Teams1_Score=Teams2_Score)*(Teams1_Score<>\"\"))+SUMPRODUCT((Teams2=U36)*(Teams2_Score=Teams1_Score)*(Teams2_Score<>\"\"))","v":0},{"$f":"SUMPRODUCT((Teams1=U36)*(Teams1_Score<Teams2_Score))+SUMPRODUCT((Teams2=U36)*(Teams2_Score<Teams1_Score))","v":0},{"$f":"SUMPRODUCT((Teams1=U36)*(Teams1_Score))+SUMPRODUCT((Teams2=U36)*(Teams2_Score))","v":0},{"$f":"SUMPRODUCT((Teams1=U36)*(Teams2_Score))+SUMPRODUCT((Teams2=U36)*(Teams1_Score))","v":0},0,0,null,null,"Date","Quart de Finale",null,null,"Buts",null,"Pen",null,null,null,"Buts",null,"Pen"]
[null,{"$f":"VLOOKUP($D37,TABLEAU_MATCHS[#All],2,FALSE)","v":"2018-06-24"},{"$f":"VLOOKUP($D37,TABLEAU_MATCHS[#All],3,FALSE)","v":"15:00:00"},30,{"$f":"\"Groupe \"&VLOOKUP($I37,TABLEAU_TEAMS[[#All],[TEAM]:[GROUP_INITIAL_RANK]],2,FALSE)","v":"Groupe G"},4.7,3.4,1.62,{"$f":"VLOOKUP($D37,TABLEAU_MATCHS[#All],4,FALSE)","v":"Angleterre"},null,null,{"$f":"VLOOKUP($D37,TABLEAU_MATCHS[#All],5,FALSE)","v":"Panama"},null,{"$f":"IF(OR(ISBLANK(RESULTATS!J37),ISBLANK(J37)),\"\",IF(AND('Pronostiqueur 3'!J37=RESULTATS!J37,'Pronostiqueur 3'!M37=RESULTATS!M37),3,IF(OR(AND('Pronostiqueur 3'!J37>'Pronostiqueur 3'!M37,RESULTATS!J37>RESULTATS!M37),AND('Pronostiqueur 3'!J37<'Pronostiqueur 3'!M37,RESULTATS!J37<RESULTATS!M37),AND('Pronostiqueur 3'!J37='Pronostiqueur 3'!M37,RESULTATS!J37=RESULTATS!M37)),1,0)))","v":""}]
[null,{"$f":"VLOOKUP($D38,TABLEAU_MATCHS[#All],2,FALSE)","v":"2018-06-24"},{"$f":"VLOOKUP($D38,TABLEAU_MATCHS[#All],3,FALSE)","v":"20:00:00"},31,{"$f":"\"Groupe \"&VLOOKUP($I38,TABLEAU_TEAMS[[#All],[TEAM]:[GROUP_INITIAL_RANK]],2,FALSE)","v":"Groupe H"},2.1,2.95,3.35,{"$f":"VLOOKUP($D38,TABLEAU_MATCHS[#All],4,FALSE)","v":"Japon"},null,null,{"$f":"VLOOKUP($D38,TABLEAU_MATCHS[#All],5,FALSE)","v":"Sénégal"},null,{"$f":"IF(OR(ISBLANK(RESULTATS!J38),ISBLANK(J38)),\"\",IF(AND('Pronostiqueur 3'!J38=RESULTATS!J38,'Pronostiqueur 3'!M38=RESULTATS!M38),3,IF(OR(AND('Pronostiqueur 3'!J38>'Pronostiqueur 3'!M38,RESULTATS!J38>RESULTATS!M38),AND('Pronostiqueur 3'!J38<'Pronostiqueur 3'!M38,RESULTATS!J38<RESULTATS!M38),AND('Pronostiqueur 3'!J38='Pronostiqueur 3'!M38,RESULTATS!J38=RESULTATS!M38)),1,0)))","v":""},null,null,null,null,null,"Rg","Groupe F","MJ","G","N","P","BP","BC","+/-","Pts",null,null,"2018-07-06","A",{"$f":"+IF(AJ45<>\"\",IF(AI45>AO45,AH45,AN45),\"Vainqueur 1\")","v":"Vainqueur 1"},{"$f":"AJ38*10+AL38","v":0},null,{"$f":"IF(LEFT(AH38,5)<>\"Vainq\",COUNTIF(RESULTATS!$AG$23:$AM$26,AH38),0)","v":0},null,null,{"$f":"+IF(AJ47<>\"\",IF(AI47>AO47,AH47,AN47),\"Vainqueur 3\")","v":"Vainqueur 3"},{"$f":"AP38*10+AR38","v":0},null,{"$f":"IF(LEFT(AN38,5)<>\"Vainq\",COUNTIF(RESULTATS!$AG$23:$AM$26,AN38),0)","v":0}]
[null,{"$f":"VLOOKUP($D39,TABLEAU_MATCHS[#All],2,FALSE)","v":"2018-06-24"},{"$f":"VLOOKUP($D39,TABLEAU_MATCHS[#All],3,FALSE)","v":"21:00:00"},32,{"$f":"\"Groupe \"&VLOOKUP($I39,TABLEAU_TEAMS[[#All],[TEAM]:[GROUP_INITIAL_RANK]],2,FALSE)","v":"Groupe H"},1.9,3,3.8,{"$f":"VLOOKUP($D39,TABLEAU_MATCHS[#All],4,FALSE)","v":"Pologne"},null,null,{"$f":"VLOOKUP($D39,TABLEAU_MATCHS[#All],5,FALSE)","v":"Colombie"},null,{"$f":"IF(OR(ISBLANK(RESULTATS!J39),ISBLANK(J39)),\"\",IF(AND('Pronostiqueur 3'!J39=RESULTATS!J39,'Pronostiqueur 3'!M39=RESULTATS!M39),3,IF(OR(AND('Pronostiqueur 3'!J39>'Pronostiqueur 3'!M39,RESULTATS!J39>RESULTATS!M39),AND('Pronostiqueur 3'!J39<'Pronostiqueur 3'!M39,RESULTATS!J39<RESULTATS!M39),AND('Pronostiqueur 3'!J39='Pronostiqueur 3'!M39,RESULTATS!J39=RESULTATS!M39)),1,0)))","v":""},null,null,null,{"$f":"INDEX($R90:$R93,MATCH(SMALL(COUNTIF($R90:$R93,\">=\"&$R90:$R93),ROW(INDIRECT(\"1:\"&ROWS($R90:$R93)))),COUNTIF($R90:$R93,\">=\"&$R90:$R93),0))","v":"00000Suède"},{"$f":"INDEX($S90:$S93,MATCH(SMALL(COUNTIF($R90:$R93,\">=\"&$R90:$R93),ROW(INDIRECT(\"1:\"&ROWS($R90:$R93)))),COUNTIF($R90:$R93,\">=\"&$R90:$R93),0))","v":0},{"$f":"INDEX($T90:$T93,MATCH(SMALL(COUNTIF($R90:$R93,\">=\"&$R90:$R93),ROW(INDIRECT(\"1:\"&ROWS($R90:$R93)))),COUNTIF($R90:$R93,\">=\"&$R90:$R93),0))","v":1},{"$f":"INDEX($U90:$U93,MATCH(SMALL(COUNTIF($R90:$R93,\">=\"&$R90:$R93),ROW(INDIRECT(\"1:\"&ROWS($R90:$R93)))),COUNTIF($R90:$R93,\">=\"&$R90:$R93),0))","v":"Suède"},{"$f":"SUMPRODUCT((Teams1=U39)*(Teams1_Score<>\"\"))+SUMPRODUCT((Teams2=U39)*(Teams2_Score<>\"\"))","v":0},{"$f":"SUMPRODUCT((Teams1=U39)*(Teams1_Score>Teams2_Score))+SUMPRODUCT((Teams2=U39)*(Teams2_Score>Teams1_Score))","v":0},{"$f":"SUMPRODUCT((Teams1=U39)*(Teams1_Score=Teams2_Score)*(Teams1_Score<>\"\"))+SUMPRODUCT((Teams2=U39)*(Teams2_Score=Teams1_Score)*(Teams2_Score<>\"\"))","v":0},{"$f":"SUMPRODUCT((Teams1=U39)*(Teams1_Score<Teams2_Score))+SUMPRODUCT((Teams2=U39)*(Teams2_Score<Teams1_Score))","v":0},{"$f":"SUMPRODUCT((Teams1=U39)*(Teams1_Score))+SUMPRODUCT((Teams2=U39)*(Teams2_Score))","v":0},{"$f":"SUMPRODUCT((Teams1=U39)*(Teams2_Score))+SUMPRODUCT((Teams2=U39)*(Teams1_Score))","v":0},{"$f":"Z39-AA39","v":0},{"$f":"3*W39+X39","v":0},null,null,"2018-07-07","B",{"$f":"+IF(AJ46<>\"\",IF(AI46>AO46,AH46,AN46),\"Vainqueur 2\")","v":"Vainqueur 2"},0,null,{"$f":"IF(LEFT(AH39,5)<>\"Vainq\",COUNTIF(RESULTATS!$AG$23:$AM$26,AH39),0)","v":0},null,null,{"$f":"+IF(AJ48<>\"\",IF(AI48>AO48,AH48,AN48),\"Vainqueur 4\")","v":"Vainqueur 4"},0,null,{"$f":"IF(LEFT(AN39,5)<>\"Vainq\",COUNTIF(RESULTATS!$AG$23:$AM$26,AN39),0)","v":0}]
[null,{"$f":"VLOOKUP($D40,TABLEAU_MATCHS[#All],2,FALSE)","v":"2018-06-25"},{"$f":"VLOOKUP($D40,TABLEAU_MATCHS[#All],3,FALSE)","v":"18:00:00"},33,{"$f":"\"Groupe \"&VLOOKUP($I40,TABLEAU_TEAMS[[#All],[TEAM]:[GROUP_INITIAL_RANK]],2,FALSE)","v":"Groupe A"},11,6.5,1.17,{"$f":"VLOOKUP($D40,TABLEAU_MATCHS[#All],4,FALSE)","v":"Uruguay"},null,null,{"$f":"VLOOKUP($D40,TABLEAU_MATCHS[#All],5,FALSE)","v":"Russie"},null,{"$f":"IF(OR(ISBLANK(RESULTATS!J40),ISBLANK(J40)),\"\",IF(AND('Pronostiqueur 3'!J40=RESULTATS!J40,'Pronostiqueur 3'!M40=RESULTATS!M40),3,IF(OR(AND('Pronostiqueur 3'!J40>'Pronostiqueur 3'!M40,RESULTATS!J40>RESULTATS!M40),AND('Pronostiqueur 3'!J40<'Pronostiqueur 3'!M40,RESULTATS!J40<RESULTATS!M40),AND('Pronostiqueur 3'!J40='Pronostiqueur 3'!M40,RESULTATS!J40=RESULTATS!M40)),1,0)))","v":""},null,null,null,"00000République de Corée",0,1,"République de Corée",{"$f":"SUMPRODUCT((Teams1=U40)*(Teams1_Score<>\"\"))+SUMPRODUCT((Teams2=U40)*(Teams2_Score<>\"\"))","v":0},{"$f":"SUMPRODUCT((Teams1=U40)*(Teams1_Score>Teams2_Score))+SUMPRODUCT((Teams2=U40)*(Teams2_Score>Teams1_Score))","v":0},{"$f":"SUMPRODUCT((Teams1=U40)*(Teams1_Score=Teams2_Score)*(Teams1_Score<>\"\"))+SUMPRODUCT((Teams2=U40)*(Teams2_Score=Teams1_Score)*(Teams2_Score<>\"\"))","v":0},{"$f":"SUMPRODUCT((Teams1=U40)*(Teams1_Score<Teams2_Score))+SUMPRODUCT((Teams2=U40)*(Teams2_Score<Teams1_Score))","v":0},{"$f":"SUMPRODUCT((Teams1=U40)*(Teams1_Score))+SUMPRODUCT((Teams2=U40)*(Teams2_Score))","v":0},{"$f":"SUMPRODUCT((Teams1=U40)*(Teams2_Score))+SUMPRODUCT((Teams2=U40)*(Teams1_Score))","v":0},0,0,null,null,"2018-07-06","C",{"$f":"+IF(AJ49<>\"\",IF(AI49>AO49,AH49,AN49),\"Vainqueur 5\")","v":"Vainqueur 5"},0,null,{"$f":"IF(LEFT(AH40,5)<>\"Vainq\",COUNTIF(RESULTATS!$AG$23:$AM$26,AH40),0)","v":0},null,null,{"$f":"+IF(AJ51<>\"\",IF(AI51>AO51,AH51,AN51),\"Vainqueur 7\")","v":"Vainqueur 7"},0,null,{"$f":"IF(LEFT(AN40,5)<>\"Vainq\",COUNTIF(RESULTATS!$AG$23:$AM$26,AN40),0)","v":0}]
[null,{"$f":"VLOOKUP($D41,TABLEAU_MATCHS[#All],2,FALSE)","v":"2018-06-25"},{"$f":"VLOOKUP($D41,TABLEAU_MATCHS[#All],3,FALSE)","v":"17:00:00"},34,{"$f":"\"Groupe \"&VLOOKUP($I41,TABLEAU_TEAMS[[#All],[TEAM]:[GROUP_INITIAL_RANK]],2,FALSE)","v":"Groupe A"},2.4,2.95,2.75,{"$f":"VLOOKUP($D41,TABLEAU_MATCHS[#All],4,FALSE)","v":"Arabie Saoudite"},null,null,{"$f":"VLOOKUP($D41,TABLEAU_MATCHS[#All],5,FALSE)","v":"Egypte"},null,{"$f":"IF(OR(ISBLANK(RESULTATS!J41),ISBLANK(J41)),\"\",IF(AND('Pronostiqueur 3'!J41=RESULTATS!J41,'Pronostiqueur 3'!M41=RESULTATS!M41),3,IF(OR(AND('Pronostiqueur 3'!J41>'Pronostiqueur 3'!M41,RESULTATS!J41>RESULTATS!M41),AND('Pronostiqueur 3'!J41<'Pronostiqueur 3'!M41,RESULTATS!J41<RESULTATS!M41),AND('Pronostiqueur 3'!J41='Pronostiqueur 3'!M41,RESULTATS!J41=RESULTATS!M41)),1,0)))","v":""},null,null,null,"00000Mexique",0,1,"Mexique",{"$f":"SUMPRODUCT((Teams1=U41)*(Teams1_Score<>\"\"))+SUMPRODUCT((Teams2=U41)*(Teams2_Score<>\"\"))","v":0},{"$f":"SUMPRODUCT((Teams1=U41)*(Teams1_Score>Teams2_Score))+SUMPRODUCT((Teams2=U41)*(Teams2_Score>Teams1_Score))","v":0},{"$f":"SUMPRODUCT((Teams1=U41)*(Teams1_Score=Teams2_Score)*(Teams1_Score<>\"\"))+SUMPRODUCT((Teams2=U41)*(Teams2_Score=Teams1_Score)*(Teams2_Score<>\"\"))","v":0},{"$f":"SUMPRODUCT((Teams1=U41)*(Teams1_Score<Teams2_Score))+SUMPRODUCT((Teams2=U41)*(Teams2_Score<Teams1_Score))","v":0},{"$f":"SUMPRODUCT((Teams1=U41)*(Teams1_Score))+SUMPRODUCT((Teams2=U41)*(Teams2_Score))","v":0},{"$f":"SUMPRODUCT((Teams1=U41)*(Teams2_Score))+SUMPRODUCT((Teams2=U41)*(Teams1_Score))","v":0},0,0,null,null,"2018-07-07","D",{"$f":"+IF(AJ50<>\"\",IF(AI50>AO50,AH50,AN50),\"Vainqueur 6\")","v":"Vainqueur 6"},0,null,{"$f":"IF(LEFT(AH41,5)<>\"Vainq\",COUNTIF(RESULTATS!$AG$23:$AM$26,AH41),0)","v":0},null,null,{"$f":"+IF(AJ52<>\"\",IF(AI52>AO52,AH52,AN52),\"Vainqueur 8\")","v":"Vainqueur 8"},0,null,{"$f":"IF(LEFT(AN41,5)<>\"Vainq\",COUNTIF(RESULTATS!$AG$23:$AM$26,AN41),0)","v":0}]
[null,{"$f":"VLOOKUP($D42,TABLEAU_MATCHS[#All],2,FALSE)","v":"2018-06-25"},{"$f":"VLOOKUP($D42,TABLEAU_MATCHS[#All],3,FALSE)","v":"21:00:00"},35,{"$f":"\"Groupe \"&VLOOKUP($I42,TABLEAU_TEAMS[[#All],[TEAM]:[GROUP_INITIAL_RANK]],2,FALSE)","v":"Groupe B"},13,6.5,1.1399999999999999,{"$f":"VLOOKUP($D42,TABLEAU_MATCHS[#All],4,FALSE)","v":"RI Iran"},null,null,{"$f":"VLOOKUP($D42,TABLEAU_MATCHS[#All],5,FALSE)","v":"Portugal"},null,{"$f":"IF(OR(ISBLANK(RESULTATS!J42),ISBLANK(J42)),\"\",IF(AND('Pronostiqueur 3'!J42=RESULTATS!J42,'Pronostiqueur 3'!M42=RESULTATS!M42),3,IF(OR(AND('Pronostiqueur 3'!J42>'Pronostiqueur 3'!M42,RESULTATS!J42>RESULTATS!M42),AND('Pronostiqueur 3'!J42<'Pronostiqueur 3'!M42,RESULTATS!J42<RESULTATS!M42),AND('Pronostiqueur 3'!J42='Pronostiqueur 3'!M42,RESULTATS!J42=RESULTATS!M42)),1,0)))","v":""},null,null,null,"00000Allemagne",0,1,"Allemagne",{"$f":"SUMPRODUCT((Teams1=U42)*(Teams1_Score<>\"\"))+SUMPRODUCT((Teams2=U42)*(Teams2_Score<>\"\"))","v":0},{"$f":"SUMPRODUCT((Teams1=U42)*(Teams1_Score>Teams2_Score))+SUMPRODUCT((Teams2=U42)*(Teams2_Score>Teams1_Score))","v":0},{"$f":"SUMPRODUCT((Teams1=U42)*(Teams1_Score=Teams2_Score)*(Teams1_Score<>\"\"))+SUMPRODUCT((Teams2=U42)*(Teams2_Score=Teams1_Score)*(Teams2_Score<>\"\"))","v":0},{"$f":"SUMPRODUCT((Teams1=U42)*(Teams1_Score<Teams2_Score))+SUMPRODUCT((Teams2=U42)*(Teams2_Score<Teams1_Score))","v":0},{"$f":"SUMPRODUCT((Teams1=U42)*(Teams1_Score))+SUMPRODUCT((Teams2=U42)*(Teams2_Score))","v":0},{"$f":"SUMPRODUCT((Teams1=U42)*(Teams2_Score))+SUMPRODUCT((Teams2=U42)*(Teams1_Score))","v":0},0,0,null,null,null,null,null,null,null,{"$f":"SUM(AK38:AK41)","v":0},null,null,null,null,null,{"$f":"SUM(AQ38:AQ41)","v":0}]
[null,{"$f":"VLOOKUP($D43,TABLEAU_MATCHS[#All],2,FALSE)","v":"2018-06-25"},{"$f":"VLOOKUP($D43,TABLEAU_MATCHS[#All],3,FALSE)","v":"20:00:00"},36,{"$f":"\"Groupe \"&VLOOKUP($I43,TABLEAU_TEAMS[[#All],[TEAM]:[GROUP_INITIAL_RANK]],2,FALSE)","v":"Groupe B"},2.25,3.1,2.95,{"$f":"VLOOKUP($D43,TABLEAU_MATCHS[#All],4,FALSE)","v":"Espagne"},null,null,{"$f":"VLOOKUP($D43,TABLEAU_MATCHS[#All],5,FALSE)","v":"Maroc"},null,{"$f":"IF(OR(ISBLANK(RESULTATS!J43),ISBLANK(J43)),\"\",IF(AND('Pronostiqueur 3'!J43=RESULTATS!J43,'Pronostiqueur 3'!M43=RESULTATS!M43),3,IF(OR(AND('Pronostiqueur 3'!J43>'Pronostiqueur 3'!M43,RESULTATS!J43>RESULTATS!M43),AND('Pronostiqueur 3'!J43<'Pronostiqueur 3'!M43,RESULTATS!J43<RESULTATS!M43),AND('Pronostiqueur 3'!J43='Pronostiqueur 3'!M43,RESULTATS!J43=RESULTATS!M43)),1,0)))","v":""},null,null,null,null,null,null,null,null,null,null,null,null,null,null,null,null,null,"Date","Huitième de Finale",null,null,"Buts",null,"Pen",null,null,null,"Buts",null,"Pen"]
[null,{"$f":"VLOOKUP($D44,TABLEAU_MATCHS[#All],2,FALSE)","v":"2018-06-26"},{"$f":"VLOOKUP($D44,TABLEAU_MATCHS[#All],3,FALSE)","v":"17:00:00"},37,{"$f":"\"Groupe \"&VLOOKUP($I44,TABLEAU_TEAMS[[#All],[TEAM]:[GROUP_INITIAL_RANK]],2,FALSE)","v":"Groupe C"},4.3,3.25,1.76,{"$f":"VLOOKUP($D44,TABLEAU_MATCHS[#All],4,FALSE)","v":"Danemark"},null,null,{"$f":"VLOOKUP($D44,TABLEAU_MATCHS[#All],5,FALSE)","v":"France"},null,{"$f":"IF(OR(ISBLANK(RESULTATS!J44),ISBLANK(J44)),\"\",IF(AND('Pronostiqueur 3'!J44=RESULTATS!J44,'Pronostiqueur 3'!M44=RESULTATS!M44),3,IF(OR(AND('Pronostiqueur 3'!J44>'Pronostiqueur 3'!M44,RESULTATS!J44>RESULTATS!M44),AND('Pronostiqueur 3'!J44<'Pronostiqueur 3'!M44,RESULTATS!J44<RESULTATS!M44),AND('Pronostiqueur 3'!J44='Pronostiqueur 3'!M44,RESULTATS!J44=RESULTATS!M44)),1,0)))","v":""},null,null,null,null,null,"Rg","Groupe G","MJ","G","N","P","BP","BC","+/-","Pts"]
[null,{"$f":"VLOOKUP($D45,TABLEAU_MATCHS[#All],2,FALSE)","v":"2018-06-26"},{"$f":"VLOOKUP($D45,TABLEAU_MATCHS[#All],3,FALSE)","v":"17:00:00"},38,{"$f":"\"Groupe \"&VLOOKUP($I45,TABLEAU_TEAMS[[#All],[TEAM]:[GROUP_INITIAL_RANK]],2,FALSE)","v":"Groupe C"},3.05,3,2.25,{"$f":"VLOOKUP($D45,TABLEAU_MATCHS[#All],4,FALSE)","v":"Australie"},null,null,{"$f":"VLOOKUP($D45,TABLEAU_MATCHS[#All],5,FALSE)","v":"Pérou"},null,{"$f":"IF(OR(ISBLANK(RESULTATS!J45),ISBLANK(J45)),\"\",IF(AND('Pronostiqueur 3'!J45=RESULTATS!J45,'Pronostiqueur 3'!M45=RESULTATS!M45),3,IF(OR(AND('Pronostiqueur 3'!J45>'Pronostiqueur 3'!M45,RESULTATS!J45>RESULTATS!M45),AND('Pronostiqueur 3'!J45<'Pronostiqueur 3'!M45,RESULTATS!J45<RESULTATS!M45),AND('Pronostiqueur 3'!J45='Pronostiqueur 3'!M45,RESULTATS!J45=RESULTATS!M45)),1,0)))","v":""},null,null,null,{"$f":"INDEX($R96:$R99,MATCH(SMALL(COUNTIF($R96:$R99,\">=\"&$R96:$R99),ROW(INDIRECT(\"1:\"&ROWS($R96:$R99)))),COUNTIF($R96:$R99,\">=\"&$R96:$R99),0))","v":"00000Tunisie"},{"$f":"INDEX($S96:$S99,MATCH(SMALL(COUNTIF($R96:$R99,\">=\"&$R96:$R99),ROW(INDIRECT(\"1:\"&ROWS($R96:$R99)))),COUNTIF($R96:$R99,\">=\"&$R96:$R99),0))","v":0},{"$f":"INDEX($T96:$T99,MATCH(SMALL(COUNTIF($R96:$R99,\">=\"&$R96:$R99),ROW(INDIRECT(\"1:\"&ROWS($R96:$R99)))),COUNTIF($R96:$R99,\">=\"&$R96:$R99),0))","v":1},{"$f":"INDEX($U96:$U99,MATCH(SMALL(COUNTIF($R96:$R99,\">=\"&$R96:$R99),ROW(INDIRECT(\"1:\"&ROWS($R96:$R99)))),COUNTIF($R96:$R99,\">=\"&$R96:$R99),0))","v":"Tunisie"},{"$f":"SUMPRODUCT((Teams1=U45)*(Teams1_Score<>\"\"))+SUMPRODUCT((Teams2=U45)*(Teams2_Score<>\"\"))","v":0},{"$f":"SUMPRODUCT((Teams1=U45)*(Teams1_Score>Teams2_Score))+SUMPRODUCT((Teams2=U45)*(Teams2_Score>Teams1_Score))","v":0},{"$f":"SUMPRODUCT((Teams1=U45)*(Teams1_Score=Teams2_Score)*(Teams1_Score<>\"\"))+SUMPRODUCT((Teams2=U45)*(Teams2_Score=Teams1_Score)*(Teams2_Score<>\"\"))","v":0},{"$f":"SUMPRODUCT((Teams1=U45)*(Teams1_Score<Teams2_Score))+SUMPRODUCT((Teams2=U45)*(Teams2_Score<Teams1_Score))","v":0},{"$f":"SUMPRODUCT((Teams1=U45)*(Teams1_Score))+SUMPRODUCT((Teams2=U45)*(Teams2_Score))","v":0},{"$f":"SUMPRODUCT((Teams1=U45)*(Teams2_Score))+SUMPRODUCT((Teams2=U45)*(Teams1_Score))","v":0},{"$f":"Z45-AA45","v":0},{"$f":"3*W45+X45","v":0},null,null,"2018-06-30",1,{"$f":"IF(SUM(V9:V12)=0,\"1er Groupe A\",IF(COUNTIF(T9:T12,1)=1,VLOOKUP(1,T9:U12,2,FALSE),IF(COUNTIF(T9:T12,1)>=2,\"Tirage au Sort A1\")))","v":"1er Groupe A"},{"$f":"AJ45*10+AL45","v":0},null,{"$f":"IF(AND(LEFT(AH45,3)<>\"1er\",LEFT(AH45,3)<>\"2nd\"),COUNTIF(RESULTATS!$AG$30:$AM$37,AH45),0)","v":0},null,null,{"$f":"IF(SUM(V15:V18)=0,\"2nd Groupe B\",IF(OR(COUNTIF(T15:T18,1)>1,COUNTIF(T15:T18,2)>1),\"Tirage au sort B2\",VLOOKUP(2,T15:U18,2,FALSE)))","v":"2nd Groupe B"},{"$f":"AP45*10+AR45","v":0},null,{"$f":"IF(AND(LEFT(AN45,3)<>\"1er\",LEFT(AN45,3)<>\"2nd\"),COUNTIF(RESULTATS!$AG$30:$AM$37,AN45),0)","v":0}]
[null,{"$f":"VLOOKUP($D46,TABLEAU_MATCHS[#All],2,FALSE)","v":"2018-06-26"},{"$f":"VLOOKUP($D46,TABLEAU_MATCHS[#All],3,FALSE)","v":"21:00:00"},39,{"$f":"\"Groupe \"&VLOOKUP($I46,TABLEAU_TEAMS[[#All],[TEAM]:[GROUP_INITIAL_RANK]],2,FALSE)","v":"Groupe D"},2.4,2.9,2.85,{"$f":"VLOOKUP($D46,TABLEAU_MATCHS[#All],4,FALSE)","v":"Nigeria"},null,null,{"$f":"VLOOKUP($D46,TABLEAU_MATCHS[#All],5,FALSE)","v":"Argentine"},null,{"$f":"IF(OR(ISBLANK(RESULTATS!J46),ISBLANK(J46)),\"\",IF(AND('Pronostiqueur 3'!J46=RESULTATS!J46,'Pronostiqueur 3'!M46=RESULTATS!M46),3,IF(OR(AND('Pronostiqueur 3'!J46>'Pronostiqueur 3'!M46,RESULTATS!J46>RESULTATS!M46),AND('Pronostiqueur 3'!J46<'Pronostiqueur 3'!M46,RESULTATS!J46<RESULTATS!M46),AND('Pronostiqueur 3'!J46='Pronostiqueur 3'!M46,RESULTATS!J46=RESULTATS!M46)),1,0)))","v":""},null,null,null,"00000Panama",0,1,"Panama",{"$f":"SUMPRODUCT((Teams1=U46)*(Teams1_Score<>\"\"))+SUMPRODUCT((Teams2=U46)*(Teams2_Score<>\"\"))","v":0},{"$f":"SUMPRODUCT((Teams1=U46)*(Teams1_Score>Teams2_Score))+SUMPRODUCT((Teams2=U46)*(Teams2_Score>Teams1_Score))","v":0},{"$f":"SUMPRODUCT((Teams1=U46)*(Teams1_Score=Teams2_Score)*(Teams1_Score<>\"\"))+SUMPRODUCT((Teams2=U46)*(Teams2_Score=Teams1_Score)*(Teams2_Score<>\"\"))","v":0},{"$f":"SUMPRODUCT((Teams1=U46)*(Teams1_Score<Teams2_Score))+SUMPRODUCT((Teams2=U46)*(Teams2_Score<Teams1_Score))","v":0},{"$f":"SUMPRODUCT((Teams1=U46)*(Teams1_Score))+SUMPRODUCT((Teams2=U46)*(Teams2_Score))","v":0},{"$f":"SUMPRODUCT((Teams1=U46)*(Teams2_Score))+SUMPRODUCT((Teams2=U46)*(Teams1_Score))","v":0},0,0,null,null,"2018-07-01",2,{"$f":"IF(SUM(V15:V18)=0,\"1er Groupe B\",IF(COUNTIF(T15:T18,1)=1,VLOOKUP(1,T15:U18,2,FALSE),IF(COUNTIF(T15:T18,1)>=2,\"Tirage au Sort B1\")))","v":"1er Groupe B"},{"$f":"AJ46*10+AL46","v":0},null,{"$f":"IF(AND(LEFT(AH46,3)<>\"1er\",LEFT(AH46,3)<>\"2nd\"),COUNTIF(RESULTATS!$AG$30:$AM$37,AH46),0)","v":0},null,null,{"$f":"IF(SUM(V9:V12)=0,\"2nd Groupe A\",IF(OR(COUNTIF(T9:T12,1)>1,COUNTIF(T9:T12,2)>1),\"Tirage au sort A2\",VLOOKUP(2,T9:U12,2,FALSE)))","v":"2nd Groupe A"},0,null,{"$f":"IF(AND(LEFT(AN46,3)<>\"1er\",LEFT(AN46,3)<>\"2nd\"),COUNTIF(RESULTATS!$AG$30:$AM$37,AN46),0)","v":0}]
[null,{"$f":"VLOOKUP($D47,TABLEAU_MATCHS[#All],2,FALSE)","v":"2018-06-26"},{"$f":"VLOOKUP($D47,TABLEAU_MATCHS[#All],3,FALSE)","v":"21:00:00"},40,{"$f":"\"Groupe \"&VLOOKUP($I47,TABLEAU_TEAMS[[#All],[TEAM]:[GROUP_INITIAL_RANK]],2,FALSE)","v":"Groupe D"},6.5,3.7,1.44,{"$f":"VLOOKUP($D47,TABLEAU_MATCHS[#All],4,FALSE)","v":"Islande"},null,null,{"$f":"VLOOKUP($D47,TABLEAU_MATCHS[#All],5,FALSE)","v":"Croatie"},null,{"$f":"IF(OR(ISBLANK(RESULTATS!J47),ISBLANK(J47)),\"\",IF(AND('Pronostiqueur 3'!J47=RESULTATS!J47,'Pronostiqueur 3'!M47=RESULTATS!M47),3,IF(OR(AND('Pronostiqueur 3'!J47>'Pronostiqueur 3'!M47,RESULTATS!J47>RESULTATS!M47),AND('Pronostiqueur 3'!J47<'Pronostiqueur 3'!M47,RESULTATS!J47<RESULTATS!M47),AND('Pronostiqueur 3'!J47='Pronostiqueur 3'!M47,RESULTATS!J47=RESULTATS!M47)),1,0)))","v":""},null,null,null,"00000Belgique",0,1,"Belgique",{"$f":"SUMPRODUCT((Teams1=U47)*(Teams1_Score<>\"\"))+SUMPRODUCT((Teams2=U47)*(Teams2_Score<>\"\"))","v":0},{"$f":"SUMPRODUCT((Teams1=U47)*(Teams1_Score>Teams2_Score))+SUMPRODUCT((Teams2=U47)*(Teams2_Score>Teams1_Score))","v":0},{"$f":"SUMPRODUCT((Teams1=U47)*(Teams1_Score=Teams2_Score)*(Teams1_Score<>\"\"))+SUMPRODUCT((Teams2=U47)*(Teams2_Score=Teams1_Score)*(Teams2_Score<>\"\"))","v":0},{"$f":"SUMPRODUCT((Teams1=U47)*(Teams1_Score<Teams2_Score))+SUMPRODUCT((Teams2=U47)*(Teams2_Score<Teams1_Score))","v":0},{"$f":"SUMPRODUCT((Teams1=U47)*(Teams1_Score))+SUMPRODUCT((Teams2=U47)*(Teams2_Score))","v":0},{"$f":"SUMPRODUCT((Teams1=U47)*(Teams2_Score))+SUMPRODUCT((Teams2=U47)*(Teams1_Score))","v":0},0,0,null,null,"2017-06-30",3,{"$f":"IF(SUM(V21:V24)=0,\"1er Groupe C\",IF(COUNTIF(T21:T24,1)=1,VLOOKUP(1,T21:U24,2,FALSE),IF(COUNTIF(T21:T24,1)>=2,\"Tirage au Sort C1\")))","v":"1er Groupe C"},0,null,{"$f":"IF(AND(LEFT(AH47,3)<>\"1er\",LEFT(AH47,3)<>\"2nd\"),COUNTIF(RESULTATS!$AG$30:$AM$37,AH47),0)","v":0},null,null,{"$f":"IF(SUM(V27:V30)=0,\"2nd Groupe D\",IF(OR(COUNTIF(T27:T30,1)>1,COUNTIF(T27:T30,2)>1),\"Tirage au sort D2\",VLOOKUP(2,T27:U30,2,FALSE)))","v":"2nd Groupe D"},0,null,{"$f":"IF(AND(LEFT(AN47,3)<>\"1er\",LEFT(AN47,3)<>\"2nd\"),COUNTIF(RESULTATS!$AG$30:$AM$37,AN47),0)","v":0}]
[null,{"$f":"VLOOKUP($D48,TABLEAU_MATCHS[#All],2,FALSE)","v":"2018-06-27"},{"$f":"VLOOKUP($D48,TABLEAU_MATCHS[#All],3,FALSE)","v":"21:00:00"},41,{"$f":"\"Groupe \"&VLOOKUP($I48,TABLEAU_TEAMS[[#All],[TEAM]:[GROUP_INITIAL_RANK]],2,FALSE)","v":"Groupe E"},6.5,3.5,1.48,{"$f":"VLOOKUP($D48,TABLEAU_MATCHS[#All],4,FALSE)","v":"Serbie"},null,null,{"$f":"VLOOKUP($D48,TABLEAU_MATCHS[#All],5,FALSE)","v":"Brésil"},null,{"$f":"IF(OR(ISBLANK(RESULTATS!J48),ISBLANK(J48)),\"\",IF(AND('Pronostiqueur 3'!J48=RESULTATS!J48,'Pronostiqueur 3'!M48=RESULTATS!M48),3,IF(OR(AND('Pronostiqueur 3'!J48>'Pronostiqueur 3'!M48,RESULTATS!J48>RESULTATS!M48),AND('Pronostiqueur 3'!J48<'Pronostiqueur 3'!M48,RESULTATS!J48<RESULTATS!M48),AND('Pronostiqueur 3'!J48='Pronostiqueur 3'!M48,RESULTATS!J48=RESULTATS!M48)),1,0)))","v":""},null,null,null,"00000Angleterre",0,1,"Angleterre",{"$f":"SUMPRODUCT((Teams1=U48)*(Teams1_Score<>\"\"))+SUMPRODUCT((Teams2=U48)*(Teams2_Score<>\"\"))","v":0},{"$f":"SUMPRODUCT((Teams1=U48)*(Teams1_Score>Teams2_Score))+SUMPRODUCT((Teams2=U48)*(Teams2_Score>Teams1_Score))","v":0},{"$f":"SUMPRODUCT((Teams1=U48)*(Teams1_Score=Teams2_Score)*(Teams1_Score<>\"\"))+SUMPRODUCT((Teams2=U48)*(Teams2_Score=Teams1_Score)*(Teams2_Score<>\"\"))","v":0},{"$f":"SUMPRODUCT((Teams1=U48)*(Teams1_Score<Teams2_Score))+SUMPRODUCT((Teams2=U48)*(Teams2_Score<Teams1_Score))","v":0},{"$f":"SUMPRODUCT((Teams1=U48)*(Teams1_Score))+SUMPRODUCT((Teams2=U48)*(Teams2_Score))","v":0},{"$f":"SUMPRODUCT((Teams1=U48)*(Teams2_Score))+SUMPRODUCT((Teams2=U48)*(Teams1_Score))","v":0},0,0,null,null,"2018-07-01",4,{"$f":"IF(SUM(V27:V30)=0,\"1er Groupe D\",IF(COUNTIF(T27:T30,1)=1,VLOOKUP(1,T27:U30,2,FALSE),IF(COUNTIF(T27:T30,1)>=2,\"Tirage au Sort D1\")))","v":"1er Groupe D"},0,null,{"$f":"IF(AND(LEFT(AH48,3)<>\"1er\",LEFT(AH48,3)<>\"2nd\"),COUNTIF(RESULTATS!$AG$30:$AM$37,AH48),0)","v":0},null,null,{"$f":"IF(SUM(V21:V24)=0,\"2nd Groupe C\",IF(OR(COUNTIF(T21:T24,1)>1,COUNTIF(T21:T24,2)>1),\"Tirage au sort C2\",VLOOKUP(2,T21:U24,2,FALSE)))","v":"2nd Groupe C"},0,null,{"$f":"IF(AND(LEFT(AN48,3)<>\"1er\",LEFT(AN48,3)<>\"2nd\"),COUNTIF(RESULTATS!$AG$30:$AM$37,AN48),0)","v":0}]
[null,{"$f":"VLOOKUP($D49,TABLEAU_MATCHS[#All],2,FALSE)","v":"2018-06-27"},{"$f":"VLOOKUP($D49,TABLEAU_MATCHS[#All],3,FALSE)","v":"21:00:00"},42,{"$f":"\"Groupe \"&VLOOKUP($I49,TABLEAU_TEAMS[[#All],[TEAM]:[GROUP_INITIAL_RANK]],2,FALSE)","v":"Groupe E"},4,3.05,1.9,{"$f":"VLOOKUP($D49,TABLEAU_MATCHS[#All],4,FALSE)","v":"Suisse"},null,null,{"$f":"VLOOKUP($D49,TABLEAU_MATCHS[#All],5,FALSE)","v":"Costa Rica"},null,{"$f":"IF(OR(ISBLANK(RESULTATS!J49),ISBLANK(J49)),\"\",IF(AND('Pronostiqueur 3'!J49=RESULTATS!J49,'Pronostiqueur 3'!M49=RESULTATS!M49),3,IF(OR(AND('Pronostiqueur 3'!J49>'Pronostiqueur 3'!M49,RESULTATS!J49>RESULTATS!M49),AND('Pronostiqueur 3'!J49<'Pronostiqueur 3'!M49,RESULTATS!J49<RESULTATS!M49),AND('Pronostiqueur 3'!J49='Pronostiqueur 3'!M49,RESULTATS!J49=RESULTATS!M49)),1,0)))","v":""},null,null,null,null,null,null,null,null,null,null,null,null,null,null,null,null,null,"2018-07-02",5,{"$f":"IF(SUM(V33:V36)=0,\"1er Groupe E\",IF(COUNTIF(T33:T36,1)=1,VLOOKUP(1,T33:U36,2,FALSE),IF(COUNTIF(T33:T36,1)>=2,\"Tirage au Sort E1\")))","v":"1er Groupe E"},0,null,{"$f":"IF(AND(LEFT(AH49,3)<>\"1er\",LEFT(AH49,3)<>\"2nd\"),COUNTIF(RESULTATS!$AG$30:$AM$37,AH49),0)","v":0},null,null,{"$f":"IF(SUM(V39:V42)=0,\"2nd Groupe F\",IF(OR(COUNTIF(T39:T42,1)>1,COUNTIF(T39:T42,2)>1),\"Tirage au sort F2\",VLOOKUP(2,T39:U42,2,FALSE)))","v":"2nd Groupe F"},0,null,{"$f":"IF(AND(LEFT(AN49,3)<>\"1er\",LEFT(AN49,3)<>\"2nd\"),COUNTIF(RESULTATS!$AG$30:$AM$37,AN49),0)","v":0}]
[null,{"$f":"VLOOKUP($D50,TABLEAU_MATCHS[#All],2,FALSE)","v":"2018-06-27"},{"$f":"VLOOKUP($D50,TABLEAU_MATCHS[#All],3,FALSE)","v":"19:00:00"},43,{"$f":"\"Groupe \"&VLOOKUP($I50,TABLEAU_TEAMS[[#All],[TEAM]:[GROUP_INITIAL_RANK]],2,FALSE)","v":"Groupe F"},8.5,4.3,1.3,{"$f":"VLOOKUP($D50,TABLEAU_MATCHS[#All],4,FALSE)","v":"Mexique"},null,null,{"$f":"VLOOKUP($D50,TABLEAU_MATCHS[#All],5,FALSE)","v":"Suède"},null,{"$f":"IF(OR(ISBLANK(RESULTATS!J50),ISBLANK(J50)),\"\",IF(AND('Pronostiqueur 3'!J50=RESULTATS!J50,'Pronostiqueur 3'!M50=RESULTATS!M50),3,IF(OR(AND('Pronostiqueur 3'!J50>'Pronostiqueur 3'!M50,RESULTATS!J50>RESULTATS!M50),AND('Pronostiqueur 3'!J50<'Pronostiqueur 3'!M50,RESULTATS!J50<RESULTATS!M50),AND('Pronostiqueur 3'!J50='Pronostiqueur 3'!M50,RESULTATS!J50=RESULTATS!M50)),1,0)))","v":""},null,null,null,null,null,"Rg","Groupe H","MJ","G","N","P","BP","BC","+/-","Pts",null,null,"2018-07-03",6,{"$f":"IF(SUM(V39:V42)=0,\"1er Groupe F\",IF(COUNTIF(T39:T42,1)=1,VLOOKUP(1,T39:U42,2,FALSE),IF(COUNTIF(T39:T42,1)>=2,\"Tirage au Sort F1\")))","v":"1er Groupe F"},0,null,{"$f":"IF(AND(LEFT(AH50,3)<>\"1er\",LEFT(AH50,3)<>\"2nd\"),COUNTIF(RESULTATS!$AG$30:$AM$37,AH50),0)","v":0},null,null,{"$f":"IF(SUM(V33:V36)=0,\"2nd Groupe E\",IF(OR(COUNTIF(T33:T36,1)>1,COUNTIF(T33:T36,2)>1),\"Tirage au sort E2\",VLOOKUP(2,T33:U36,2,FALSE)))","v":"2nd Groupe E"},0,null,{"$f":"IF(AND(LEFT(AN50,3)<>\"1er\",LEFT(AN50,3)<>\"2nd\"),COUNTIF(RESULTATS!$AG$30:$AM$37,AN50),0)","v":0}]
[null,{"$f":"VLOOKUP($D51,TABLEAU_MATCHS[#All],2,FALSE)","v":"2018-06-27"},{"$f":"VLOOKUP($D51,TABLEAU_MATCHS[#All],3,FALSE)","v":"17:00:00"},44,{"$f":"\"Groupe \"&VLOOKUP($I51,TABLEAU_TEAMS[[#All],[TEAM]:[GROUP_INITIAL_RANK]],2,FALSE)","v":"Groupe F"},1.48,3.6,6.25,{"$f":"VLOOKUP($D51,TABLEAU_MATCHS[#All],4,FALSE)","v":"République de Corée"},null,null,{"$f":"VLOOKUP($D51,TABLEAU_MATCHS[#All],5,FALSE)","v":"Allemagne"},null,{"$f":"IF(OR(ISBLANK(RESULTATS!J51),ISBLANK(J51)),\"\",IF(AND('Pronostiqueur 3'!J51=RESULTATS!J51,'Pronostiqueur 3'!M51=RESULTATS!M51),3,IF(OR(AND('Pronostiqueur 3'!J51>'Pronostiqueur 3'!M51,RESULTATS!J51>RESULTATS!M51),AND('Pronostiqueur 3'!J51<'Pronostiqueur 3'!M51,RESULTATS!J51<RESULTATS!M51),AND('Pronostiqueur 3'!J51='Pronostiqueur 3'!M51,RESULTATS!J51=RESULTATS!M51)),1,0)))","v":""},null,null,null,{"$f":"INDEX($R102:$R105,MATCH(SMALL(COUNTIF($R102:$R105,\">=\"&$R102:$R105),ROW(INDIRECT(\"1:\"&ROWS($R102:$R105)))),COUNTIF($R102:$R105,\">=\"&$R102:$R105),0))","v":"00000Sénégal"},{"$f":"INDEX($S102:$S105,MATCH(SMALL(COUNTIF($R102:$R105,\">=\"&$R102:$R105),ROW(INDIRECT(\"1:\"&ROWS($R102:$R105)))),COUNTIF($R102:$R105,\">=\"&$R102:$R105),0))","v":0},{"$f":"INDEX($T102:$T105,MATCH(SMALL(COUNTIF($R102:$R105,\">=\"&$R102:$R105),ROW(INDIRECT(\"1:\"&ROWS($R102:$R105)))),COUNTIF($R102:$R105,\">=\"&$R102:$R105),0))","v":1},{"$f":"INDEX($U102:$U105,MATCH(SMALL(COUNTIF($R102:$R105,\">=\"&$R102:$R105),ROW(INDIRECT(\"1:\"&ROWS($R102:$R105)))),COUNTIF($R102:$R105,\">=\"&$R102:$R105),0))","v":"Sénégal"},{"$f":"SUMPRODUCT((Teams1=U51)*(Teams1_Score<>\"\"))+SUMPRODUCT((Teams2=U51)*(Teams2_Score<>\"\"))","v":0},{"$f":"SUMPRODUCT((Teams1=U51)*(Teams1_Score>Teams2_Score))+SUMPRODUCT((Teams2=U51)*(Teams2_Score>Teams1_Score))","v":0},{"$f":"SUMPRODUCT((Teams1=U51)*(Teams1_Score=Teams2_Score)*(Teams1_Score<>\"\"))+SUMPRODUCT((Teams2=U51)*(Teams2_Score=Teams1_Score)*(Teams2_Score<>\"\"))","v":0},{"$f":"SUMPRODUCT((Teams1=U51)*(Teams1_Score<Teams2_Score))+SUMPRODUCT((Teams2=U51)*(Teams2_Score<Teams1_Score))","v":0},{"$f":"SUMPRODUCT((Teams1=U51)*(Teams1_Score))+SUMPRODUCT((Teams2=U51)*(Teams2_Score))","v":0},{"$f":"SUMPRODUCT((Teams1=U51)*(Teams2_Score))+SUMPRODUCT((Teams2=U51)*(Teams1_Score))","v":0},{"$f":"Z51-AA51","v":0},{"$f":"3*W51+X51","v":0},null,null,"2018-07-02",7,{"$f":"IF(SUM(V45:V48)=0,\"1er Groupe G\",IF(COUNTIF(T45:T48,1)=1,VLOOKUP(1,T45:U48,2,FALSE),IF(COUNTIF(T45:T48,1)>=2,\"Tirage au Sort G1\")))","v":"1er Groupe G"},0,null,{"$f":"IF(AND(LEFT(AH51,3)<>\"1er\",LEFT(AH51,3)<>\"2nd\"),COUNTIF(RESULTATS!$AG$30:$AM$37,AH51),0)","v":0},null,null,{"$f":"IF(SUM(V51:V54)=0,\"2nd Groupe H\",IF(OR(COUNTIF(T51:T54,1)>1,COUNTIF(T51:T54,2)>1),\"Tirage au sort H2\",VLOOKUP(2,T51:U54,2,FALSE)))","v":"2nd Groupe H"},0,null,{"$f":"IF(AND(LEFT(AN51,3)<>\"1er\",LEFT(AN51,3)<>\"2nd\"),COUNTIF(RESULTATS!$AG$30:$AM$37,AN51),0)","v":0}]
[null,{"$f":"VLOOKUP($D52,TABLEAU_MATCHS[#All],2,FALSE)","v":"2018-06-28"},{"$f":"VLOOKUP($D52,TABLEAU_MATCHS[#All],3,FALSE)","v":"21:00:00"},45,{"$f":"\"Groupe \"&VLOOKUP($I52,TABLEAU_TEAMS[[#All],[TEAM]:[GROUP_INITIAL_RANK]],2,FALSE)","v":"Groupe G"},8,4.2,1.32,{"$f":"VLOOKUP($D52,TABLEAU_MATCHS[#All],4,FALSE)","v":"Panama"},null,null,{"$f":"VLOOKUP($D52,TABLEAU_MATCHS[#All],5,FALSE)","v":"Tunisie"},null,{"$f":"IF(OR(ISBLANK(RESULTATS!J52),ISBLANK(J52)),\"\",IF(AND('Pronostiqueur 3'!J52=RESULTATS!J52,'Pronostiqueur 3'!M52=RESULTATS!M52),3,IF(OR(AND('Pronostiqueur 3'!J52>'Pronostiqueur 3'!M52,RESULTATS!J52>RESULTATS!M52),AND('Pronostiqueur 3'!J52<'Pronostiqueur 3'!M52,RESULTATS!J52<RESULTATS!M52),AND('Pronostiqueur 3'!J52='Pronostiqueur 3'!M52,RESULTATS!J52=RESULTATS!M52)),1,0)))","v":""},null,null,null,"00000Pologne",0,1,"Pologne",{"$f":"SUMPRODUCT((Teams1=U52)*(Teams1_Score<>\"\"))+SUMPRODUCT((Teams2=U52)*(Teams2_Score<>\"\"))","v":0},{"$f":"SUMPRODUCT((Teams1=U52)*(Teams1_Score>Teams2_Score))+SUMPRODUCT((Teams2=U52)*(Teams2_Score>Teams1_Score))","v":0},{"$f":"SUMPRODUCT((Teams1=U52)*(Teams1_Score=Teams2_Score)*(Teams1_Score<>\"\"))+SUMPRODUCT((Teams2=U52)*(Teams2_Score=Teams1_Score)*(Teams2_Score<>\"\"))","v":0},{"$f":"SUMPRODUCT((Teams1=U52)*(Teams1_Score<Teams2_Score))+SUMPRODUCT((Teams2=U52)*(Teams2_Score<Teams1_Score))","v":0},{"$f":"SUMPRODUCT((Teams1=U52)*(Teams1_Score))+SUMPRODUCT((Teams2=U52)*(Teams2_Score))","v":0},{"$f":"SUMPRODUCT((Teams1=U52)*(Teams2_Score))+SUMPRODUCT((Teams2=U52)*(Teams1_Score))","v":0},0,0,null,null,"2018-07-03",8,{"$f":"IF(SUM(V51:V54)=0,\"1er Groupe H\",IF(COUNTIF(T51:T54,1)=1,VLOOKUP(1,T51:U54,2,FALSE),IF(COUNTIF(T51:T54,1)>=2,\"Tirage au Sort H1\")))","v":"1er Groupe H"},0,null,{"$f":"IF(AND(LEFT(AH52,3)<>\"1er\",LEFT(AH52,3)<>\"2nd\"),COUNTIF(RESULTATS!$AG$30:$AM$37,AH52),0)","v":0},null,null,{"$f":"IF(SUM(V45:V48)=0,\"2nd Groupe G\",IF(OR(COUNTIF(T45:T48,1)>1,COUNTIF(T45:T48,2)>1),\"Tirage au sort G2\",VLOOKUP(2,T45:U48,2,FALSE)))","v":"2nd Groupe G"},0,null,{"$f":"IF(AND(LEFT(AN52,3)<>\"1er\",LEFT(AN52,3)<>\"2nd\"),COUNTIF(RESULTATS!$AG$30:$AM$37,AN52),0)","v":0}]
[null,{"$f":"VLOOKUP($D53,TABLEAU_MATCHS[#All],2,FALSE)","v":"2018-06-28"},{"$f":"VLOOKUP($D53,TABLEAU_MATCHS[#All],3,FALSE)","v":"20:00:00"},46,{"$f":"\"Groupe \"&VLOOKUP($I53,TABLEAU_TEAMS[[#All],[TEAM]:[GROUP_INITIAL_RANK]],2,FALSE)","v":"Groupe G"},1.74,3.2,4.0999999999999996,{"$f":"VLOOKUP($D53,TABLEAU_MATCHS[#All],4,FALSE)","v":"Angleterre"},null,null,{"$f":"VLOOKUP($D53,TABLEAU_MATCHS[#All],5,FALSE)","v":"Belgique"},null,{"$f":"IF(OR(ISBLANK(RESULTATS!J53),ISBLANK(J53)),\"\",IF(AND('Pronostiqueur 3'!J53=RESULTATS!J53,'Pronostiqueur 3'!M53=RESULTATS!M53),3,IF(OR(AND('Pronostiqueur 3'!J53>'Pronostiqueur 3'!M53,RESULTATS!J53>RESULTATS!M53),AND('Pronostiqueur 3'!J53<'Pronostiqueur 3'!M53,RESULTATS!J53<RESULTATS!M53),AND('Pronostiqueur 3'!J53='Pronostiqueur 3'!M53,RESULTATS!J53=RESULTATS!M53)),1,0)))","v":""},null,null,null,"00000Japon",0,1,"Japon",{"$f":"SUMPRODUCT((Teams1=U53)*(Teams1_Score<>\"\"))+SUMPRODUCT((Teams2=U53)*(Teams2_Score<>\"\"))","v":0},{"$f":"SUMPRODUCT((Teams1=U53)*(Teams1_Score>Teams2_Score))+SUMPRODUCT((Teams2=U53)*(Teams2_Score>Teams1_Score))","v":0},{"$f":"SUMPRODUCT((Teams1=U53)*(Teams1_Score=Teams2_Score)*(Teams1_Score<>\"\"))+SUMPRODUCT((Teams2=U53)*(Teams2_Score=Teams1_Score)*(Teams2_Score<>\"\"))","v":0},{"$f":"SUMPRODUCT((Teams1=U53)*(Teams1_Score<Teams2_Score))+SUMPRODUCT((Teams2=U53)*(Teams2_Score<Teams1_Score))","v":0},{"$f":"SUMPRODUCT((Teams1=U53)*(Teams1_Score))+SUMPRODUCT((Teams2=U53)*(Teams2_Score))","v":0},{"$f":"SUMPRODUCT((Teams1=U53)*(Teams2_Score))+SUMPRODUCT((Teams2=U53)*(Teams1_Score))","v":0},0,0,null,null,null,null,null,null,null,{"$f":"SUM(AK45:AK52)","v":0},null,null,null,0,null,{"$f":"SUM(AQ45:AQ52)","v":0}]
[null,{"$f":"VLOOKUP($D54,TABLEAU_MATCHS[#All],2,FALSE)","v":"2018-06-28"},{"$f":"VLOOKUP($D54,TABLEAU_MATCHS[#All],3,FALSE)","v":"17:00:00"},47,{"$f":"\"Groupe \"&VLOOKUP($I54,TABLEAU_TEAMS[[#All],[TEAM]:[GROUP_INITIAL_RANK]],2,FALSE)","v":"Groupe H"},4.9000000000000004,3.25,1.62,{"$f":"VLOOKUP($D54,TABLEAU_MATCHS[#All],4,FALSE)","v":"Japon"},null,null,{"$f":"VLOOKUP($D54,TABLEAU_MATCHS[#All],5,FALSE)","v":"Pologne"},null,{"$f":"IF(OR(ISBLANK(RESULTATS!J54),ISBLANK(J54)),\"\",IF(AND('Pronostiqueur 3'!J54=RESULTATS!J54,'Pronostiqueur 3'!M54=RESULTATS!M54),3,IF(OR(AND('Pronostiqueur 3'!J54>'Pronostiqueur 3'!M54,RESULTATS!J54>RESULTATS!M54),AND('Pronostiqueur 3'!J54<'Pronostiqueur 3'!M54,RESULTATS!J54<RESULTATS!M54),AND('Pronostiqueur 3'!J54='Pronostiqueur 3'!M54,RESULTATS!J54=RESULTATS!M54)),1,0)))","v":""},null,null,null,"00000Colombie",0,1,"Colombie",{"$f":"SUMPRODUCT((Teams1=U54)*(Teams1_Score<>\"\"))+SUMPRODUCT((Teams2=U54)*(Teams2_Score<>\"\"))","v":0},{"$f":"SUMPRODUCT((Teams1=U54)*(Teams1_Score>Teams2_Score))+SUMPRODUCT((Teams2=U54)*(Teams2_Score>Teams1_Score))","v":0},{"$f":"SUMPRODUCT((Teams1=U54)*(Teams1_Score=Teams2_Score)*(Teams1_Score<>\"\"))+SUMPRODUCT((Teams2=U54)*(Teams2_Score=Teams1_Score)*(Teams2_Score<>\"\"))","v":0},{"$f":"SUMPRODUCT((Teams1=U54)*(Teams1_Score<Teams2_Score))+SUMPRODUCT((Teams2=U54)*(Teams2_Score<Teams1_Score))","v":0},{"$f":"SUMPRODUCT((Teams1=U54)*(Teams1_Score))+SUMPRODUCT((Teams2=U54)*(Teams2_Score))","v":0},{"$f":"SUMPRODUCT((Teams1=U54)*(Teams2_Score))+SUMPRODUCT((Teams2=U54)*(Teams1_Score))","v":0},0,0]
[null,{"$f":"VLOOKUP($D55,TABLEAU_MATCHS[#All],2,FALSE)","v":"2018-06-28"},{"$f":"VLOOKUP($D55,TABLEAU_MATCHS[#All],3,FALSE)","v":"18:00:00"},48,{"$f":"\"Groupe \"&VLOOKUP($I55,TABLEAU_TEAMS[[#All],[TEAM]:[GROUP_INITIAL_RANK]],2,FALSE)","v":"Groupe H"},6,3.4,1.52,{"$f":"VLOOKUP($D55,TABLEAU_MATCHS[#All],4,FALSE)","v":"Sénégal"},null,null,{"$f":"VLOOKUP($D55,TABLEAU_MATCHS[#All],5,FALSE)","v":"Colombie"},null,{"$f":"IF(OR(ISBLANK(RESULTATS!J55),ISBLANK(J55)),\"\",IF(AND('Pronostiqueur 3'!J55=RESULTATS!J55,'Pronostiqueur 3'!M55=RESULTATS!M55),3,IF(OR(AND('Pronostiqueur 3'!J55>'Pronostiqueur 3'!M55,RESULTATS!J55>RESULTATS!M55),AND('Pronostiqueur 3'!J55<'Pronostiqueur 3'!M55,RESULTATS!J55<RESULTATS!M55),AND('Pronostiqueur 3'!J55='Pronostiqueur 3'!M55,RESULTATS!J55=RESULTATS!M55)),1,0)))","v":""}]
[null,null,null,null,null,null,null,null,null,null,null,null,null,{"$f":"SUM(N8:N55)","v":0}]
[]
[]
[null,"Tirage au sort A1",null,null,null,null,null,null,null,null,null,null,null,null,null,null,null,null,null,"Rg","Groupe A","MJ","G","N","P","BP","BC","+/-","Pts"]
[null,{"$f":"IF(ROWS($1:1)<=COUNTIF($T$9:$T$12,1),INDEX($U$9:$U$12,SMALL(IF($T$9:$T$12=1,ROW(INDIRECT(\"1:\"&ROWS($T$9:$T$12)))),ROWS($1:1))),\"\")","v":"Uruguay"},null,null,null,null,null,null,null,null,null,null,null,null,null,null,"A_1",{"$f":"TEXT(S60,\"00000\")&U60","v":"00000Russie"},{"$f":"AC60*1000+AB60*100+Z60*10","v":0},{"$f":"RANK(S60,$S60:$S64,0)","v":1},{"$f":"VLOOKUP(Q60,TABLEAU_TEAMS[#All],2,FALSE)","v":"Russie"},{"$f":"SUMPRODUCT((Teams1=U60)*(Teams1_Score<>\"\"))+SUMPRODUCT((Teams2=U60)*(Teams2_Score<>\"\"))","v":0},{"$f":"SUMPRODUCT((Teams1=U60)*(Teams1_Score>Teams2_Score))+SUMPRODUCT((Teams2=U60)*(Teams2_Score>Teams1_Score))","v":0},{"$f":"SUMPRODUCT((Teams1=U60)*(Teams1_Score=Teams2_Score)*(Teams1_Score<>\"\"))+SUMPRODUCT((Teams2=U60)*(Teams2_Score=Teams1_Score)*(Teams2_Score<>\"\"))","v":0},{"$f":"SUMPRODUCT((Teams1=U60)*(Teams1_Score<Teams2_Score))+SUMPRODUCT((Teams2=U60)*(Teams2_Score<Teams1_Score))","v":0},{"$f":"SUMPRODUCT((Teams1=U60)*(Teams1_Score))+SUMPRODUCT((Teams2=U60)*(Teams2_Score))","v":0},{"$f":"SUMPRODUCT((Teams1=U60)*(Teams2_Score))+SUMPRODUCT((Teams2=U60)*(Teams1_Score))","v":0},{"$f":"Z60-AA60","v":0},{"$f":"3*W60+X60","v":0}]
[null,{"$f":"IF(ROWS($1:2)<=COUNTIF($T$9:$T$12,1),INDEX($U$9:$U$12,SMALL(IF($T$9:$T$12=1,ROW(INDIRECT(\"1:\"&ROWS($T$9:$T$12)))),ROWS($1:2))),\"\")","v":"Russie"},null,null,null,null,null,null,null,null,null,null,null,null,null,null,"A_2",{"$f":"TEXT(S61,\"00000\")&U61","v":"00000Arabie Saoudite"},{"$f":"AC61*1000+AB61*100+Z61*10","v":0},{"$f":"RANK(S61,$S60:$S64,0)","v":1},{"$f":"VLOOKUP(Q61,TABLEAU_TEAMS[#All],2,FALSE)","v":"Arabie Saoudite"},{"$f":"SUMPRODUCT((Teams1=U61)*(Teams1_Score<>\"\"))+SUMPRODUCT((Teams2=U61)*(Teams2_Score<>\"\"))","v":0},{"$f":"SUMPRODUCT((Teams1=U61)*(Teams1_Score>Teams2_Score))+SUMPRODUCT((Teams2=U61)*(Teams2_Score>Teams1_Score))","v":0},{"$f":"SUMPRODUCT((Teams1=U61)*(Teams1_Score=Teams2_Score)*(Teams1_Score<>\"\"))+SUMPRODUCT((Teams2=U61)*(Teams2_Score=Teams1_Score)*(Teams2_Score<>\"\"))","v":0},{"$f":"SUMPRODUCT((Teams1=U61)*(Teams1_Score<Teams2_Score))+SUMPRODUCT((Teams2=U61)*(Teams2_Score<Teams1_Score))","v":0},{"$f":"SUMPRODUCT((Teams1=U61)*(Teams1_Score))+SUMPRODUCT((Teams2=U61)*(Teams2_Score))","v":0},{"$f":"SUMPRODUCT((Teams1=U61)*(Teams2_Score))+SUMPRODUCT((Teams2=U61)*(Teams1_Score))","v":0},{"$f":"Z61-AA61","v":0},{"$f":"3*W61+X61","v":0}]
[null,{"$f":"IF(ROWS($1:3)<=COUNTIF($T$9:$T$12,1),INDEX($U$9:$U$12,SMALL(IF($T$9:$T$12=1,ROW(INDIRECT(\"1:\"&ROWS($T$9:$T$12)))),ROWS($1:3))),\"\")","v":"Egypte"},null,null,null,null,null,null,null,null,null,null,null,null,null,null,"A_3",{"$f":"TEXT(S62,\"00000\")&U62","v":"00000Egypte"},{"$f":"AC62*1000+AB62*100+Z62*10","v":0},{"$f":"RANK(S62,$S60:$S64,0)","v":1},{"$f":"VLOOKUP(Q62,TABLEAU_TEAMS[#All],2,FALSE)","v":"Egypte"},{"$f":"SUMPRODUCT((Teams1=U62)*(Teams1_Score<>\"\"))+SUMPRODUCT((Teams2=U62)*(Teams2_Score<>\"\"))","v":0},{"$f":"SUMPRODUCT((Teams1=U62)*(Teams1_Score>Teams2_Score))+SUMPRODUCT((Teams2=U62)*(Teams2_Score>Teams1_Score))","v":0},{"$f":"SUMPRODUCT((Teams1=U62)*(Teams1_Score=Teams2_Score)*(Teams1_Score<>\"\"))+SUMPRODUCT((Teams2=U62)*(Teams2_Score=Teams1_Score)*(Teams2_Score<>\"\"))","v":0},{"$f":"SUMPRODUCT((Teams1=U62)*(Teams1_Score<Teams2_Score))+SUMPRODUCT((Teams2=U62)*(Teams2_Score<Teams1_Score))","v":0},{"$f":"SUMPRODUCT((Teams1=U62)*(Teams1_Score))+SUMPRODUCT((Teams2=U62)*(Teams2_Score))","v":0},{"$f":"SUMPRODUCT((Teams1=U62)*(Teams2_Score))+SUMPRODUCT((Teams2=U62)*(Teams1_Score))","v":0},0,0]
[null,{"$f":"IF(ROWS($1:4)<=COUNTIF($T$9:$T$12,1),INDEX($U$9:$U$12,SMALL(IF($T$9:$T$12=1,ROW(INDIRECT(\"1:\"&ROWS($T$9:$T$12)))),ROWS($1:4))),\"\")","v":"Arabie Saoudite"},null,null,null,null,null,null,null,null,null,null,null,null,null,null,"A_4",{"$f":"TEXT(S63,\"00000\")&U63","v":"00000Uruguay"},{"$f":"AC63*1000+AB63*100+Z63*10","v":0},{"$f":"RANK(S63,$S60:$S64,0)","v":1},{"$f":"VLOOKUP(Q63,TABLEAU_TEAMS[#All],2,FALSE)","v":"Uruguay"},{"$f":"SUMPRODUCT((Teams1=U63)*(Teams1_Score<>\"\"))+SUMPRODUCT((Teams2=U63)*(Teams2_Score<>\"\"))","v":0},{"$f":"SUMPRODUCT((Teams1=U63)*(Teams1_Score>Teams2_Score))+SUMPRODUCT((Teams2=U63)*(Teams2_Score>Teams1_Score))","v":0},{"$f":"SUMPRODUCT((Teams1=U63)*(Teams1_Score=Teams2_Score)*(Teams1_Score<>\"\"))+SUMPRODUCT((Teams2=U63)*(Teams2_Score=Teams1_Score)*(Teams2_Score<>\"\"))","v":0},{"$f":"SUMPRODUCT((Teams1=U63)*(Teams1_Score<Teams2_Score))+SUMPRODUCT((Teams2=U63)*(Teams2_Score<Teams1_Score))","v":0},{"$f":"SUMPRODUCT((Teams1=U63)*(Teams1_Score))+SUMPRODUCT((Teams2=U63)*(Teams2_Score))","v":0},{"$f":"SUMPRODUCT((Teams1=U63)*(Teams2_Score))+SUMPRODUCT((Teams2=U63)*(Teams1_Score))","v":0},0,0]
[null,"Tirage au sort A2"]
[null,{"$f":"IF(COUNTIF($T$9:$T$12,1)>1,IF(ROWS($1:1)<=COUNTIF($T$9:$T$12,1),INDEX($U$9:$U$12,SMALL(IF($T$9:$T$12=1,ROW(INDIRECT(\"1:\"&ROWS($T$9:$T$12)))),ROWS($1:1))),\"\"),IF(COUNTIF($T$9:$T$12,2)>1,IF(ROWS($1:1)<=COUNTIF($T$9:$T$12,2),INDEX($U$9:$U$12,SMALL(IF($T$9:$T$12=2,ROW(INDIRECT(\"1:\"&ROWS($T$9:$T$12)))),ROWS($1:1))),\"\")))","v":"Uruguay"},null,null,null,null,null,null,null,null,null,null,null,null,null,null,null,null,null,"Rg","Groupe B","MJ","G","N","P","BP","BC","Pts","Pts"]
[null,{"$f":"IF(COUNTIF($T$9:$T$12,1)>1,IF(ROWS($1:2)<=COUNTIF($T$9:$T$12,1),INDEX($U$9:$U$12,SMALL(IF($T$9:$T$12=1,ROW(INDIRECT(\"1:\"&ROWS($T$9:$T$12)))),ROWS($1:2))),\"\"),IF(COUNTIF($T$9:$T$12,2)>1,IF(ROWS($1:2)<=COUNTIF($T$9:$T$12,2),INDEX($U$9:$U$12,SMALL(IF($T$9:$T$12=2,ROW(INDIRECT(\"1:\"&ROWS($T$9:$T$12)))),ROWS($1:2))),\"\")))","v":"Russie"},null,null,null,null,null,null,null,null,null,null,null,null,null,null,"B_1",{"$f":"TEXT(S66,\"00000\")&U66","v":"00000Maroc"},{"$f":"AC66*1000+AB66*100+Z66*10","v":0},{"$f":"RANK(S66,$S66:$S70,0)","v":1},{"$f":"VLOOKUP(Q66,TABLEAU_TEAMS[#All],2,FALSE)","v":"Maroc"},{"$f":"SUMPRODUCT((Teams1=U66)*(Teams1_Score<>\"\"))+SUMPRODUCT((Teams2=U66)*(Teams2_Score<>\"\"))","v":0},{"$f":"SUMPRODUCT((Teams1=U66)*(Teams1_Score>Teams2_Score))+SUMPRODUCT((Teams2=U66)*(Teams2_Score>Teams1_Score))","v":0},{"$f":"SUMPRODUCT((Teams1=U66)*(Teams1_Score=Teams2_Score)*(Teams1_Score<>\"\"))+SUMPRODUCT((Teams2=U66)*(Teams2_Score=Teams1_Score)*(Teams2_Score<>\"\"))","v":0},{"$f":"SUMPRODUCT((Teams1=U66)*(Teams1_Score<Teams2_Score))+SUMPRODUCT((Teams2=U66)*(Teams2_Score<Teams1_Score))","v":0},{"$f":"SUMPRODUCT((Teams1=U66)*(Teams1_Score))+SUMPRODUCT((Teams2=U66)*(Teams2_Score))","v":0},{"$f":"SUMPRODUCT((Teams1=U66)*(Teams2_Score))+SUMPRODUCT((Teams2=U66)*(Teams1_Score))","v":0},{"$f":"Z66-AA66","v":0},{"$f":"3*W66+X66","v":0}]
[null,{"$f":"IF(COUNTIF($T$9:$T$12,1)>1,IF(ROWS($1:3)<=COUNTIF($T$9:$T$12,1),INDEX($U$9:$U$12,SMALL(IF($T$9:$T$12=1,ROW(INDIRECT(\"1:\"&ROWS($T$9:$T$12)))),ROWS($1:3))),\"\"),IF(COUNTIF($T$9:$T$12,2)>1,IF(ROWS($1:3)<=COUNTIF($T$9:$T$12,2),INDEX($U$9:$U$12,SMALL(IF($T$9:$T$12=2,ROW(INDIRECT(\"1:\"&ROWS($T$9:$T$12)))),ROWS($1:3))),\"\")))","v":"Egypte"},null,null,null,null,null,null,null,null,null,null,null,null,null,null,"B_2",{"$f":"TEXT(S67,\"00000\")&U67","v":"00000RI Iran"},{"$f":"AC67*1000+AB67*100+Z67*10","v":0},{"$f":"RANK(S67,$S66:$S70,0)","v":1},{"$f":"VLOOKUP(Q67,TABLEAU_TEAMS[#All],2,FALSE)","v":"RI Iran"},{"$f":"SUMPRODUCT((Teams1=U67)*(Teams1_Score<>\"\"))+SUMPRODUCT((Teams2=U67)*(Teams2_Score<>\"\"))","v":0},{"$f":"SUMPRODUCT((Teams1=U67)*(Teams1_Score>Teams2_Score))+SUMPRODUCT((Teams2=U67)*(Teams2_Score>Teams1_Score))","v":0},{"$f":"SUMPRODUCT((Teams1=U67)*(Teams1_Score=Teams2_Score)*(Teams1_Score<>\"\"))+SUMPRODUCT((Teams2=U67)*(Teams2_Score=Teams1_Score)*(Teams2_Score<>\"\"))","v":0},{"$f":"SUMPRODUCT((Teams1=U67)*(Teams1_Score<Teams2_Score))+SUMPRODUCT((Teams2=U67)*(Teams2_Score<Teams1_Score))","v":0},{"$f":"SUMPRODUCT((Teams1=U67)*(Teams1_Score))+SUMPRODUCT((Teams2=U67)*(Teams2_Score))","v":0},{"$f":"SUMPRODUCT((Teams1=U67)*(Teams2_Score))+SUMPRODUCT((Teams2=U67)*(Teams1_Score))","v":0},0,0]
[null,{"$f":"IF(COUNTIF($T$9:$T$12,1)>1,IF(ROWS($1:4)<=COUNTIF($T$9:$T$12,1),INDEX($U$9:$U$12,SMALL(IF($T$9:$T$12=1,ROW(INDIRECT(\"1:\"&ROWS($T$9:$T$12)))),ROWS($1:4))),\"\"),IF(COUNTIF($T$9:$T$12,2)>1,IF(ROWS($1:4)<=COUNTIF($T$9:$T$12,2),INDEX($U$9:$U$12,SMALL(IF($T$9:$T$12=2,ROW(INDIRECT(\"1:\"&ROWS($T$9:$T$12)))),ROWS($1:4))),\"\")))","v":"Arabie Saoudite"},null,null,null,null,null,null,null,null,null,null,null,null,null,null,"B_3",{"$f":"TEXT(S68,\"00000\")&U68","v":"00000Portugal"},{"$f":"AC68*1000+AB68*100+Z68*10","v":0},{"$f":"RANK(S68,$S66:$S70,0)","v":1},{"$f":"VLOOKUP(Q68,TABLEAU_TEAMS[#All],2,FALSE)","v":"Portugal"},{"$f":"SUMPRODUCT((Teams1=U68)*(Teams1_Score<>\"\"))+SUMPRODUCT((Teams2=U68)*(Teams2_Score<>\"\"))","v":0},{"$f":"SUMPRODUCT((Teams1=U68)*(Teams1_Score>Teams2_Score))+SUMPRODUCT((Teams2=U68)*(Teams2_Score>Teams1_Score))","v":0},{"$f":"SUMPRODUCT((Teams1=U68)*(Teams1_Score=Teams2_Score)*(Teams1_Score<>\"\"))+SUMPRODUCT((Teams2=U68)*(Teams2_Score=Teams1_Score)*(Teams2_Score<>\"\"))","v":0},{"$f":"SUMPRODUCT((Teams1=U68)*(Teams1_Score<Teams2_Score))+SUMPRODUCT((Teams2=U68)*(Teams2_Score<Teams1_Score))","v":0},{"$f":"SUMPRODUCT((Teams1=U68)*(Teams1_Score))+SUMPRODUCT((Teams2=U68)*(Teams2_Score))","v":0},{"$f":"SUMPRODUCT((Teams1=U68)*(Teams2_Score))+SUMPRODUCT((Teams2=U68)*(Teams1_Score))","v":0},0,0]
[null,"Tirage au sort B1",null,null,null,null,null,null,null,null,null,null,null,null,null,null,"B_4",{"$f":"TEXT(S69,\"00000\")&U69","v":"00000Espagne"},{"$f":"AC69*1000+AB69*100+Z69*10","v":0},{"$f":"RANK(S69,$S66:$S70,0)","v":1},{"$f":"VLOOKUP(Q69,TABLEAU_TEAMS[#All],2,FALSE)","v":"Espagne"},{"$f":"SUMPRODUCT((Teams1=U69)*(Teams1_Score<>\"\"))+SUMPRODUCT((Teams2=U69)*(Teams2_Score<>\"\"))","v":0},{"$f":"SUMPRODUCT((Teams1=U69)*(Teams1_Score>Teams2_Score))+SUMPRODUCT((Teams2=U69)*(Teams2_Score>Teams1_Score))","v":0},{"$f":"SUMPRODUCT((Teams1=U69)*(Teams1_Score=Teams2_Score)*(Teams1_Score<>\"\"))+SUMPRODUCT((Teams2=U69)*(Teams2_Score=Teams1_Score)*(Teams2_Score<>\"\"))","v":0},{"$f":"SUMPRODUCT((Teams1=U69)*(Teams1_Score<Teams2_Score))+SUMPRODUCT((Teams2=U69)*(Teams2_Score<Teams1_Score))","v":0},{"$f":"SUMPRODUCT((Teams1=U69)*(Teams1_Score))+SUMPRODUCT((Teams2=U69)*(Teams2_Score))","v":0},{"$f":"SUMPRODUCT((Teams1=U69)*(Teams2_Score))+SUMPRODUCT((Teams2=U69)*(Teams1_Score))","v":0},0,0]
[null,{"$f":"IF(ROWS($1:1)<=COUNTIF($T$15:$T$18,1),INDEX($U$15:$U$18,SMALL(IF($T$15:$T$18=1,ROW(INDIRECT(\"1:\"&ROWS($T$15:$T$18)))),ROWS($1:1))),\"\")","v":"RI Iran"}]
[null,{"$f":"IF(ROWS($1:2)<=COUNTIF($T$15:$T$18,1),INDEX($U$15:$U$18,SMALL(IF($T$15:$T$18=1,ROW(INDIRECT(\"1:\"&ROWS($T$15:$T$18)))),ROWS($1:2))),\"\")","v":"Portugal"},null,null,null,null,null,null,null,null,null,null,null,null,null,null,null,null,null,"Rg","Groupe C","MJ","G","N","P","BP","BC","Pts","Pts"]
[null,{"$f":"IF(ROWS($1:3)<=COUNTIF($T$15:$T$18,1),INDEX($U$15:$U$18,SMALL(IF($T$15:$T$18=1,ROW(INDIRECT(\"1:\"&ROWS($T$15:$T$18)))),ROWS($1:3))),\"\")","v":"Maroc"},null,null,null,null,null,null,null,null,null,null,null,null,null,null,"C_1",{"$f":"TEXT(S72,\"00000\")&U72","v":"00000France"},{"$f":"AC72*1000+AB72*100+Z72*10","v":0},{"$f":"RANK(S72,$S72:$S76,0)","v":1},{"$f":"VLOOKUP(Q72,TABLEAU_TEAMS[#All],2,FALSE)","v":"France"},{"$f":"SUMPRODUCT((Teams1=U72)*(Teams1_Score<>\"\"))+SUMPRODUCT((Teams2=U72)*(Teams2_Score<>\"\"))","v":0},{"$f":"SUMPRODUCT((Teams1=U72)*(Teams1_Score>Teams2_Score))+SUMPRODUCT((Teams2=U72)*(Teams2_Score>Teams1_Score))","v":0},{"$f":"SUMPRODUCT((Teams1=U72)*(Teams1_Score=Teams2_Score)*(Teams1_Score<>\"\"))+SUMPRODUCT((Teams2=U72)*(Teams2_Score=Teams1_Score)*(Teams2_Score<>\"\"))","v":0},{"$f":"SUMPRODUCT((Teams1=U72)*(Teams1_Score<Teams2_Score))+SUMPRODUCT((Teams2=U72)*(Teams2_Score<Teams1_Score))","v":0},{"$f":"SUMPRODUCT((Teams1=U72)*(Teams1_Score))+SUMPRODUCT((Teams2=U72)*(Teams2_Score))","v":0},{"$f":"SUMPRODUCT((Teams1=U72)*(Teams2_Score))+SUMPRODUCT((Teams2=U72)*(Teams1_Score))","v":0},{"$f":"Z72-AA72","v":0},{"$f":"3*W72+X72","v":0}]
[null,{"$f":"IF(ROWS($1:4)<=COUNTIF($T$15:$T$18,1),INDEX($U$15:$U$18,SMALL(IF($T$15:$T$18=1,ROW(INDIRECT(\"1:\"&ROWS($T$15:$T$18)))),ROWS($1:4))),\"\")","v":"Espagne"},null,null,null,null,null,null,null,null,null,null,null,null,null,null,"C_2",{"$f":"TEXT(S73,\"00000\")&U73","v":"00000Australie"},{"$f":"AC73*1000+AB73*100+Z73*10","v":0},{"$f":"RANK(S73,$S72:$S76,0)","v":1},{"$f":"VLOOKUP(Q73,TABLEAU_TEAMS[#All],2,FALSE)","v":"Australie"},{"$f":"SUMPRODUCT((Teams1=U73)*(Teams1_Score<>\"\"))+SUMPRODUCT((Teams2=U73)*(Teams2_Score<>\"\"))","v":0},{"$f":"SUMPRODUCT((Teams1=U73)*(Teams1_Score>Teams2_Score))+SUMPRODUCT((Teams2=U73)*(Teams2_Score>Teams1_Score))","v":0},{"$f":"SUMPRODUCT((Teams1=U73)*(Teams1_Score=Teams2_Score)*(Teams1_Score<>\"\"))+SUMPRODUCT((Teams2=U73)*(Teams2_Score=Teams1_Score)*(Teams2_Score<>\"\"))","v":0},{"$f":"SUMPRODUCT((Teams1=U73)*(Teams1_Score<Teams2_Score))+SUMPRODUCT((Teams2=U73)*(Teams2_Score<Teams1_Score))","v":0},{"$f":"SUMPRODUCT((Teams1=U73)*(Teams1_Score))+SUMPRODUCT((Teams2=U73)*(Teams2_Score))","v":0},{"$f":"SUMPRODUCT((Teams1=U73)*(Teams2_Score))+SUMPRODUCT((Teams2=U73)*(Teams1_Score))","v":0},0,0]
[null,"Tirage au sort B2",null,null,null,null,null,null,null,null,null,null,null,null,null,null,"C_3",{"$f":"TEXT(S74,\"00000\")&U74","v":"00000Pérou"},{"$f":"AC74*1000+AB74*100+Z74*10","v":0},{"$f":"RANK(S74,$S72:$S76,0)","v":1},{"$f":"VLOOKUP(Q74,TABLEAU_TEAMS[#All],2,FALSE)","v":"Pérou"},{"$f":"SUMPRODUCT((Teams1=U74)*(Teams1_Score<>\"\"))+SUMPRODUCT((Teams2=U74)*(Teams2_Score<>\"\"))","v":0},{"$f":"SUMPRODUCT((Teams1=U74)*(Teams1_Score>Teams2_Score))+SUMPRODUCT((Teams2=U74)*(Teams2_Score>Teams1_Score))","v":0},{"$f":"SUMPRODUCT((Teams1=U74)*(Teams1_Score=Teams2_Score)*(Teams1_Score<>\"\"))+SUMPRODUCT((Teams2=U74)*(Teams2_Score=Teams1_Score)*(Teams2_Score<>\"\"))","v":0},{"$f":"SUMPRODUCT((Teams1=U74)*(Teams1_Score<Teams2_Score))+SUMPRODUCT((Teams2=U74)*(Teams2_Score<Teams1_Score))","v":0},{"$f":"SUMPRODUCT((Teams1=U74)*(Teams1_Score))+SUMPRODUCT((Teams2=U74)*(Teams2_Score))","v":0},{"$f":"SUMPRODUCT((Teams1=U74)*(Teams2_Score))+SUMPRODUCT((Teams2=U74)*(Teams1_Score))","v":0},0,0]
[null,{"$f":"IF(COUNTIF($T$15:$T$18,1)>1,IF(ROWS($1:1)<=COUNTIF($T$15:$T$18,1),INDEX($U$15:$U$18,SMALL(IF($T$15:$T$18=1,ROW(INDIRECT(\"1:\"&ROWS($T$15:$T$18)))),ROWS($1:1))),\"\"),IF(COUNTIF($T$15:$T$18,2)>1,IF(ROWS($1:1)<=COUNTIF($T$15:$T$18,2),INDEX($U$15:$U$18,SMALL(IF($T$15:$T$18=2,ROW(INDIRECT(\"1:\"&ROWS($T$15:$T$18)))),ROWS($1:1))),\"\")))","v":"RI Iran"},null,null,null,null,null,null,null,null,null,null,null,null,null,null,"C_4",{"$f":"TEXT(S75,\"00000\")&U75","v":"00000Danemark"},{"$f":"AC75*1000+AB75*100+Z75*10","v":0},{"$f":"RANK(S75,$S72:$S76,0)","v":1},{"$f":"VLOOKUP(Q75,TABLEAU_TEAMS[#All],2,FALSE)","v":"Danemark"},{"$f":"SUMPRODUCT((Teams1=U75)*(Teams1_Score<>\"\"))+SUMPRODUCT((Teams2=U75)*(Teams2_Score<>\"\"))","v":0},{"$f":"SUMPRODUCT((Teams1=U75)*(Teams1_Score>Teams2_Score))+SUMPRODUCT((Teams2=U75)*(Teams2_Score>Teams1_Score))","v":0},{"$f":"SUMPRODUCT((Teams1=U75)*(Teams1_Score=Teams2_Score)*(Teams1_Score<>\"\"))+SUMPRODUCT((Teams2=U75)*(Teams2_Score=Teams1_Score)*(Teams2_Score<>\"\"))","v":0},{"$f":"SUMPRODUCT((Teams1=U75)*(Teams1_Score<Teams2_Score))+SUMPRODUCT((Teams2=U75)*(Teams2_Score<Teams1_Score))","v":0},{"$f":"SUMPRODUCT((Teams1=U75)*(Teams1_Score))+SUMPRODUCT((Teams2=U75)*(Teams2_Score))","v":0},{"$f":"SUMPRODUCT((Teams1=U75)*(Teams2_Score))+SUMPRODUCT((Teams2=U75)*(Teams1_Score))","v":0},0,0]
[null,{"$f":"IF(COUNTIF($T$15:$T$18,1)>1,IF(ROWS($1:2)<=COUNTIF($T$15:$T$18,1),INDEX($U$15:$U$18,SMALL(IF($T$15:$T$18=1,ROW(INDIRECT(\"1:\"&ROWS($T$15:$T$18)))),ROWS($1:2))),\"\"),IF(COUNTIF($T$15:$T$18,2)>1,IF(ROWS($1:2)<=COUNTIF($T$15:$T$18,2),INDEX($U$15:$U$18,SMALL(IF($T$15:$T$18=2,ROW(INDIRECT(\"1:\"&ROWS($T$15:$T$18)))),ROWS($1:2))),\"\")))","v":"Portugal"}]
[null,{"$f":"IF(COUNTIF($T$15:$T$18,1)>1,IF(ROWS($1:3)<=COUNTIF($T$15:$T$18,1),INDEX($U$15:$U$18,SMALL(IF($T$15:$T$18=1,ROW(INDIRECT(\"1:\"&ROWS($T$15:$T$18)))),ROWS($1:3))),\"\"),IF(COUNTIF($T$15:$T$18,2)>1,IF(ROWS($1:3)<=COUNTIF($T$15:$T$18,2),INDEX($U$15:$U$18,SMALL(IF($T$15:$T$18=2,ROW(INDIRECT(\"1:\"&ROWS($T$15:$T$18)))),ROWS($1:3))),\"\")))","v":"Maroc"},null,null,null,null,null,null,null,null,null,null,null,null,null,null,null,null,null,"Rg","Groupe D","MJ","G","N","P","BP","BC","Pts","Pts"]
[null,{"$f":"IF(COUNTIF($T$15:$T$18,1)>1,IF(ROWS($1:4)<=COUNTIF($T$15:$T$18,1),INDEX($U$15:$U$18,SMALL(IF($T$15:$T$18=1,ROW(INDIRECT(\"1:\"&ROWS($T$15:$T$18)))),ROWS($1:4))),\"\"),IF(COUNTIF($T$15:$T$18,2)>1,IF(ROWS($1:4)<=COUNTIF($T$15:$T$18,2),INDEX($U$15:$U$18,SMALL(IF($T$15:$T$18=2,ROW(INDIRECT(\"1:\"&ROWS($T$15:$T$18)))),ROWS($1:4))),\"\")))","v":"Espagne"},null,null,null,null,null,null,null,null,null,null,null,null,null,null,"D_1",{"$f":"TEXT(S78,\"00000\")&U78","v":"00000Argentine"},{"$f":"AC78*1000+AB78*100+Z78*10","v":0},{"$f":"RANK(S78,$S78:$S82,0)","v":1},{"$f":"VLOOKUP(Q78,TABLEAU_TEAMS[#All],2,FALSE)","v":"Argentine"},{"$f":"SUMPRODUCT((Teams1=U78)*(Teams1_Score<>\"\"))+SUMPRODUCT((Teams2=U78)*(Teams2_Score<>\"\"))","v":0},{"$f":"SUMPRODUCT((Teams1=U78)*(Teams1_Score>Teams2_Score))+SUMPRODUCT((Teams2=U78)*(Teams2_Score>Teams1_Score))","v":0},{"$f":"SUMPRODUCT((Teams1=U78)*(Teams1_Score=Teams2_Score)*(Teams1_Score<>\"\"))+SUMPRODUCT((Teams2=U78)*(Teams2_Score=Teams1_Score)*(Teams2_Score<>\"\"))","v":0},{"$f":"SUMPRODUCT((Teams1=U78)*(Teams1_Score<Teams2_Score))+SUMPRODUCT((Teams2=U78)*(Teams2_Score<Teams1_Score))","v":0},{"$f":"SUMPRODUCT((Teams1=U78)*(Teams1_Score))+SUMPRODUCT((Teams2=U78)*(Teams2_Score))","v":0},{"$f":"SUMPRODUCT((Teams1=U78)*(Teams2_Score))+SUMPRODUCT((Teams2=U78)*(Teams1_Score))","v":0},{"$f":"Z78-AA78","v":0},{"$f":"3*W78+X78","v":0}]
[null,"Tirage au sort C1",null,null,null,null,null,null,null,null,null,null,null,null,null,null,"D_2",{"$f":"TEXT(S79,\"00000\")&U79","v":"00000Islande"},{"$f":"AC79*1000+AB79*100+Z79*10","v":0},{"$f":"RANK(S79,$S78:$S82,0)","v":1},{"$f":"VLOOKUP(Q79,TABLEAU_TEAMS[#All],2,FALSE)","v":"Islande"},{"$f":"SUMPRODUCT((Teams1=U79)*(Teams1_Score<>\"\"))+SUMPRODUCT((Teams2=U79)*(Teams2_Score<>\"\"))","v":0},{"$f":"SUMPRODUCT((Teams1=U79)*(Teams1_Score>Teams2_Score))+SUMPRODUCT((Teams2=U79)*(Teams2_Score>Teams1_Score))","v":0},{"$f":"SUMPRODUCT((Teams1=U79)*(Teams1_Score=Teams2_Score)*(Teams1_Score<>\"\"))+SUMPRODUCT((Teams2=U79)*(Teams2_Score=Teams1_Score)*(Teams2_Score<>\"\"))","v":0},{"$f":"SUMPRODUCT((Teams1=U79)*(Teams1_Score<Teams2_Score))+SUMPRODUCT((Teams2=U79)*(Teams2_Score<Teams1_Score))","v":0},{"$f":"SUMPRODUCT((Teams1=U79)*(Teams1_Score))+SUMPRODUCT((Teams2=U79)*(Teams2_Score))","v":0},{"$f":"SUMPRODUCT((Teams1=U79)*(Teams2_Score))+SUMPRODUCT((Teams2=U79)*(Teams1_Score))","v":0},0,0]
[null,{"$f":"IF(ROWS($1:1)<=COUNTIF($T$21:$T$24,1),INDEX($U$21:$U$24,SMALL(IF($T$21:$T$24=1,ROW(INDIRECT(\"1:\"&ROWS($T$21:$T$24)))),ROWS($1:1))),\"\")","v":"Pérou"},null,null,null,null,null,null,null,null,null,null,null,null,null,null,"D_3",{"$f":"TEXT(S80,\"00000\")&U80","v":"00000Croatie"},{"$f":"AC80*1000+AB80*100+Z80*10","v":0},{"$f":"RANK(S80,$S78:$S82,0)","v":1},{"$f":"VLOOKUP(Q80,TABLEAU_TEAMS[#All],2,FALSE)","v":"Croatie"},{"$f":"SUMPRODUCT((Teams1=U80)*(Teams1_Score<>\"\"))+SUMPRODUCT((Teams2=U80)*(Teams2_Score<>\"\"))","v":0},{"$f":"SUMPRODUCT((Teams1=U80)*(Teams1_Score>Teams2_Score))+SUMPRODUCT((Teams2=U80)*(Teams2_Score>Teams1_Score))","v":0},{"$f":"SUMPRODUCT((Teams1=U80)*(Teams1_Score=Teams2_Score)*(Teams1_Score<>\"\"))+SUMPRODUCT((Teams2=U80)*(Teams2_Score=Teams1_Score)*(Teams2_Score<>\"\"))","v":0},{"$f":"SUMPRODUCT((Teams1=U80)*(Teams1_Score<Teams2_Score))+SUMPRODUCT((Teams2=U80)*(Teams2_Score<Teams1_Score))","v":0},{"$f":"SUMPRODUCT((Teams1=U80)*(Teams1_Score))+SUMPRODUCT((Teams2=U80)*(Teams2_Score))","v":0},{"$f":"SUMPRODUCT((Teams1=U80)*(Teams2_Score))+SUMPRODUCT((Teams2=U80)*(Teams1_Score))","v":0},0,0]
[null,{"$f":"IF(ROWS($1:2)<=COUNTIF($T$21:$T$24,1),INDEX($U$21:$U$24,SMALL(IF($T$21:$T$24=1,ROW(INDIRECT(\"1:\"&ROWS($T$21:$T$24)))),ROWS($1:2))),\"\")","v":"France"},null,null,null,null,null,null,null,null,null,null,null,null,null,null,"D_4",{"$f":"TEXT(S81,\"00000\")&U81","v":"00000Nigeria"},{"$f":"AC81*1000+AB81*100+Z81*10","v":0},{"$f":"RANK(S81,$S78:$S82,0)","v":1},{"$f":"VLOOKUP(Q81,TABLEAU_TEAMS[#All],2,FALSE)","v":"Nigeria"},{"$f":"SUMPRODUCT((Teams1=U81)*(Teams1_Score<>\"\"))+SUMPRODUCT((Teams2=U81)*(Teams2_Score<>\"\"))","v":0},{"$f":"SUMPRODUCT((Teams1=U81)*(Teams1_Score>Teams2_Score))+SUMPRODUCT((Teams2=U81)*(Teams2_Score>Teams1_Score))","v":0},{"$f":"SUMPRODUCT((Teams1=U81)*(Teams1_Score=Teams2_Score)*(Teams1_Score<>\"\"))+SUMPRODUCT((Teams2=U81)*(Teams2_Score=Teams1_Score)*(Teams2_Score<>\"\"))","v":0},{"$f":"SUMPRODUCT((Teams1=U81)*(Teams1_Score<Teams2_Score))+SUMPRODUCT((Teams2=U81)*(Teams2_Score<Teams1_Score))","v":0},{"$f":"SUMPRODUCT((Teams1=U81)*(Teams1_Score))+SUMPRODUCT((Teams2=U81)*(Teams2_Score))","v":0},{"$f":"SUMPRODUCT((Teams1=U81)*(Teams2_Score))+SUMPRODUCT((Teams2=U81)*(Teams1_Score))","v":0},0,0]
[null,{"$f":"IF(ROWS($1:3)<=COUNTIF($T$21:$T$24,1),INDEX($U$21:$U$24,SMALL(IF($T$21:$T$24=1,ROW(INDIRECT(\"1:\"&ROWS($T$21:$T$24)))),ROWS($1:3))),\"\")","v":"Danemark"}]
[null,{"$f":"IF(ROWS($1:4)<=COUNTIF($T$21:$T$24,1),INDEX($U$21:$U$24,SMALL(IF($T$21:$T$24=1,ROW(INDIRECT(\"1:\"&ROWS($T$21:$T$24)))),ROWS($1:4))),\"\")","v":"Australie"},null,null,null,null,null,null,null,null,null,null,null,null,null,null,null,null,null,"Rg","Groupe E","MJ","G","N","P","BP","BC","Pts","Pts"]
[null,"Tirage au sort C2",null,null,null,null,null,null,null,null,null,null,null,null,null,null,"E_1",{"$f":"TEXT(S84,\"00000\")&U84","v":"00000Costa Rica"},{"$f":"AC84*1000+AB84*100+Z84*10","v":0},{"$f":"RANK(S84,$S84:$S88,0)","v":1},{"$f":"VLOOKUP(Q84,TABLEAU_TEAMS[#All],2,FALSE)","v":"Costa Rica"},{"$f":"SUMPRODUCT((Teams1=U84)*(Teams1_Score<>\"\"))+SUMPRODUCT((Teams2=U84)*(Teams2_Score<>\"\"))","v":0},{"$f":"SUMPRODUCT((Teams1=U84)*(Teams1_Score>Teams2_Score))+SUMPRODUCT((Teams2=U84)*(Teams2_Score>Teams1_Score))","v":0},{"$f":"SUMPRODUCT((Teams1=U84)*(Teams1_Score=Teams2_Score)*(Teams1_Score<>\"\"))+SUMPRODUCT((Teams2=U84)*(Teams2_Score=Teams1_Score)*(Teams2_Score<>\"\"))","v":0},{"$f":"SUMPRODUCT((Teams1=U84)*(Teams1_Score<Teams2_Score))+SUMPRODUCT((Teams2=U84)*(Teams2_Score<Teams1_Score))","v":0},{"$f":"SUMPRODUCT((Teams1=U84)*(Teams1_Score))+SUMPRODUCT((Teams2=U84)*(Teams2_Score))","v":0},{"$f":"SUMPRODUCT((Teams1=U84)*(Teams2_Score))+SUMPRODUCT((Teams2=U84)*(Teams1_Score))","v":0},{"$f":"Z84-AA84","v":0},{"$f":"3*W84+X84","v":0}]
[null,{"$f":"IF(COUNTIF($T$21:$T$24,1)>1,IF(ROWS($1:1)<=COUNTIF($T$21:$T$24,1),INDEX($U$21:$U$24,SMALL(IF($T$21:$T$24=1,ROW(INDIRECT(\"1:\"&ROWS($T$21:$T$24)))),ROWS($1:1))),\"\"),IF(COUNTIF($T$21:$T$24,2)>1,IF(ROWS($1:1)<=COUNTIF($T$21:$T$24,2),INDEX($U$21:$U$24,SMALL(IF($T$21:$T$24=2,ROW(INDIRECT(\"1:\"&ROWS($T$21:$T$24)))),ROWS($1:1))),\"\")))","v":"Pérou"},null,null,null,null,null,null,null,null,null,null,null,null,null,null,"E_2",{"$f":"TEXT(S85,\"00000\")&U85","v":"00000Serbie"},{"$f":"AC85*1000+AB85*100+Z85*10","v":0},{"$f":"RANK(S85,$S84:$S88,0)","v":1},{"$f":"VLOOKUP(Q85,TABLEAU_TEAMS[#All],2,FALSE)","v":"Serbie"},{"$f":"SUMPRODUCT((Teams1=U85)*(Teams1_Score<>\"\"))+SUMPRODUCT((Teams2=U85)*(Teams2_Score<>\"\"))","v":0},{"$f":"SUMPRODUCT((Teams1=U85)*(Teams1_Score>Teams2_Score))+SUMPRODUCT((Teams2=U85)*(Teams2_Score>Teams1_Score))","v":0},{"$f":"SUMPRODUCT((Teams1=U85)*(Teams1_Score=Teams2_Score)*(Teams1_Score<>\"\"))+SUMPRODUCT((Teams2=U85)*(Teams2_Score=Teams1_Score)*(Teams2_Score<>\"\"))","v":0},{"$f":"SUMPRODUCT((Teams1=U85)*(Teams1_Score<Teams2_Score))+SUMPRODUCT((Teams2=U85)*(Teams2_Score<Teams1_Score))","v":0},{"$f":"SUMPRODUCT((Teams1=U85)*(Teams1_Score))+SUMPRODUCT((Teams2=U85)*(Teams2_Score))","v":0},{"$f":"SUMPRODUCT((Teams1=U85)*(Teams2_Score))+SUMPRODUCT((Teams2=U85)*(Teams1_Score))","v":0},0,0]
[null,{"$f":"IF(COUNTIF($T$21:$T$24,1)>1,IF(ROWS($1:2)<=COUNTIF($T$21:$T$24,1),INDEX($U$21:$U$24,SMALL(IF($T$21:$T$24=1,ROW(INDIRECT(\"1:\"&ROWS($T$21:$T$24)))),ROWS($1:2))),\"\"),IF(COUNTIF($T$21:$T$24,2)>1,IF(ROWS($1:2)<=COUNTIF($T$21:$T$24,2),INDEX($U$21:$U$24,SMALL(IF($T$21:$T$24=2,ROW(INDIRECT(\"1:\"&ROWS($T$21:$T$24)))),ROWS($1:2))),\"\")))","v":"France"},null,null,null,null,null,null,null,null,null,null,null,null,null,null,"E_3",{"$f":"TEXT(S86,\"00000\")&U86","v":"00000Brésil"},{"$f":"AC86*1000+AB86*100+Z86*10","v":0},{"$f":"RANK(S86,$S84:$S88,0)","v":1},{"$f":"VLOOKUP(Q86,TABLEAU_TEAMS[#All],2,FALSE)","v":"Brésil"},{"$f":"SUMPRODUCT((Teams1=U86)*(Teams1_Score<>\"\"))+SUMPRODUCT((Teams2=U86)*(Teams2_Score<>\"\"))","v":0},{"$f":"SUMPRODUCT((Teams1=U86)*(Teams1_Score>Teams2_Score))+SUMPRODUCT((Teams2=U86)*(Teams2_Score>Teams1_Score))","v":0},{"$f":"SUMPRODUCT((Teams1=U86)*(Teams1_Score=Teams2_Score)*(Teams1_Score<>\"\"))+SUMPRODUCT((Teams2=U86)*(Teams2_Score=Teams1_Score)*(Teams2_Score<>\"\"))","v":0},{"$f":"SUMPRODUCT((Teams1=U86)*(Teams1_Score<Teams2_Score))+SUMPRODUCT((Teams2=U86)*(Teams2_Score<Teams1_Score))","v":0},{"$f":"SUMPRODUCT((Teams1=U86)*(Teams1_Score))+SUMPRODUCT((Teams2=U86)*(Teams2_Score))","v":0},{"$f":"SUMPRODUCT((Teams1=U86)*(Teams2_Score))+SUMPRODUCT((Teams2=U86)*(Teams1_Score))","v":0},0,0]
[null,{"$f":"IF(COUNTIF($T$21:$T$24,1)>1,IF(ROWS($1:3)<=COUNTIF($T$21:$T$24,1),INDEX($U$21:$U$24,SMALL(IF($T$21:$T$24=1,ROW(INDIRECT(\"1:\"&ROWS($T$21:$T$24)))),ROWS($1:3))),\"\"),IF(COUNTIF($T$21:$T$24,2)>1,IF(ROWS($1:3)<=COUNTIF($T$21:$T$24,2),INDEX($U$21:$U$24,SMALL(IF($T$21:$T$24=2,ROW(INDIRECT(\"1:\"&ROWS($T$21:$T$24)))),ROWS($1:3))),\"\")))","v":"Danemark"},null,null,null,null,null,null,null,null,null,null,null,null,null,null,"E_4",{"$f":"TEXT(S87,\"00000\")&U87","v":"00000Suisse"},{"$f":"AC87*1000+AB87*100+Z87*10","v":0},{"$f":"RANK(S87,$S84:$S88,0)","v":1},{"$f":"VLOOKUP(Q87,TABLEAU_TEAMS[#All],2,FALSE)","v":"Suisse"},{"$f":"SUMPRODUCT((Teams1=U87)*(Teams1_Score<>\"\"))+SUMPRODUCT((Teams2=U87)*(Teams2_Score<>\"\"))","v":0},{"$f":"SUMPRODUCT((Teams1=U87)*(Teams1_Score>Teams2_Score))+SUMPRODUCT((Teams2=U87)*(Teams2_Score>Teams1_Score))","v":0},{"$f":"SUMPRODUCT((Teams1=U87)*(Teams1_Score=Teams2_Score)*(Teams1_Score<>\"\"))+SUMPRODUCT((Teams2=U87)*(Teams2_Score=Teams1_Score)*(Teams2_Score<>\"\"))","v":0},{"$f":"SUMPRODUCT((Teams1=U87)*(Teams1_Score<Teams2_Score))+SUMPRODUCT((Teams2=U87)*(Teams2_Score<Teams1_Score))","v":0},{"$f":"SUMPRODUCT((Teams1=U87)*(Teams1_Score))+SUMPRODUCT((Teams2=U87)*(Teams2_Score))","v":0},{"$f":"SUMPRODUCT((Teams1=U87)*(Teams2_Score))+SUMPRODUCT((Teams2=U87)*(Teams1_Score))","v":0},0,0]
[null,{"$f":"IF(COUNTIF($T$21:$T$24,1)>1,IF(ROWS($1:4)<=COUNTIF($T$21:$T$24,1),INDEX($U$21:$U$24,SMALL(IF($T$21:$T$24=1,ROW(INDIRECT(\"1:\"&ROWS($T$21:$T$24)))),ROWS($1:4))),\"\"),IF(COUNTIF($T$21:$T$24,2)>1,IF(ROWS($1:4)<=COUNTIF($T$21:$T$24,2),INDEX($U$21:$U$24,SMALL(IF($T$21:$T$24=2,ROW(INDIRECT(\"1:\"&ROWS($T$21:$T$24)))),ROWS($1:4))),\"\")))","v":"Australie"}]
[null,"Tirage au sort D1",null,null,null,null,null,null,null,null,null,null,null,null,null,null,null,null,null,"Rg","Groupe F","MJ","G","N","P","BP","BC","Pts","Pts"]
[null,{"$f":"IF(ROWS($1:1)<=COUNTIF($T$27:$T$30,1),INDEX($U$27:$U$30,SMALL(IF($T$27:$T$30=1,ROW(INDIRECT(\"1:\"&ROWS($T$27:$T$30)))),ROWS($1:1))),\"\")","v":"Nigeria"},null,null,null,null,null,null,null,null,null,null,null,null,null,null,"F_1",{"$f":"TEXT(S90,\"00000\")&U90","v":"00000Allemagne"},{"$f":"AC90*1000+AB90*100+Z90*10","v":0},{"$f":"RANK(S90,$S90:$S94,0)","v":1},{"$f":"VLOOKUP(Q90,TABLEAU_TEAMS[#All],2,FALSE)","v":"Allemagne"},{"$f":"SUMPRODUCT((Teams1=U90)*(Teams1_Score<>\"\"))+SUMPRODUCT((Teams2=U90)*(Teams2_Score<>\"\"))","v":0},{"$f":"SUMPRODUCT((Teams1=U90)*(Teams1_Score>Teams2_Score))+SUMPRODUCT((Teams2=U90)*(Teams2_Score>Teams1_Score))","v":0},{"$f":"SUMPRODUCT((Teams1=U90)*(Teams1_Score=Teams2_Score)*(Teams1_Score<>\"\"))+SUMPRODUCT((Teams2=U90)*(Teams2_Score=Teams1_Score)*(Teams2_Score<>\"\"))","v":0},{"$f":"SUMPRODUCT((Teams1=U90)*(Teams1_Score<Teams2_Score))+SUMPRODUCT((Teams2=U90)*(Teams2_Score<Teams1_Score))","v":0},{"$f":"SUMPRODUCT((Teams1=U90)*(Teams1_Score))+SUMPRODUCT((Teams2=U90)*(Teams2_Score))","v":0},{"$f":"SUMPRODUCT((Teams1=U90)*(Teams2_Score))+SUMPRODUCT((Teams2=U90)*(Teams1_Score))","v":0},{"$f":"Z90-AA90","v":0},{"$f":"3*W90+X90","v":0}]
[null,{"$f":"IF(ROWS($1:2)<=COUNTIF($T$27:$T$30,1),INDEX($U$27:$U$30,SMALL(IF($T$27:$T$30=1,ROW(INDIRECT(\"1:\"&ROWS($T$27:$T$30)))),ROWS($1:2))),\"\")","v":"Islande"},null,null,null,null,null,null,null,null,null,null,null,null,null,null,"F_2",{"$f":"TEXT(S91,\"00000\")&U91","v":"00000Mexique"},{"$f":"AC91*1000+AB91*100+Z91*10","v":0},{"$f":"RANK(S91,$S90:$S94,0)","v":1},{"$f":"VLOOKUP(Q91,TABLEAU_TEAMS[#All],2,FALSE)","v":"Mexique"},{"$f":"SUMPRODUCT((Teams1=U91)*(Teams1_Score<>\"\"))+SUMPRODUCT((Teams2=U91)*(Teams2_Score<>\"\"))","v":0},{"$f":"SUMPRODUCT((Teams1=U91)*(Teams1_Score>Teams2_Score))+SUMPRODUCT((Teams2=U91)*(Teams2_Score>Teams1_Score))","v":0},{"$f":"SUMPRODUCT((Teams1=U91)*(Teams1_Score=Teams2_Score)*(Teams1_Score<>\"\"))+SUMPRODUCT((Teams2=U91)*(Teams2_Score=Teams1_Score)*(Teams2_Score<>\"\"))","v":0},{"$f":"SUMPRODUCT((Teams1=U91)*(Teams1_Score<Teams2_Score))+SUMPRODUCT((Teams2=U91)*(Teams2_Score<Teams1_Score))","v":0},{"$f":"SUMPRODUCT((Teams1=U91)*(Teams1_Score))+SUMPRODUCT((Teams2=U91)*(Teams2_Score))","v":0},{"$f":"SUMPRODUCT((Teams1=U91)*(Teams2_Score))+SUMPRODUCT((Teams2=U91)*(Teams1_Score))","v":0},0,0]
[null,{"$f":"IF(ROWS($1:3)<=COUNTIF($T$27:$T$30,1),INDEX($U$27:$U$30,SMALL(IF($T$27:$T$30=1,ROW(INDIRECT(\"1:\"&ROWS($T$27:$T$30)))),ROWS($1:3))),\"\")","v":"Croatie"},null,null,null,null,null,null,null,null,null,null,null,null,null,null,"F_3",{"$f":"TEXT(S92,\"00000\")&U92","v":"00000Suède"},{"$f":"AC92*1000+AB92*100+Z92*10","v":0},{"$f":"RANK(S92,$S90:$S94,0)","v":1},{"$f":"VLOOKUP(Q92,TABLEAU_TEAMS[#All],2,FALSE)","v":"Suède"},{"$f":"SUMPRODUCT((Teams1=U92)*(Teams1_Score<>\"\"))+SUMPRODUCT((Teams2=U92)*(Teams2_Score<>\"\"))","v":0},{"$f":"SUMPRODUCT((Teams1=U92)*(Teams1_Score>Teams2_Score))+SUMPRODUCT((Teams2=U92)*(Teams2_Score>Teams1_Score))","v":0},{"$f":"SUMPRODUCT((Teams1=U92)*(Teams1_Score=Teams2_Score)*(Teams1_Score<>\"\"))+SUMPRODUCT((Teams2=U92)*(Teams2_Score=Teams1_Score)*(Teams2_Score<>\"\"))","v":0},{"$f":"SUMPRODUCT((Teams1=U92)*(Teams1_Score<Teams2_Score))+SUMPRODUCT((Teams2=U92)*(Teams2_Score<Teams1_Score))","v":0},{"$f":"SUMPRODUCT((Teams1=U92)*(Teams1_Score))+SUMPRODUCT((Teams2=U92)*(Teams2_Score))","v":0},{"$f":"SUMPRODUCT((Teams1=U92)*(Teams2_Score))+SUMPRODUCT((Teams2=U92)*(Teams1_Score))","v":0},0,0]
[null,{"$f":"IF(ROWS($1:4)<=COUNTIF($T$27:$T$30,1),INDEX($U$27:$U$30,SMALL(IF($T$27:$T$30=1,ROW(INDIRECT(\"1:\"&ROWS($T$27:$T$30)))),ROWS($1:4))),\"\")","v":"Argentine"},null,null,null,null,null,null,null,null,null,null,null,null,null,null,"F_4",{"$f":"TEXT(S93,\"00000\")&U93","v":"00000République de Corée"},{"$f":"AC93*1000+AB93*100+Z93*10","v":0},{"$f":"RANK(S93,$S90:$S94,0)","v":1},{"$f":"VLOOKUP(Q93,TABLEAU_TEAMS[#All],2,FALSE)","v":"République de Corée"},{"$f":"SUMPRODUCT((Teams1=U93)*(Teams1_Score<>\"\"))+SUMPRODUCT((Teams2=U93)*(Teams2_Score<>\"\"))","v":0},{"$f":"SUMPRODUCT((Teams1=U93)*(Teams1_Score>Teams2_Score))+SUMPRODUCT((Teams2=U93)*(Teams2_Score>Teams1_Score))","v":0},{"$f":"SUMPRODUCT((Teams1=U93)*(Teams1_Score=Teams2_Score)*(Teams1_Score<>\"\"))+SUMPRODUCT((Teams2=U93)*(Teams2_Score=Teams1_Score)*(Teams2_Score<>\"\"))","v":0},{"$f":"SUMPRODUCT((Teams1=U93)*(Teams1_Score<Teams2_Score))+SUMPRODUCT((Teams2=U93)*(Teams2_Score<Teams1_Score))","v":0},{"$f":"SUMPRODUCT((Teams1=U93)*(Teams1_Score))+SUMPRODUCT((Teams2=U93)*(Teams2_Score))","v":0},{"$f":"SUMPRODUCT((Teams1=U93)*(Teams2_Score))+SUMPRODUCT((Teams2=U93)*(Teams1_Score))","v":0},0,0]
[null,"Tirage au sort D2"]
[null,{"$f":"IF(COUNTIF($T$27:$T$30,1)>1,IF(ROWS($1:1)<=COUNTIF($T$27:$T$30,1),INDEX($U$27:$U$30,SMALL(IF($T$27:$T$30=1,ROW(INDIRECT(\"1:\"&ROWS($T$27:$T$30)))),ROWS($1:1))),\"\"),IF(COUNTIF($T$27:$T$30,2)>1,IF(ROWS($1:1)<=COUNTIF($T$27:$T$30,2),INDEX($U$27:$U$30,SMALL(IF($T$27:$T$30=2,ROW(INDIRECT(\"1:\"&ROWS($T$27:$T$30)))),ROWS($1:1))),\"\")))","v":"Nigeria"},null,null,null,null,null,null,null,null,null,null,null,null,null,null,null,null,null,"Rg","Groupe G","MJ","G","N","P","BP","BC","Pts","Pts"]
[null,{"$f":"IF(COUNTIF($T$27:$T$30,1)>1,IF(ROWS($1:2)<=COUNTIF($T$27:$T$30,1),INDEX($U$27:$U$30,SMALL(IF($T$27:$T$30=1,ROW(INDIRECT(\"1:\"&ROWS($T$27:$T$30)))),ROWS($1:2))),\"\"),IF(COUNTIF($T$27:$T$30,2)>1,IF(ROWS($1:2)<=COUNTIF($T$27:$T$30,2),INDEX($U$27:$U$30,SMALL(IF($T$27:$T$30=2,ROW(INDIRECT(\"1:\"&ROWS($T$27:$T$30)))),ROWS($1:2))),\"\")))","v":"Islande"},null,null,null,null,null,null,null,null,null,null,null,null,null,null,"G_1",{"$f":"TEXT(S96,\"00000\")&U96","v":"00000Belgique"},{"$f":"AC96*1000+AB96*100+Z96*10","v":0},{"$f":"RANK(S96,$S96:$S100,0)","v":1},{"$f":"VLOOKUP(Q96,TABLEAU_TEAMS[#All],2,FALSE)","v":"Belgique"},{"$f":"SUMPRODUCT((Teams1=U96)*(Teams1_Score<>\"\"))+SUMPRODUCT((Teams2=U96)*(Teams2_Score<>\"\"))","v":0},{"$f":"SUMPRODUCT((Teams1=U96)*(Teams1_Score>Teams2_Score))+SUMPRODUCT((Teams2=U96)*(Teams2_Score>Teams1_Score))","v":0},{"$f":"SUMPRODUCT((Teams1=U96)*(Teams1_Score=Teams2_Score)*(Teams1_Score<>\"\"))+SUMPRODUCT((Teams2=U96)*(Teams2_Score=Teams1_Score)*(Teams2_Score<>\"\"))","v":0},{"$f":"SUMPRODUCT((Teams1=U96)*(Teams1_Score<Teams2_Score))+SUMPRODUCT((Teams2=U96)*(Teams2_Score<Teams1_Score))","v":0},{"$f":"SUMPRODUCT((Teams1=U96)*(Teams1_Score))+SUMPRODUCT((Teams2=U96)*(Teams2_Score))","v":0},{"$f":"SUMPRODUCT((Teams1=U96)*(Teams2_Score))+SUMPRODUCT((Teams2=U96)*(Teams1_Score))","v":0},{"$f":"Z96-AA96","v":0},{"$f":"3*W96+X96","v":0}]
[null,{"$f":"IF(COUNTIF($T$27:$T$30,1)>1,IF(ROWS($1:3)<=COUNTIF($T$27:$T$30,1),INDEX($U$27:$U$30,SMALL(IF($T$27:$T$30=1,ROW(INDIRECT(\"1:\"&ROWS($T$27:$T$30)))),ROWS($1:3))),\"\"),IF(COUNTIF($T$27:$T$30,2)>1,IF(ROWS($1:3)<=COUNTIF($T$27:$T$30,2),INDEX($U$27:$U$30,SMALL(IF($T$27:$T$30=2,ROW(INDIRECT(\"1:\"&ROWS($T$27:$T$30)))),ROWS($1:3))),\"\")))","v":"Croatie"},null,null,null,null,null,null,null,null,null,null,null,null,null,null,"G_2",{"$f":"TEXT(S97,\"00000\")&U97","v":"00000Panama"},{"$f":"AC97*1000+AB97*100+Z97*10","v":0},{"$f":"RANK(S97,$S96:$S100,0)","v":1},{"$f":"VLOOKUP(Q97,TABLEAU_TEAMS[#All],2,FALSE)","v":"Panama"},{"$f":"SUMPRODUCT((Teams1=U97)*(Teams1_Score<>\"\"))+SUMPRODUCT((Teams2=U97)*(Teams2_Score<>\"\"))","v":0},{"$f":"SUMPRODUCT((Teams1=U97)*(Teams1_Score>Teams2_Score))+SUMPRODUCT((Teams2=U97)*(Teams2_Score>Teams1_Score))","v":0},{"$f":"SUMPRODUCT((Teams1=U97)*(Teams1_Score=Teams2_Score)*(Teams1_Score<>\"\"))+SUMPRODUCT((Teams2=U97)*(Teams2_Score=Teams1_Score)*(Teams2_Score<>\"\"))","v":0},{"$f":"SUMPRODUCT((Teams1=U97)*(Teams1_Score<Teams2_Score))+SUMPRODUCT((Teams2=U97)*(Teams2_Score<Teams1_Score))","v":0},{"$f":"SUMPRODUCT((Teams1=U97)*(Teams1_Score))+SUMPRODUCT((Teams2=U97)*(Teams2_Score))","v":0},{"$f":"SUMPRODUCT((Teams1=U97)*(Teams2_Score))+SUMPRODUCT((Teams2=U97)*(Teams1_Score))","v":0},0,0]
[null,{"$f":"IF(COUNTIF($T$27:$T$30,1)>1,IF(ROWS($1:4)<=COUNTIF($T$27:$T$30,1),INDEX($U$27:$U$30,SMALL(IF($T$27:$T$30=1,ROW(INDIRECT(\"1:\"&ROWS($T$27:$T$30)))),ROWS($1:4))),\"\"),IF(COUNTIF($T$27:$T$30,2)>1,IF(ROWS($1:4)<=COUNTIF($T$27:$T$30,2),INDEX($U$27:$U$30,SMALL(IF($T$27:$T$30=2,ROW(INDIRECT(\"1:\"&ROWS($T$27:$T$30)))),ROWS($1:4))),\"\")))","v":"Argentine"},null,null,null,null,null,null,null,null,null,null,null,null,null,null,"G_3",{"$f":"TEXT(S98,\"00000\")&U98","v":"00000Tunisie"},{"$f":"AC98*1000+AB98*100+Z98*10","v":0},{"$f":"RANK(S98,$S96:$S100,0)","v":1},{"$f":"VLOOKUP(Q98,TABLEAU_TEAMS[#All],2,FALSE)","v":"Tunisie"},{"$f":"SUMPRODUCT((Teams1=U98)*(Teams1_Score<>\"\"))+SUMPRODUCT((Teams2=U98)*(Teams2_Score<>\"\"))","v":0},{"$f":"SUMPRODUCT((Teams1=U98)*(Teams1_Score>Teams2_Score))+SUMPRODUCT((Teams2=U98)*(Teams2_Score>Teams1_Score))","v":0},{"$f":"SUMPRODUCT((Teams1=U98)*(Teams1_Score=Teams2_Score)*(Teams1_Score<>\"\"))+SUMPRODUCT((Teams2=U98)*(Teams2_Score=Teams1_Score)*(Teams2_Score<>\"\"))","v":0},{"$f":"SUMPRODUCT((Teams1=U98)*(Teams1_Score<Teams2_Score))+SUMPRODUCT((Teams2=U98)*(Teams2_Score<Teams1_Score))","v":0},{"$f":"SUMPRODUCT((Teams1=U98)*(Teams1_Score))+SUMPRODUCT((Teams2=U98)*(Teams2_Score))","v":0},{"$f":"SUMPRODUCT((Teams1=U98)*(Teams2_Score))+SUMPRODUCT((Teams2=U98)*(Teams1_Score))","v":0},0,0]
[null,"Tirage au sort E1",null,null,null,null,null,null,null,null,null,null,null,null,null,null,"G_4",{"$f":"TEXT(S99,\"00000\")&U99","v":"00000Angleterre"},{"$f":"AC99*1000+AB99*100+Z99*10","v":0},{"$f":"RANK(S99,$S96:$S100,0)","v":1},{"$f":"VLOOKUP(Q99,TABLEAU_TEAMS[#All],2,FALSE)","v":"Angleterre"},{"$f":"SUMPRODUCT((Teams1=U99)*(Teams1_Score<>\"\"))+SUMPRODUCT((Teams2=U99)*(Teams2_Score<>\"\"))","v":0},{"$f":"SUMPRODUCT((Teams1=U99)*(Teams1_Score>Teams2_Score))+SUMPRODUCT((Teams2=U99)*(Teams2_Score>Teams1_Score))","v":0},{"$f":"SUMPRODUCT((Teams1=U99)*(Teams1_Score=Teams2_Score)*(Teams1_Score<>\"\"))+SUMPRODUCT((Teams2=U99)*(Teams2_Score=Teams1_Score)*(Teams2_Score<>\"\"))","v":0},{"$f":"SUMPRODUCT((Teams1=U99)*(Teams1_Score<Teams2_Score))+SUMPRODUCT((Teams2=U99)*(Teams2_Score<Teams1_Score))","v":0},{"$f":"SUMPRODUCT((Teams1=U99)*(Teams1_Score))+SUMPRODUCT((Teams2=U99)*(Teams2_Score))","v":0},{"$f":"SUMPRODUCT((Teams1=U99)*(Teams2_Score))+SUMPRODUCT((Teams2=U99)*(Teams1_Score))","v":0},0,0]
[null,{"$f":"IF(ROWS($1:1)<=COUNTIF($T$33:$T$36,1),INDEX($U$33:$U$36,SMALL(IF($T$33:$T$36=1,ROW(INDIRECT(\"1:\"&ROWS($T$33:$T$36)))),ROWS($1:1))),\"\")","v":"Suisse"}]
[null,{"$f":"IF(ROWS($1:2)<=COUNTIF($T$33:$T$36,1),INDEX($U$33:$U$36,SMALL(IF($T$33:$T$36=1,ROW(INDIRECT(\"1:\"&ROWS($T$33:$T$36)))),ROWS($1:2))),\"\")","v":"Serbie"},null,null,null,null,null,null,null,null,null,null,null,null,null,null,null,null,null,"Rg","Groupe H","MJ","G","N","P","BP","BC","Pts","Pts"]
[null,{"$f":"IF(ROWS($1:3)<=COUNTIF($T$33:$T$36,1),INDEX($U$33:$U$36,SMALL(IF($T$33:$T$36=1,ROW(INDIRECT(\"1:\"&ROWS($T$33:$T$36)))),ROWS($1:3))),\"\")","v":"Costa Rica"},null,null,null,null,null,null,null,null,null,null,null,null,null,null,"H_1",{"$f":"TEXT(S102,\"00000\")&U102","v":"00000Colombie"},{"$f":"AC102*1000+AB102*100+Z102*10","v":0},{"$f":"RANK(S102,$S102:$S106,0)","v":1},{"$f":"VLOOKUP(Q102,TABLEAU_TEAMS[#All],2,FALSE)","v":"Colombie"},{"$f":"SUMPRODUCT((Teams1=U102)*(Teams1_Score<>\"\"))+SUMPRODUCT((Teams2=U102)*(Teams2_Score<>\"\"))","v":0},{"$f":"SUMPRODUCT((Teams1=U102)*(Teams1_Score>Teams2_Score))+SUMPRODUCT((Teams2=U102)*(Teams2_Score>Teams1_Score))","v":0},{"$f":"SUMPRODUCT((Teams1=U102)*(Teams1_Score=Teams2_Score)*(Teams1_Score<>\"\"))+SUMPRODUCT((Teams2=U102)*(Teams2_Score=Teams1_Score)*(Teams2_Score<>\"\"))","v":0},{"$f":"SUMPRODUCT((Teams1=U102)*(Teams1_Score<Teams2_Score))+SUMPRODUCT((Teams2=U102)*(Teams2_Score<Teams1_Score))","v":0},{"$f":"SUMPRODUCT((Teams1=U102)*(Teams1_Score))+SUMPRODUCT((Teams2=U102)*(Teams2_Score))","v":0},{"$f":"SUMPRODUCT((Teams1=U102)*(Teams2_Score))+SUMPRODUCT((Teams2=U102)*(Teams1_Score))","v":0},{"$f":"Z102-AA102","v":0},{"$f":"3*W102+X102","v":0}]
[null,{"$f":"IF(ROWS($1:4)<=COUNTIF($T$33:$T$36,1),INDEX($U$33:$U$36,SMALL(IF($T$33:$T$36=1,ROW(INDIRECT(\"1:\"&ROWS($T$33:$T$36)))),ROWS($1:4))),\"\")","v":"Brésil"},null,null,null,null,null,null,null,null,null,null,null,null,null,null,"H_2",{"$f":"TEXT(S103,\"00000\")&U103","v":"00000Japon"},{"$f":"AC103*1000+AB103*100+Z103*10","v":0},{"$f":"RANK(S103,$S102:$S106,0)","v":1},{"$f":"VLOOKUP(Q103,TABLEAU_TEAMS[#All],2,FALSE)","v":"Japon"},{"$f":"SUMPRODUCT((Teams1=U103)*(Teams1_Score<>\"\"))+SUMPRODUCT((Teams2=U103)*(Teams2_Score<>\"\"))","v":0},{"$f":"SUMPRODUCT((Teams1=U103)*(Teams1_Score>Teams2_Score))+SUMPRODUCT((Teams2=U103)*(Teams2_Score>Teams1_Score))","v":0},{"$f":"SUMPRODUCT((Teams1=U103)*(Teams1_Score=Teams2_Score)*(Teams1_Score<>\"\"))+SUMPRODUCT((Teams2=U103)*(Teams2_Score=Teams1_Score)*(Teams2_Score<>\"\"))","v":0},{"$f":"SUMPRODUCT((Teams1=U103)*(Teams1_Score<Teams2_Score))+SUMPRODUCT((Teams2=U103)*(Teams2_Score<Teams1_Score))","v":0},{"$f":"SUMPRODUCT((Teams1=U103)*(Teams1_Score))+SUMPRODUCT((Teams2=U103)*(Teams2_Score))","v":0},{"$f":"SUMPRODUCT((Teams1=U103)*(Teams2_Score))+SUMPRODUCT((Teams2=U103)*(Teams1_Score))","v":0},0,0]
[null,"Tirage au sort E2",null,null,null,null,null,null,null,null,null,null,null,null,null,null,"H_3",{"$f":"TEXT(S104,\"00000\")&U104","v":"00000Pologne"},{"$f":"AC104*1000+AB104*100+Z104*10","v":0},{"$f":"RANK(S104,$S102:$S106,0)","v":1},{"$f":"VLOOKUP(Q104,TABLEAU_TEAMS[#All],2,FALSE)","v":"Pologne"},{"$f":"SUMPRODUCT((Teams1=U104)*(Teams1_Score<>\"\"))+SUMPRODUCT((Teams2=U104)*(Teams2_Score<>\"\"))","v":0},{"$f":"SUMPRODUCT((Teams1=U104)*(Teams1_Score>Teams2_Score))+SUMPRODUCT((Teams2=U104)*(Teams2_Score>Teams1_Score))","v":0},{"$f":"SUMPRODUCT((Teams1=U104)*(Teams1_Score=Teams2_Score)*(Teams1_Score<>\"\"))+SUMPRODUCT((Teams2=U104)*(Teams2_Score=Teams1_Score)*(Teams2_Score<>\"\"))","v":0},{"$f":"SUMPRODUCT((Teams1=U104)*(Teams1_Score<Teams2_Score))+SUMPRODUCT((Teams2=U104)*(Teams2_Score<Teams1_Score))","v":0},{"$f":"SUMPRODUCT((Teams1=U104)*(Teams1_Score))+SUMPRODUCT((Teams2=U104)*(Teams2_Score))","v":0},{"$f":"SUMPRODUCT((Teams1=U104)*(Teams2_Score))+SUMPRODUCT((Teams2=U104)*(Teams1_Score))","v":0},0,0]
[null,{"$f":"IF(COUNTIF($T$33:$T$36,1)>1,IF(ROWS($1:1)<=COUNTIF($T$33:$T$36,1),INDEX($U$33:$U$36,SMALL(IF($T$33:$T$36=1,ROW(INDIRECT(\"1:\"&ROWS($T$33:$T$36)))),ROWS($1:1))),\"\"),IF(COUNTIF($T$33:$T$36,2)>1,IF(ROWS($1:1)<=COUNTIF($T$33:$T$36,2),INDEX($U$33:$U$36,SMALL(IF($T$33:$T$36=2,ROW(INDIRECT(\"1:\"&ROWS($T$33:$T$36)))),ROWS($1:1))),\"\")))","v":"Suisse"},null,null,null,null,null,null,null,null,null,null,null,null,null,null,"H_4",{"$f":"TEXT(S105,\"00000\")&U105","v":"00000Sénégal"},{"$f":"AC105*1000+AB105*100+Z105*10","v":0},{"$f":"RANK(S105,$S102:$S106,0)","v":1},{"$f":"VLOOKUP(Q105,TABLEAU_TEAMS[#All],2,FALSE)","v":"Sénégal"},{"$f":"SUMPRODUCT((Teams1=U105)*(Teams1_Score<>\"\"))+SUMPRODUCT((Teams2=U105)*(Teams2_Score<>\"\"))","v":0},{"$f":"SUMPRODUCT((Teams1=U105)*(Teams1_Score>Teams2_Score))+SUMPRODUCT((Teams2=U105)*(Teams2_Score>Teams1_Score))","v":0},{"$f":"SUMPRODUCT((Teams1=U105)*(Teams1_Score=Teams2_Score)*(Teams1_Score<>\"\"))+SUMPRODUCT((Teams2=U105)*(Teams2_Score=Teams1_Score)*(Teams2_Score<>\"\"))","v":0},{"$f":"SUMPRODUCT((Teams1=U105)*(Teams1_Score<Teams2_Score))+SUMPRODUCT((Teams2=U105)*(Teams2_Score<Teams1_Score))","v":0},{"$f":"SUMPRODUCT((Teams1=U105)*(Teams1_Score))+SUMPRODUCT((Teams2=U105)*(Teams2_Score))","v":0},{"$f":"SUMPRODUCT((Teams1=U105)*(Teams2_Score))+SUMPRODUCT((Teams2=U105)*(Teams1_Score))","v":0},0,0]
[null,{"$f":"IF(COUNTIF($T$33:$T$36,1)>1,IF(ROWS($1:2)<=COUNTIF($T$33:$T$36,1),INDEX($U$33:$U$36,SMALL(IF($T$33:$T$36=1,ROW(INDIRECT(\"1:\"&ROWS($T$33:$T$36)))),ROWS($1:2))),\"\"),IF(COUNTIF($T$33:$T$36,2)>1,IF(ROWS($1:2)<=COUNTIF($T$33:$T$36,2),INDEX($U$33:$U$36,SMALL(IF($T$33:$T$36=2,ROW(INDIRECT(\"1:\"&ROWS($T$33:$T$36)))),ROWS($1:2))),\"\")))","v":"Serbie"}]
[null,{"$f":"IF(COUNTIF($T$33:$T$36,1)>1,IF(ROWS($1:3)<=COUNTIF($T$33:$T$36,1),INDEX($U$33:$U$36,SMALL(IF($T$33:$T$36=1,ROW(INDIRECT(\"1:\"&ROWS($T$33:$T$36)))),ROWS($1:3))),\"\"),IF(COUNTIF($T$33:$T$36,2)>1,IF(ROWS($1:3)<=COUNTIF($T$33:$T$36,2),INDEX($U$33:$U$36,SMALL(IF($T$33:$T$36=2,ROW(INDIRECT(\"1:\"&ROWS($T$33:$T$36)))),ROWS($1:3))),\"\")))","v":"Costa Rica"}]
[null,{"$f":"IF(COUNTIF($T$33:$T$36,1)>1,IF(ROWS($1:4)<=COUNTIF($T$33:$T$36,1),INDEX($U$33:$U$36,SMALL(IF($T$33:$T$36=1,ROW(INDIRECT(\"1:\"&ROWS($T$33:$T$36)))),ROWS($1:4))),\"\"),IF(COUNTIF($T$33:$T$36,2)>1,IF(ROWS($1:4)<=COUNTIF($T$33:$T$36,2),INDEX($U$33:$U$36,SMALL(IF($T$33:$T$36=2,ROW(INDIRECT(\"1:\"&ROWS($T$33:$T$36)))),ROWS($1:4))),\"\")))","v":"Brésil"}]
[null,"Tirage au sort F1"]
[null,{"$f":"IF(ROWS($1:1)<=COUNTIF($T$39:$T$42,1),INDEX($U$39:$U$42,SMALL(IF($T$39:$T$42=1,ROW(INDIRECT(\"1:\"&ROWS($T$39:$T$42)))),ROWS($1:1))),\"\")","v":"Suède"}]
[null,{"$f":"IF(ROWS($1:2)<=COUNTIF($T$39:$T$42,1),INDEX($U$39:$U$42,SMALL(IF($T$39:$T$42=1,ROW(INDIRECT(\"1:\"&ROWS($T$39:$T$42)))),ROWS($1:2))),\"\")","v":"République de Corée"}]
[null,{"$f":"IF(ROWS($1:3)<=COUNTIF($T$39:$T$42,1),INDEX($U$39:$U$42,SMALL(IF($T$39:$T$42=1,ROW(INDIRECT(\"1:\"&ROWS($T$39:$T$42)))),ROWS($1:3))),\"\")","v":"Mexique"}]
[null,{"$f":"IF(ROWS($1:4)<=COUNTIF($T$39:$T$42,1),INDEX($U$39:$U$42,SMALL(IF($T$39:$T$42=1,ROW(INDIRECT(\"1:\"&ROWS($T$39:$T$42)))),ROWS($1:4))),\"\")","v":"Allemagne"}]
[null,"Tirage au sort F2"]
[null,{"$f":"IF(COUNTIF($T$39:$T$42,1)>1,IF(ROWS($1:1)<=COUNTIF($T$39:$T$42,1),INDEX($U$39:$U$42,SMALL(IF($T$39:$T$42=1,ROW(INDIRECT(\"1:\"&ROWS($T$39:$T$42)))),ROWS($1:1))),\"\"),IF(COUNTIF($T$39:$T$42,2)>1,IF(ROWS($1:1)<=COUNTIF($T$39:$T$42,2),INDEX($U$39:$U$42,SMALL(IF($T$39:$T$42=2,ROW(INDIRECT(\"1:\"&ROWS($T$39:$T$42)))),ROWS($1:1))),\"\")))","v":"Suède"}]
[null,{"$f":"IF(COUNTIF($T$39:$T$42,1)>1,IF(ROWS($1:2)<=COUNTIF($T$39:$T$42,1),INDEX($U$39:$U$42,SMALL(IF($T$39:$T$42=1,ROW(INDIRECT(\"1:\"&ROWS($T$39:$T$42)))),ROWS($1:2))),\"\"),IF(COUNTIF($T$39:$T$42,2)>1,IF(ROWS($1:2)<=COUNTIF($T$39:$T$42,2),INDEX($U$39:$U$42,SMALL(IF($T$39:$T$42=2,ROW(INDIRECT(\"1:\"&ROWS($T$39:$T$42)))),ROWS($1:2))),\"\")))","v":"République de Corée"}]
[null,{"$f":"IF(COUNTIF($T$39:$T$42,1)>1,IF(ROWS($1:3)<=COUNTIF($T$39:$T$42,1),INDEX($U$39:$U$42,SMALL(IF($T$39:$T$42=1,ROW(INDIRECT(\"1:\"&ROWS($T$39:$T$42)))),ROWS($1:3))),\"\"),IF(COUNTIF($T$39:$T$42,2)>1,IF(ROWS($1:3)<=COUNTIF($T$39:$T$42,2),INDEX($U$39:$U$42,SMALL(IF($T$39:$T$42=2,ROW(INDIRECT(\"1:\"&ROWS($T$39:$T$42)))),ROWS($1:3))),\"\")))","v":"Mexique"}]
[null,{"$f":"IF(COUNTIF($T$39:$T$42,1)>1,IF(ROWS($1:4)<=COUNTIF($T$39:$T$42,1),INDEX($U$39:$U$42,SMALL(IF($T$39:$T$42=1,ROW(INDIRECT(\"1:\"&ROWS($T$39:$T$42)))),ROWS($1:4))),\"\"),IF(COUNTIF($T$39:$T$42,2)>1,IF(ROWS($1:4)<=COUNTIF($T$39:$T$42,2),INDEX($U$39:$U$42,SMALL(IF($T$39:$T$42=2,ROW(INDIRECT(\"1:\"&ROWS($T$39:$T$42)))),ROWS($1:4))),\"\")))","v":"Allemagne"}]
[null,"Tirage au sort G1"]
[null,{"$f":"IF(ROWS($1:1)<=COUNTIF($T$45:$T$48,1),INDEX($U$45:$U$48,SMALL(IF($T$45:$T$48=1,ROW(INDIRECT(\"1:\"&ROWS($T$45:$T$48)))),ROWS($1:1))),\"\")","v":"Tunisie"}]
[null,{"$f":"IF(ROWS($1:2)<=COUNTIF($T$45:$T$48,1),INDEX($U$45:$U$48,SMALL(IF($T$45:$T$48=1,ROW(INDIRECT(\"1:\"&ROWS($T$45:$T$48)))),ROWS($1:2))),\"\")","v":"Panama"}]
[null,{"$f":"IF(ROWS($1:3)<=COUNTIF($T$45:$T$48,1),INDEX($U$45:$U$48,SMALL(IF($T$45:$T$48=1,ROW(INDIRECT(\"1:\"&ROWS($T$45:$T$48)))),ROWS($1:3))),\"\")","v":"Belgique"}]
[null,{"$f":"IF(ROWS($1:4)<=COUNTIF($T$45:$T$48,1),INDEX($U$45:$U$48,SMALL(IF($T$45:$T$48=1,ROW(INDIRECT(\"1:\"&ROWS($T$45:$T$48)))),ROWS($1:4))),\"\")","v":"Angleterre"}]
[null,"Tirage au sort G2"]
[null,{"$f":"IF(COUNTIF($T$45:$T$48,1)>1,IF(ROWS($1:1)<=COUNTIF($T$45:$T$48,1),INDEX($U$45:$U$48,SMALL(IF($T$45:$T$48=1,ROW(INDIRECT(\"1:\"&ROWS($T$45:$T$48)))),ROWS($1:1))),\"\"),IF(COUNTIF($T$45:$T$48,2)>1,IF(ROWS($1:1)<=COUNTIF($T$45:$T$48,2),INDEX($U$45:$U$48,SMALL(IF($T$45:$T$48=2,ROW(INDIRECT(\"1:\"&ROWS($T$45:$T$48)))),ROWS($1:1))),\"\")))","v":"Tunisie"}]
[null,{"$f":"IF(COUNTIF($T$45:$T$48,1)>1,IF(ROWS($1:2)<=COUNTIF($T$45:$T$48,1),INDEX($U$45:$U$48,SMALL(IF($T$45:$T$48=1,ROW(INDIRECT(\"1:\"&ROWS($T$45:$T$48)))),ROWS($1:2))),\"\"),IF(COUNTIF($T$45:$T$48,2)>1,IF(ROWS($1:2)<=COUNTIF($T$45:$T$48,2),INDEX($U$45:$U$48,SMALL(IF($T$45:$T$48=2,ROW(INDIRECT(\"1:\"&ROWS($T$45:$T$48)))),ROWS($1:2))),\"\")))","v":"Panama"}]
[null,{"$f":"IF(COUNTIF($T$45:$T$48,1)>1,IF(ROWS($1:3)<=COUNTIF($T$45:$T$48,1),INDEX($U$45:$U$48,SMALL(IF($T$45:$T$48=1,ROW(INDIRECT(\"1:\"&ROWS($T$45:$T$48)))),ROWS($1:3))),\"\"),IF(COUNTIF($T$45:$T$48,2)>1,IF(ROWS($1:3)<=COUNTIF($T$45:$T$48,2),INDEX($U$45:$U$48,SMALL(IF($T$45:$T$48=2,ROW(INDIRECT(\"1:\"&ROWS($T$45:$T$48)))),ROWS($1:3))),\"\")))","v":"Belgique"}]
[null,{"$f":"IF(COUNTIF($T$45:$T$48,1)>1,IF(ROWS($1:4)<=COUNTIF($T$45:$T$48,1),INDEX($U$45:$U$48,SMALL(IF($T$45:$T$48=1,ROW(INDIRECT(\"1:\"&ROWS($T$45:$T$48)))),ROWS($1:4))),\"\"),IF(COUNTIF($T$45:$T$48,2)>1,IF(ROWS($1:4)<=COUNTIF($T$45:$T$48,2),INDEX($U$45:$U$48,SMALL(IF($T$45:$T$48=2,ROW(INDIRECT(\"1:\"&ROWS($T$45:$T$48)))),ROWS($1:4))),\"\")))","v":"Angleterre"}]
[null,"Tirage au sort H1"]
[null,{"$f":"IF(ROWS($1:1)<=COUNTIF($T$51:$T$54,1),INDEX($U$51:$U$54,SMALL(IF($T$51:$T$54=1,ROW(INDIRECT(\"1:\"&ROWS($T$51:$T$54)))),ROWS($1:1))),\"\")","v":"Sénégal"}]
[null,{"$f":"IF(ROWS($1:2)<=COUNTIF($T$51:$T$54,1),INDEX($U$51:$U$54,SMALL(IF($T$51:$T$54=1,ROW(INDIRECT(\"1:\"&ROWS($T$51:$T$54)))),ROWS($1:2))),\"\")","v":"Pologne"}]
[null,{"$f":"IF(ROWS($1:3)<=COUNTIF($T$51:$T$54,1),INDEX($U$51:$U$54,SMALL(IF($T$51:$T$54=1,ROW(INDIRECT(\"1:\"&ROWS($T$51:$T$54)))),ROWS($1:3))),\"\")","v":"Japon"}]
[null,{"$f":"IF(ROWS($1:4)<=COUNTIF($T$51:$T$54,1),INDEX($U$51:$U$54,SMALL(IF($T$51:$T$54=1,ROW(INDIRECT(\"1:\"&ROWS($T$51:$T$54)))),ROWS($1:4))),\"\")","v":"Colombie"}]
[null,"Tirage au sort H2"]
[null,{"$f":"IF(COUNTIF($T$51:$T$54,1)>1,IF(ROWS($1:1)<=COUNTIF($T$51:$T$54,1),INDEX($U$51:$U$54,SMALL(IF($T$51:$T$54=1,ROW(INDIRECT(\"1:\"&ROWS($T$51:$T$54)))),ROWS($1:1))),\"\"),IF(COUNTIF($T$51:$T$54,2)>1,IF(ROWS($1:1)<=COUNTIF($T$51:$T$54,2),INDEX($U$51:$U$54,SMALL(IF($T$51:$T$54=2,ROW(INDIRECT(\"1:\"&ROWS($T$51:$T$54)))),ROWS($1:1))),\"\")))","v":"Sénégal"}]
[null,{"$f":"IF(COUNTIF($T$51:$T$54,1)>1,IF(ROWS($1:2)<=COUNTIF($T$51:$T$54,1),INDEX($U$51:$U$54,SMALL(IF($T$51:$T$54=1,ROW(INDIRECT(\"1:\"&ROWS($T$51:$T$54)))),ROWS($1:2))),\"\"),IF(COUNTIF($T$51:$T$54,2)>1,IF(ROWS($1:2)<=COUNTIF($T$51:$T$54,2),INDEX($U$51:$U$54,SMALL(IF($T$51:$T$54=2,ROW(INDIRECT(\"1:\"&ROWS($T$51:$T$54)))),ROWS($1:2))),\"\")))","v":"Pologne"}]
[null,{"$f":"IF(COUNTIF($T$51:$T$54,1)>1,IF(ROWS($1:3)<=COUNTIF($T$51:$T$54,1),INDEX($U$51:$U$54,SMALL(IF($T$51:$T$54=1,ROW(INDIRECT(\"1:\"&ROWS($T$51:$T$54)))),ROWS($1:3))),\"\"),IF(COUNTIF($T$51:$T$54,2)>1,IF(ROWS($1:3)<=COUNTIF($T$51:$T$54,2),INDEX($U$51:$U$54,SMALL(IF($T$51:$T$54=2,ROW(INDIRECT(\"1:\"&ROWS($T$51:$T$54)))),ROWS($1:3))),\"\")))","v":"Japon"}]
[null,{"$f":"IF(COUNTIF($T$51:$T$54,1)>1,IF(ROWS($1:4)<=COUNTIF($T$51:$T$54,1),INDEX($U$51:$U$54,SMALL(IF($T$51:$T$54=1,ROW(INDIRECT(\"1:\"&ROWS($T$51:$T$54)))),ROWS($1:4))),\"\"),IF(COUNTIF($T$51:$T$54,2)>1,IF(ROWS($1:4)<=COUNTIF($T$51:$T$54,2),INDEX($U$51:$U$54,SMALL(IF($T$51:$T$54=2,ROW(INDIRECT(\"1:\"&ROWS($T$51:$T$54)))),ROWS($1:4))),\"\")))","v":"Colombie"}]