{"text_format":"1","workbook":"xlsx","n_sheets":8,"sheets":["EDI","DED","F1","F2","IF_ICE","ANAL","4415","JC"],"not_rendered":{"charts":0,"images":8,"macros":1,"external_links":0,"defined_names":6,"comments":0,"pivot_tables":0},"unopened":[],"bounds":{"document_bytes":16777216,"sheet_cells":100000,"rows_first":2000,"rows_last":500,"rows_between":2000,"halvings":0,"cell_chars":16384,"cell_head_chars":4096},"cells_cut":0,"cells_raw":0,"read":"whole","date_system":"1900"}

{"sheet":"EDI","index":0,"n_rows":116,"n_cols":18,"rows_kept":116,"cut":false,"hidden":false,"merged":[[1,0,1,1],[0,12,0,13],[4,5,4,11],[5,5,5,11],[2,0,2,1],[3,0,3,1],[4,0,4,1],[5,0,5,1]]}
[null,null,null,null,null,null,null,null,null,null,null,null,"Modèle n° ADC082F-15I"]
["RAISON SOCIAL",null,"SOCIETE"]
["ID_FISCAL",null,0]
["ANNEE",null,2018]
["PERIODE(Mois)",null,5,null,null,"Relevé de déduction"]
["REGIME(Encais-1)",null,1,null,null,"(Article 112 du Code Général des Impôts)"]
[]
["OR","FACT_NUM","DESIGNATION","M_HT","TVA","M_TTC","IF","LIB_FRSS","ICE_FRS","pro","TAUX","ID_P","DATE_PAIE","DATE_FAC","dfac"]
[1,{"$f":"IF(ISERROR(VLOOKUP(A9,DED!A:N,2,0)),\"\",(VLOOKUP(A9,DED!A:N,2,0)))","v":""},{"$f":"IF(ISERROR(VLOOKUP(A9,DED!A:N,3,0)),\"\",(VLOOKUP(A9,DED!A:N,3,0)))","v":""},{"$f":"IF(ISERROR(VLOOKUP(A9,DED!A:O,4,0)),\"\",(VLOOKUP(A9,DED!A:O,4,0)))","v":""},{"$f":"IF(ISERROR(VLOOKUP(A9,DED!A:O,5,0)),\"\",(VLOOKUP(A9,DED!A:O,5,0)))","v":""},{"$f":"IF(ISERROR(VLOOKUP(A9,DED!A:O,6,0)),\"\",(VLOOKUP(A9,DED!A:O,6,0)))","v":""},{"$f":"IF(ISERROR(VLOOKUP(A9,DED!A:O,7,0)),\"\",(VLOOKUP(A9,DED!A:O,7,0)))","v":""},{"$f":"IF(ISERROR(VLOOKUP(A9,DED!A:O,8,0)),\"\",(VLOOKUP(A9,DED!A:O,8,0)))","v":""},{"$f":"IF(ISERROR(VLOOKUP(A9,DED!A:O,9,0)),\"\",(VLOOKUP(A9,DED!A:O,9,0)))","v":""},100,{"$f":"IF(ISERROR(VLOOKUP(A9,DED!A:O,10,0)),\"\",(VLOOKUP(A9,DED!A:O,10,0)))","v":""},{"$f":"IF(ISERROR(VLOOKUP(A9,DED!A:O,12,0)),\"\",(VLOOKUP(A9,DED!A:O,12,0)))","v":""},{"$f":"IF(ISERROR(VLOOKUP(A9,DED!A:P,13,0)),\"\",(VLOOKUP(A9,DED!A:P,13,0)))","v":""},{"$f":"IF(ISERROR(VLOOKUP(A9,DED!A:P,14,0)),\"\",(VLOOKUP(A9,DED!A:P,14,0)))","v":""}]
[2,{"$f":"IF(ISERROR(VLOOKUP(A10,DED!A:N,2,0)),\"\",(VLOOKUP(A10,DED!A:N,2,0)))","v":""},{"$f":"IF(ISERROR(VLOOKUP(A10,DED!A:N,3,0)),\"\",(VLOOKUP(A10,DED!A:N,3,0)))","v":""},{"$f":"IF(ISERROR(VLOOKUP(A10,DED!A:O,4,0)),\"\",(VLOOKUP(A10,DED!A:O,4,0)))","v":""},{"$f":"IF(ISERROR(VLOOKUP(A10,DED!A:O,5,0)),\"\",(VLOOKUP(A10,DED!A:O,5,0)))","v":""},{"$f":"IF(ISERROR(VLOOKUP(A10,DED!A:O,6,0)),\"\",(VLOOKUP(A10,DED!A:O,6,0)))","v":""},{"$f":"IF(ISERROR(VLOOKUP(A10,DED!A:O,7,0)),\"\",(VLOOKUP(A10,DED!A:O,7,0)))","v":""},{"$f":"IF(ISERROR(VLOOKUP(A10,DED!A:O,8,0)),\"\",(VLOOKUP(A10,DED!A:O,8,0)))","v":""},{"$f":"IF(ISERROR(VLOOKUP(A10,DED!A:O,9,0)),\"\",(VLOOKUP(A10,DED!A:O,9,0)))","v":""},100,{"$f":"IF(ISERROR(VLOOKUP(A10,DED!A:O,10,0)),\"\",(VLOOKUP(A10,DED!A:O,10,0)))","v":""},{"$f":"IF(ISERROR(VLOOKUP(A10,DED!A:O,12,0)),\"\",(VLOOKUP(A10,DED!A:O,12,0)))","v":""},{"$f":"IF(ISERROR(VLOOKUP(A10,DED!A:P,13,0)),\"\",(VLOOKUP(A10,DED!A:P,13,0)))","v":""},{"$f":"IF(ISERROR(VLOOKUP(A10,DED!A:P,14,0)),\"\",(VLOOKUP(A10,DED!A:P,14,0)))","v":""}]
[3,{"$f":"IF(ISERROR(VLOOKUP(A11,DED!A:N,2,0)),\"\",(VLOOKUP(A11,DED!A:N,2,0)))","v":""},{"$f":"IF(ISERROR(VLOOKUP(A11,DED!A:N,3,0)),\"\",(VLOOKUP(A11,DED!A:N,3,0)))","v":""},{"$f":"IF(ISERROR(VLOOKUP(A11,DED!A:O,4,0)),\"\",(VLOOKUP(A11,DED!A:O,4,0)))","v":""},{"$f":"IF(ISERROR(VLOOKUP(A11,DED!A:O,5,0)),\"\",(VLOOKUP(A11,DED!A:O,5,0)))","v":""},{"$f":"IF(ISERROR(VLOOKUP(A11,DED!A:O,6,0)),\"\",(VLOOKUP(A11,DED!A:O,6,0)))","v":""},{"$f":"IF(ISERROR(VLOOKUP(A11,DED!A:O,7,0)),\"\",(VLOOKUP(A11,DED!A:O,7,0)))","v":""},{"$f":"IF(ISERROR(VLOOKUP(A11,DED!A:O,8,0)),\"\",(VLOOKUP(A11,DED!A:O,8,0)))","v":""},{"$f":"IF(ISERROR(VLOOKUP(A11,DED!A:O,9,0)),\"\",(VLOOKUP(A11,DED!A:O,9,0)))","v":""},100,{"$f":"IF(ISERROR(VLOOKUP(A11,DED!A:O,10,0)),\"\",(VLOOKUP(A11,DED!A:O,10,0)))","v":""},{"$f":"IF(ISERROR(VLOOKUP(A11,DED!A:O,12,0)),\"\",(VLOOKUP(A11,DED!A:O,12,0)))","v":""},{"$f":"IF(ISERROR(VLOOKUP(A11,DED!A:P,13,0)),\"\",(VLOOKUP(A11,DED!A:P,13,0)))","v":""},{"$f":"IF(ISERROR(VLOOKUP(A11,DED!A:P,14,0)),\"\",(VLOOKUP(A11,DED!A:P,14,0)))","v":""}]
[4,{"$f":"IF(ISERROR(VLOOKUP(A12,DED!A:N,2,0)),\"\",(VLOOKUP(A12,DED!A:N,2,0)))","v":""},{"$f":"IF(ISERROR(VLOOKUP(A12,DED!A:N,3,0)),\"\",(VLOOKUP(A12,DED!A:N,3,0)))","v":""},{"$f":"IF(ISERROR(VLOOKUP(A12,DED!A:O,4,0)),\"\",(VLOOKUP(A12,DED!A:O,4,0)))","v":""},{"$f":"IF(ISERROR(VLOOKUP(A12,DED!A:O,5,0)),\"\",(VLOOKUP(A12,DED!A:O,5,0)))","v":""},{"$f":"IF(ISERROR(VLOOKUP(A12,DED!A:O,6,0)),\"\",(VLOOKUP(A12,DED!A:O,6,0)))","v":""},{"$f":"IF(ISERROR(VLOOKUP(A12,DED!A:O,7,0)),\"\",(VLOOKUP(A12,DED!A:O,7,0)))","v":""},{"$f":"IF(ISERROR(VLOOKUP(A12,DED!A:O,8,0)),\"\",(VLOOKUP(A12,DED!A:O,8,0)))","v":""},{"$f":"IF(ISERROR(VLOOKUP(A12,DED!A:O,9,0)),\"\",(VLOOKUP(A12,DED!A:O,9,0)))","v":""},100,{"$f":"IF(ISERROR(VLOOKUP(A12,DED!A:O,10,0)),\"\",(VLOOKUP(A12,DED!A:O,10,0)))","v":""},{"$f":"IF(ISERROR(VLOOKUP(A12,DED!A:O,12,0)),\"\",(VLOOKUP(A12,DED!A:O,12,0)))","v":""},{"$f":"IF(ISERROR(VLOOKUP(A12,DED!A:P,13,0)),\"\",(VLOOKUP(A12,DED!A:P,13,0)))","v":""},{"$f":"IF(ISERROR(VLOOKUP(A12,DED!A:P,14,0)),\"\",(VLOOKUP(A12,DED!A:P,14,0)))","v":""}]
[5,{"$f":"IF(ISERROR(VLOOKUP(A13,DED!A:N,2,0)),\"\",(VLOOKUP(A13,DED!A:N,2,0)))","v":""},{"$f":"IF(ISERROR(VLOOKUP(A13,DED!A:N,3,0)),\"\",(VLOOKUP(A13,DED!A:N,3,0)))","v":""},{"$f":"IF(ISERROR(VLOOKUP(A13,DED!A:O,4,0)),\"\",(VLOOKUP(A13,DED!A:O,4,0)))","v":""},{"$f":"IF(ISERROR(VLOOKUP(A13,DED!A:O,5,0)),\"\",(VLOOKUP(A13,DED!A:O,5,0)))","v":""},{"$f":"IF(ISERROR(VLOOKUP(A13,DED!A:O,6,0)),\"\",(VLOOKUP(A13,DED!A:O,6,0)))","v":""},{"$f":"IF(ISERROR(VLOOKUP(A13,DED!A:O,7,0)),\"\",(VLOOKUP(A13,DED!A:O,7,0)))","v":""},{"$f":"IF(ISERROR(VLOOKUP(A13,DED!A:O,8,0)),\"\",(VLOOKUP(A13,DED!A:O,8,0)))","v":""},{"$f":"IF(ISERROR(VLOOKUP(A13,DED!A:O,9,0)),\"\",(VLOOKUP(A13,DED!A:O,9,0)))","v":""},100,{"$f":"IF(ISERROR(VLOOKUP(A13,DED!A:O,10,0)),\"\",(VLOOKUP(A13,DED!A:O,10,0)))","v":""},{"$f":"IF(ISERROR(VLOOKUP(A13,DED!A:O,12,0)),\"\",(VLOOKUP(A13,DED!A:O,12,0)))","v":""},{"$f":"IF(ISERROR(VLOOKUP(A13,DED!A:P,13,0)),\"\",(VLOOKUP(A13,DED!A:P,13,0)))","v":""},{"$f":"IF(ISERROR(VLOOKUP(A13,DED!A:P,14,0)),\"\",(VLOOKUP(A13,DED!A:P,14,0)))","v":""}]
[6,{"$f":"IF(ISERROR(VLOOKUP(A14,DED!A:N,2,0)),\"\",(VLOOKUP(A14,DED!A:N,2,0)))","v":""},{"$f":"IF(ISERROR(VLOOKUP(A14,DED!A:N,3,0)),\"\",(VLOOKUP(A14,DED!A:N,3,0)))","v":""},{"$f":"IF(ISERROR(VLOOKUP(A14,DED!A:O,4,0)),\"\",(VLOOKUP(A14,DED!A:O,4,0)))","v":""},{"$f":"IF(ISERROR(VLOOKUP(A14,DED!A:O,5,0)),\"\",(VLOOKUP(A14,DED!A:O,5,0)))","v":""},{"$f":"IF(ISERROR(VLOOKUP(A14,DED!A:O,6,0)),\"\",(VLOOKUP(A14,DED!A:O,6,0)))","v":""},{"$f":"IF(ISERROR(VLOOKUP(A14,DED!A:O,7,0)),\"\",(VLOOKUP(A14,DED!A:O,7,0)))","v":""},{"$f":"IF(ISERROR(VLOOKUP(A14,DED!A:O,8,0)),\"\",(VLOOKUP(A14,DED!A:O,8,0)))","v":""},{"$f":"IF(ISERROR(VLOOKUP(A14,DED!A:O,9,0)),\"\",(VLOOKUP(A14,DED!A:O,9,0)))","v":""},100,{"$f":"IF(ISERROR(VLOOKUP(A14,DED!A:O,10,0)),\"\",(VLOOKUP(A14,DED!A:O,10,0)))","v":""},{"$f":"IF(ISERROR(VLOOKUP(A14,DED!A:O,12,0)),\"\",(VLOOKUP(A14,DED!A:O,12,0)))","v":""},{"$f":"IF(ISERROR(VLOOKUP(A14,DED!A:P,13,0)),\"\",(VLOOKUP(A14,DED!A:P,13,0)))","v":""},{"$f":"IF(ISERROR(VLOOKUP(A14,DED!A:P,14,0)),\"\",(VLOOKUP(A14,DED!A:P,14,0)))","v":""}]
[7,{"$f":"IF(ISERROR(VLOOKUP(A15,DED!A:N,2,0)),\"\",(VLOOKUP(A15,DED!A:N,2,0)))","v":""},{"$f":"IF(ISERROR(VLOOKUP(A15,DED!A:N,3,0)),\"\",(VLOOKUP(A15,DED!A:N,3,0)))","v":""},{"$f":"IF(ISERROR(VLOOKUP(A15,DED!A:O,4,0)),\"\",(VLOOKUP(A15,DED!A:O,4,0)))","v":""},{"$f":"IF(ISERROR(VLOOKUP(A15,DED!A:O,5,0)),\"\",(VLOOKUP(A15,DED!A:O,5,0)))","v":""},{"$f":"IF(ISERROR(VLOOKUP(A15,DED!A:O,6,0)),\"\",(VLOOKUP(A15,DED!A:O,6,0)))","v":""},{"$f":"IF(ISERROR(VLOOKUP(A15,DED!A:O,7,0)),\"\",(VLOOKUP(A15,DED!A:O,7,0)))","v":""},{"$f":"IF(ISERROR(VLOOKUP(A15,DED!A:O,8,0)),\"\",(VLOOKUP(A15,DED!A:O,8,0)))","v":""},{"$f":"IF(ISERROR(VLOOKUP(A15,DED!A:O,9,0)),\"\",(VLOOKUP(A15,DED!A:O,9,0)))","v":""},100,{"$f":"IF(ISERROR(VLOOKUP(A15,DED!A:O,10,0)),\"\",(VLOOKUP(A15,DED!A:O,10,0)))","v":""},{"$f":"IF(ISERROR(VLOOKUP(A15,DED!A:O,12,0)),\"\",(VLOOKUP(A15,DED!A:O,12,0)))","v":""},{"$f":"IF(ISERROR(VLOOKUP(A15,DED!A:P,13,0)),\"\",(VLOOKUP(A15,DED!A:P,13,0)))","v":""},{"$f":"IF(ISERROR(VLOOKUP(A15,DED!A:P,14,0)),\"\",(VLOOKUP(A15,DED!A:P,14,0)))","v":""}]
{"$rows_left_out":102}
{"sheet":"DED","index":1,"n_rows":149,"n_cols":16,"rows_kept":149,"cut":false,"hidden":false,"merged":[[148,4,148,5],[139,4,139,5],[140,4,140,5],[141,4,141,5],[143,4,143,5],[144,4,144,5],[147,4,147,5],[145,4,145,5],[138,4,138,5],[0,8,0,10],[141,1,141,2],[143,6,143,7],[12,8,12,15],[148,1,148,3],[5,4,6,7],[7,4,8,7],[10,4,10,7],[130,4,130,5],[131,4,131,5],[132,4,132,5],[133,4,133,5],[134,4,134,5],[135,4,135,5],[136,4,136,5],[137,4,137,5],[146,4,146,5],[127,1,127,2],[128,1,128,2],[138,1,138,2]]}
[null,null,null,null,null,null,null,null,null,null,null,null,null,"Modèle n° ADC082F-15I"]
[]
[]
[]
[]
[null,null,null,null,"Relevé de déduction"]
[]
[null,null,null,null,"(Article 112 du Code Général des Impôts)"]
[]
[]
[null,null,null,null,{"$f":"CONCATENATE(\"Mois / _\",EDI!C5,\"_ / - Année / _2_ / _0_ / _1_ / _8_ /\")","v":"Mois / _5_ / - Année / _2_ / _0_ / _1_ / _8_ /"}]
[]
["Nom et prénom ou raison sociale : SOCIETE",null,null,null,null,null,null,null,"N° d'identification fiscale : /_0_ /_1_ /_0_ /_8_ /_7_ /_8_ /_6_ /_1_ / "]
["OR","FACT_NUM","DESIGNATION","M_HT","TVA","M_TTC","IF","LIB_FRSS","ICE","TAUX","PRORATA","ID","DATE_PAIE","DATE_FAC",null,"MODE_PAIE"]
[null,null,null,{"$f":"+F15-E15","v":0},{"$f":"+F15/6","v":0},null,null,null,null,20,100]
{"$rows_left_out":135}
{"sheet":"F1","index":2,"n_rows":141,"n_cols":63,"rows_kept":141,"cut":false,"hidden":true,"merged":[[7,49,7,59],[9,0,9,62],[23,42,23,61],[25,42,25,61],[27,42,27,61],[10,12,10,22],[29,42,29,61],[31,1,31,40],[31,41,31,51],[31,52,31,62],[15,49,15,62],[18,1,18,40],[18,41,18,62],[19,42,19,61],[21,42,21,61],[38,1,38,40],[38,42,38,50],[38,53,38,61],[40,1,40,40],[40,42,40,50],[40,53,40,61],[32,1,32,40],[33,42,34,50],[33,53,34,61],[34,1,34,40],[36,1,36,40],[36,42,36,50],[36,53,36,61],[46,1,46,40],[47,1,47,40],[49,1,49,40],[49,42,49,50],[49,53,49,61],[51,1,51,40],[51,42,51,50],[51,53,51,61],[42,1,42,40],[42,42,42,50],[42,53,42,61],[44,1,44,40],[44,42,44,50],[44,53,44,61],[56,1,56,40],[57,1,57,40],[57,42,57,50],[57,53,57,61],[58,1,58,40],[60,1,60,40],[53,1,53,40],[53,42,53,50],[53,53,53,61],[55,1,55,40],[55,42,55,50],[55,53,55,61],[63,1,63,40],[65,1,65,40],[65,42,65,50],[65,53,65,61],[67,1,67,40],[67,42,67,50],[67,53,67,61],[61,1,61,40],[61,42,61,50],[61,53,61,61],[62,1,62,40],[62,42,62,50],[62,53,62,61],[72,1,72,40],[72,42,72,50],[72,53,72,61],[74,1,74,40],[74,42,74,50],[74,53,74,61],[68,1,68,40],[69,1,69,40],[69,42,69,50],[69,53,69,61],[70,1,70,40],[70,42,70,50],[70,53,70,61],[80,1,80,40],[80,42,80,50],[80,53,80,61],[82,1,82,40],[82,42,82,50],[82,53,82,61],[76,1,76,40],[76,42,76,50],[76,53,76,61],[78,1,78,40],[78,42,78,50],[78,53,78,61],[88,1,88,40],[88,42,88,50],[88,53,88,61],[90,1,90,40],[90,42,90,50],[90,53,90,61],[84,1,84,40],[84,42,84,50],[84,53,84,61],[86,1,86,40],[86,42,86,50],[86,53,86,61],[96,1,96,40],[96,42,96,50],[96,53,96,61],[98,1,98,40],[98,42,98,50],[98,53,98,61],[92,1,92,40],[92,42,92,50],[92,53,92,61],[94,1,94,40],[94,42,94,50],[94,53,94,61],[106,1,106,40],[106,42,106,50],[106,53,106,61],[108,1,108,40],[108,42,108,50],[108,53,108,61],[100,1,100,40],[100,42,100,50],[100,53,100,61],[102,1,102,40],[104,1,104,40],[104,42,104,50],[104,53,104,61],[113,42,113,50],[113,53,113,61],[115,1,115,40],[115,42,115,50],[115,53,115,61],[109,1,109,40],[109,42,109,50],[109,53,109,61],[111,1,111,40],[111,42,111,50],[111,53,111,61],[4,18,4,43],[5,18,5,43],[133,1,133,51],[133,53,133,61],[126,53,126,61],[129,1,129,51],[130,0,131,0],[130,1,131,38],[130,42,130,50],[130,53,130,61],[131,42,131,50],[121,1,121,40],[121,42,121,50],[121,53,121,61],[123,1,123,40],[123,42,123,50],[123,53,123,61],[117,1,117,40],[117,42,117,50],[117,53,117,61],[119,1,119,40],[119,42,119,50],[119,53,119,61],[113,1,113,40]]}
[null,null,null,null,null,null,null,null,null,null,null,null,null,null,null,null,null,null,null,null,null,null,null,null,null,null,null,null,null,null,null,null,null,null,null,null,null,null,null,null,null,null,null,null,null,null,null,null,null,null,null,null,"Modèle n°: ADC100F-15E"]
[]
[]
[]
[null,null,null,null,null,null,null,null,null,null,null,null,null,null,null,null,null,null,"TAXE SUR LA VALEUR AJOUTEE"]
["DRI, DP ou DIP de :",null,null,null,null,null,null,null,null,null,null,null,null,null,null,null,null,null,"Déclaration  Mensuelle"]
["...............................................",null,null,null,null,null,null,null,null,null,null,null,null,null,null,null,null,null,null,null,null,"Article 110 du Code Général des Impôts (CGI)"]
["Subdivision : ……………….",null,null,null,null,null,null,null,null,null,null,null,null,null,null,null,null,null,null,null,null,null,{"$f":"CONCATENATE(\"Mois / _\",EDI!C5,\"_ / - Année / _2_ / _0_ / _1_ / _8_ /\")","v":"Mois / _5_ / - Année / _2_ / _0_ / _1_ / _8_ /"}]
[null,null,null,null,null,null,null,null,null,null,null,null,null,null,null,null,null,null,"     Fait générateur :     /__/ Débit           /_X_/  Encaissement"]
["IDENTIFICATION DU CONTRIBUABLE"]
["N°d’identification fiscale:",null,null,null,null,null,null,null,null,null,null,null,1087861,null,null,null,null,null,null,null,null,null,null,null,null,null,null,null,"C.N.I ou Carte de séjour N°:"]
["Identifiant commun de l’entreprise « ICE » :",null,null,null,null,null,null,null,null,null,null,null,null,null,null,null,"/_0_/_0_/_1_/_5_/_3_/_7_/_2_/_5_/_5_/    /_0_/_0_/_0_/_0_/    /_2_/_7_/"]
["Nom, Prénom (s) ou Raison Sociale :",null,null,null,null,null,null,null,null,null,null,null,null,null,null,null,null,null,"MC PHARMA"]
["Activité principale :",null,null,null,null,null,null,null,null,null,null,"LABORATOIRE PHARMACEUTIQUE"]
["Adresse du siège social, du principal établissement ou du domicile fiscal :",null,null,null,null,null,null,null,null,null,null,null,null,null,null,null,null,null,null,null,null,null,null,null,null,null,null,null,null,null,null,null,null,null,null,null,"LOTISSEMENT BACHKOU LOT 10, RUE 7"]
{"$rows_left_out":127}
{"sheet":"F2","index":3,"n_rows":114,"n_cols":48,"rows_kept":114,"cut":false,"hidden":true,"merged":[[1,31,3,41],[1,42,3,45],[1,46,3,56],[4,0,4,2],[4,3,4,27],[5,0,5,2],[5,3,5,27],[6,0,6,2],[6,3,6,27],[1,0,3,2],[1,3,3,27],[1,28,3,30],[13,32,13,40],[13,47,13,55],[9,28,9,30],[10,0,10,2],[10,3,10,27],[10,28,10,30],[10,32,10,40],[10,47,10,55],[6,28,6,30],[6,32,6,40],[6,47,6,55],[8,0,8,2],[8,3,8,27],[8,28,8,30],[8,32,8,40],[8,47,8,55],[14,28,14,30],[15,0,15,2],[15,3,15,27],[15,28,15,30],[16,3,16,27],[16,28,16,30],[12,0,12,2],[12,3,12,27],[13,3,13,27],[13,28,13,30],[19,3,19,27],[19,28,19,30],[20,0,20,2],[20,3,20,27],[20,28,20,30],[20,32,20,40],[16,32,16,40],[16,47,16,55],[17,28,17,30],[18,0,18,2],[18,3,18,27],[18,28,18,30],[18,32,18,40],[18,47,18,55],[23,28,23,30],[24,0,24,2],[24,3,24,27],[24,28,24,30],[24,32,24,40],[24,47,24,55],[20,47,20,55],[21,28,21,30],[22,0,22,2],[22,3,22,27],[22,28,22,30],[22,32,22,40],[22,47,22,55],[27,28,27,30],[28,0,28,2],[28,3,28,27],[28,28,28,30],[28,32,28,40],[28,47,28,55],[25,28,25,30],[26,0,26,2],[26,3,26,27],[26,28,26,30],[26,32,26,40],[26,47,26,55],[31,28,31,30],[32,0,32,2],[32,3,32,27],[32,28,32,30],[32,32,32,40],[32,47,32,55],[29,28,29,30],[30,0,30,2],[30,3,30,27],[30,28,30,30],[30,32,30,40],[30,47,30,55],[35,28,35,30],[36,0,36,2],[36,3,36,27],[36,28,36,30],[36,32,36,40],[36,47,36,55],[33,28,33,30],[34,0,34,2],[34,3,34,27],[34,28,34,30],[34,32,34,40],[34,47,34,55],[40,47,40,55],[41,0,41,2],[41,3,41,27],[37,28,37,30],[38,0,38,2],[38,3,38,27],[38,28,38,30],[38,32,38,40],[38,47,38,55],[42,3,42,27],[42,28,42,30],[43,0,43,2],[43,3,43,27],[43,28,43,30],[43,32,43,40],[40,0,40,2],[40,3,40,27],[40,32,40,40],[46,28,46,30],[47,0,47,2],[47,3,47,27],[47,28,47,30],[47,32,47,40],[47,47,47,55],[43,47,43,55],[44,28,44,30],[45,0,45,2],[45,3,45,27],[45,28,45,30],[45,32,45,40],[45,47,45,55],[50,28,50,30],[51,0,51,2],[51,3,51,27],[51,28,51,30],[51,32,51,40],[51,47,51,55],[48,28,48,30],[49,0,49,2],[49,3,49,27],[49,28,49,30],[49,32,49,40],[49,47,49,55],[54,28,54,30],[55,0,55,2],[55,3,55,27],[55,28,55,30],[55,32,55,40],[55,47,55,55],[52,28,52,30],[53,0,53,2],[53,3,53,27],[53,28,53,30],[53,32,53,40],[53,47,53,55],[58,28,58,30],[59,0,59,2],[59,3,59,27],[59,28,59,30],[59,32,59,40],[59,47,59,55],[56,28,56,30],[57,0,57,2],[57,3,57,27],[57,28,57,30],[57,32,57,40],[57,47,57,55],[67,0,67,2],[67,3,67,45],[67,47,67,55],[69,0,69,2],[69,3,69,45],[69,47,69,55],[61,0,61,2],[61,3,61,27],[61,32,61,40],[61,47,61,55],[64,0,64,2],[64,3,64,45],[64,47,64,55],[78,0,78,56],[79,0,79,56],[80,38,80,44],[80,45,80,46],[80,47,80,55],[81,37,81,56],[71,0,71,2],[71,47,71,55],[73,0,73,2],[73,47,73,55],[75,0,75,2],[75,47,75,55],[80,36,80,37],[83,0,83,56],[84,0,84,27],[84,28,84,56],[85,0,85,27],[85,28,85,56],[86,0,86,13],[86,14,86,27],[86,28,86,41],[86,42,86,56]]}
[","]
["D",null,null," Ventilation des déductions ",null,null,null,null,null,null,null,null,null,null,null,null,null,null,null,null,null,null,null,null,null,null,null,null,"Taux ",null,null,"TVA figurant sur factures\nd'achat ou mémoires",null,null,null,null,null,null,null,null,null,null,"%                                                                                                                                                                                                                                                                             prorata (*)",null,null,null,"TVA\nDéductible"]
[]
[]
[null,null,null,"1-ACHATS NON IMMOBILISES"]
[null,null,null,"Prestations de services"]
[140,null,null,"- Prestations de services",null,null,null,null,null,null,null,null,null,null,null,null,null,null,null,null,null,null,null,null,null,null,null,null,0.2,null,null,null,{"$f":"DED!E131+DED!E132","v":0},null,null,null,null,null,null,null,null,null,null,null,null,null,null,{"$f":"AG7","v":0}]
[]
[141,null,null,"- Transport",null,null,null,null,null,null,null,null,null,null,null,null,null,null,null,null,null,null,null,null,null,null,null,null,0.14000000000000001,null,null,null,{"$f":"+DED!E139","v":0},null,null,null,null,null,null,null,null,null,null,null,null,null,null,{"$f":"AG9","v":0}]
[]
[142,null,null,"- Opération de banque",null,null,null,null,null,null,null,null,null,null,null,null,null,null,null,null,null,null,null,null,null,null,null,null,0.1,null,null,null,{"$f":"+DED!E133","v":0},null,null,null,null,null,null,null,null,null,null,null,null,null,null,{"$f":"AG11","v":0}]
[]
[143,null,null,"- Hôtels de voyageurs, et ensemble immobilier à destination"]
[null,null,null,"touristique",null,null,null,null,null,null,null,null,null,null,null,null,null,null,null,null,null,null,null,null,null,null,null,null,0.1,null,null,null,null,null,null,null,null,null,null,null,null,null,null,null,null,null,null,{"$f":"AG14","v":0}]
[]
{"$rows_left_out":100}
{"sheet":"IF_ICE","index":4,"n_rows":4,"n_cols":3,"rows_kept":4,"cut":false,"hidden":false,"merged":[]}
["LIBELLE FOURNISSEUR","IF","ICE"]
[]
["MAROC TELECOM",3332162,"001522585000066"]
["MARSA MAROC","1104763","000028283000040"]

{"sheet":"ANAL","index":5,"n_rows":29,"n_cols":11,"rows_kept":29,"cut":false,"hidden":true,"merged":[]}
["Date fre","Numéro fre","CLIENTS","MT HT","TAUX","TVA","TTC","Mode de règlement","Date de règl"]
["2013-07-24","153-13","PHARMACIE SIJILMASSA",{"$f":"+G2/1.2","v":-1416.9000000000005},0.2,-283.38000000000011,{"$f":"+F2*6","v":-1700.2800000000007},"ANALYSES",null,{"$f":"+G2/6","v":-283.38000000000011},{"$f":"+F2-J2","v":0}]
["2013-07-24","154-13","PHARMACIE SID ELGHAZI",-425.09999999999991,0.2,-85.019999999999982,-510.11999999999989,"ANALYSES",null,-85.019999999999982,0]
["2013-07-24","155-13","PHARMACIE HAY JBALA",-455.44999999999959,0.2,-91.089999999999918,-546.53999999999951,"ANALYSES",null,-91.089999999999918,0]
["2013-09-30","174-13","PHARMACIE IBN SINA",-1807.1499999999969,0.2,-361.42999999999938,-2168.5799999999963,"ANALYSES",null,-361.42999999999938,0]
["2013-09-30","171-13","PHARMACIE 20 AOUT",-247.5,0.2,-49.5,-297,"ANALYSES",null,-49.5,0]
["2013-10-31","181-13","PHARMACIE PRINCIPALE",33483.350000000006,0.2,6696.67,40180.020000000004,"ANALYSES",null,6696.670000000001,0]
["2014-06-18","PH97-14 BIS","PHCIE MIMOSA",-322.90000000000003,0.2,-64.58,-387.48,"ANALYSES",null,-64.58,0]
["2014-07-10","AV N°APH01-14","PHCIE ADRAR PH92-14",-35885.700000000004,0.2,-7177.14,-43062.840000000004,"ANALYSES",null,-7177.14,0]
["2015-01-06","PH001-15","PHCIE  ZINALABIDINE",-101.39999999999873,0.2,-20.279999999999745,-121.67999999999847,"ANALYSES",null,-20.279999999999745,0]
["2015-01-16","PH008-15","PHCIE POPILAIRE",-101.79999999999836,0.2,-20.359999999999673,-122.15999999999804,"ANALYSES",null,-20.359999999999673,0]
["2015-06-02","PH098-15","PHCIE MOUADAFINE",3828.7499999999986,0.2,765.74999999999966,4594.4999999999982,"ANALYSES",null,765.74999999999966,0]
["2016-01-22","FC-USI160100020","PHCIE MENTAGA",-3517.3500000000008,0.2,-703.47000000000014,-4220.8200000000006,"ANALYSES",null,-703.47000000000014,0]
["2014-02-28","194-14","PHCIE AIT DAOUD TROP VERSE",-19166.650000000001,0.2,-3833.33,-22999.98,"ANALYSES",null,-3833.33,0]
["2014-03-12","PH47-14","PHCIE OULED HAMDANE",17.100000000000001,0.2,3.42,20.52,"ANALYSES",null,3.42,0]
{"$rows_left_out":15}
{"sheet":"4415","index":6,"n_rows":34,"n_cols":4,"rows_kept":34,"cut":false,"hidden":true,"merged":[]}
["DATE","LIBELLE","MONTANT","OBSERVATION"]
["2017-06-01","RGL EFF5375285 / ELECTROVENT",402992.29,"OK"]
["2017-06-01","RGL EFF5375265 / BOUGLASS BOIS",35820,"OK"]
["2017-06-01","RGL EFF5375262 / LITHO TYPO",20204.16,"OK"]
["2017-06-02","RGL EFF5375263 / PACKAGING INDUSTRI",31823.3,"OK"]
["2017-06-05","RGL EFF5375287 / BUREAU MODERNE",163402.20000000001,"NR + FOUR BUREAU"]
["2017-06-05","RGL EFF5847588 / SOBIM",12600,"OK"]
["2017-06-06","RGL EFF5375252 / SMIC",39648,"OK"]
["2017-06-07","RGL EFF5375288 / AC IMPRESSION",265177.42,"OK"]
["2017-06-07","RGL EFF5375273 / PROCESS",22472.13,"OK"]
["2017-06-07","RGL EFF5375264 / SOFRADIS",11232,"OK"]
["2017-06-08","RGL EFF5375278 / FORTRADE",113901.5,"OK"]
["2017-06-08","RGL EFF5375292 / TOBI CONSULTING",97370,"OK"]
["2017-06-08","RGL EFF5375290 / REMAP TRANS",18000,"OK"]
["2017-06-08","RGL EFF5375255 / KEDEX",12840,"OK"]
{"$rows_left_out":20}
{"sheet":"JC","index":7,"n_rows":19,"n_cols":4,"rows_kept":19,"cut":false,"hidden":true,"merged":[]}
[null,null,"DEBIT","CREDIT"]
[34552000,"TVA / CH 20%",null,{"$f":"+DED!E132+DED!E135+DED!E136","v":0}]
[34552600,"TVA / CH 10%",null,{"$f":"+DED!E133+DED!E134","v":0}]
[34552140,"TVA / CH 14%",null,{"$f":"+DED!E138+DED!E139","v":0}]
[34552700,"TVA / CH 07%",null,{"$f":"+DED!E141","v":0}]
[34552200,"TVA IMPORT",null,{"$f":"+DED!E137+DED!E140","v":0}]
[34551000,"TVA IMMO",null,{"$f":"+DED!E142","v":0}]
[34560000,"CREDIT PRECEDENT",null,{"$f":"+DED!E145","v":0}]
[44550000,"TVA F20%",{"$f":"+#REF!","v":{"$error":"#REF!"}}]
[44552700,"TVA F07%",{"$f":"+#REF!","v":{"$error":"#REF!"}}]
[44552800,"TVA F SCE ETRANGER",{"$f":"+#REF!","v":{"$error":"#REF!"}}]
[34552800,"TVA R SCE ETRANGER",null,{"$f":"+C11","v":{"$error":"#REF!"}}]
[44558100,"TVA ECHANTILLONS 07%",{"$f":"+#REF!","v":{"$error":"#REF!"}}]
[44558000,"TVA ECHANTILLONS 20%",{"$f":"+#REF!","v":{"$error":"#REF!"}}]
[34560000,"CREDIT DE LA PERIODE",{"$f":"IF(D19>C19,D19-C19,0)","v":{"$error":"#REF!"}}]
{"$rows_left_out":4}